{"text_format":"1","workbook":"xlsx","n_sheets":6,"sheets":["Lookup","Directions","Lists","working list","Database","Dropdowns"],"not_rendered":{"charts":0,"images":0,"macros":1,"external_links":0,"defined_names":0,"comments":0,"pivot_tables":0},"unopened":[],"bounds":{"document_bytes":16777216,"sheet_cells":100000,"rows_first":2000,"rows_last":500,"rows_between":2000,"halvings":0,"cell_chars":16384,"cell_head_chars":4096},"cells_cut":0,"cells_raw":0,"read":"whole","date_system":"1900"}

{"sheet":"Lookup","index":0,"n_rows":13,"n_cols":8,"rows_kept":13,"cut":false,"hidden":true,"merged":[[12,5,14,8],[1,6,1,7]]}
["Spanish Verb Conjugation Practice Tool"]
[null,"Infinitive","ser",null,null,"List to Use","Language Lords 50"]
[null,"Indicative","Present",null,null,"Use Top",200,"enter number between 1 and 200"]
[null,"Translation",null,null,null,{"$f":"IF(LEFT(G2,14)=\"Language Lords\",\"LL Descr:\",\"\")","v":"LL Descr:"},{"$f":"IF(LEFT(G2,14)=\"Language Lords\",VLOOKUP(C2,Lists!$F$3:$I$52,4,FALSE),\"\")","v":"Common Irregular"}]
[null,"Yo",null,null,null,"Verb No."]
[null,"Tú"]
[null,"Él/Ella/Usted"]
[null,"Nosotros"]
[null,"Ellos/Ustedes",null,null,null,"No. Correct:",0,"decir"]
[null,"Gerund",null,null,null,"No. Incorrect:",3]
[null,"Past Participle"]
[null,null,null,null,null,"References"]
[null,null,null,null,null,"https://www.ghidinelli.com/free-spanish-conjugated-verb-database\nLinguasorb top 250 verbs\nLanguage Lords YouTube video: https://www.youtube.com/watch?v=z8FACVD9vz4\n"]

{"sheet":"Directions","index":1,"n_rows":18,"n_cols":2,"rows_kept":18,"cut":false,"hidden":false,"merged":[[2,1,17,6]]}
[]
[null,"Directions"]
["•","The cells with borders are meant to be edited.\nSet your mood, tense, source list, and number of available verbs (if using Most Common Verbs list).\nNow push the \"Get Verb\" button to get a random verb to conjugate from your list.\nType your guesses/entries for the conjugations in the boxes. Accent marks will be ignored.\nFinally, click \"Check/Show Answers\" to see the answers and see how many you got right.\nIf you want to work through the list in order, type 1 into the Verb No. input, and then click \"Lookup From List\". After typing and checking the answers, use \"Get Next From List\".\nTip: to turn off autocomplete to make this sheet much nicer to use, click File, Excel Options, Advanced, and uncheck Enable Autocomplete for Cell Values.\nBonus: the macros are also mapped to shortcut keys. Ctrl+Shift+C will run \"Check/Show Answers.\" Ctrl+Shift+J will run \"Get Random Verb.\" Ctrl+Shift+N will run \"Get Next From List.\""]
["•"]
[]
["•"]
[]
["•"]
[]
["•"]
[]
["•"]
[]
[]
["•"]
[]
[]
["•"]

{"sheet":"Lists","index":2,"n_rows":202,"n_cols":16,"rows_kept":202,"cut":false,"hidden":true,"merged":[]}
["Top 250 verbs - Linguasorb",null,null,null,"LAB 50 Inspired by LL 50",null,"https://www.youtube.com/watch?v=z8FACVD9vz4",null,null,null,"LAB additions"]
["Number","Infinitive","Translation",null,"Number","Infinitive","Rank","Translation","Description",null,"Number","Infinitive","Rank","Translation"]
[1,"ser","to be (essential/permanent quality)",null,1,"pasar",{"$f":"INDEX($A$3:$A$202,MATCH(F3,$B$3:$B$202,0))","v":14},{"$f":"INDEX($C$3:$C$202,MATCH(F3,$B$3:$B$202,0))","v":"to pass, to spend (time), to happen"},"Regular-AR",null,1,"grabar",{"$f":"INDEX($A$3:$A$202,MATCH(L3,$B$3:$B$202,0))","v":{"$error":"#N/A"}},"to record"]
[2,"haber","to have (to do something, auxiliary verb)",null,2,"hablar",20,"to speak","Regular-AR",null,2,"llorar",{"$error":"#N/A"},"to cry/mourn"]
[3,"estar","to be (health, location, state)",null,3,"llevar",21,"to carry, bring","Regular-AR",null,3,"mandar",139,{"$f":"INDEX($C$3:$C$202,MATCH(L5,$B$3:$B$202,0))","v":"to order (give an order), to send"}]
[4,"tener","to have",null,4,"dejar",22,"to leave, abandon, to let, allow","Regular-AR",null,4,"acabar",67,{"$f":"INDEX($C$3:$C$202,MATCH(L6,$B$3:$B$202,0))","v":"to finish, end"}]
[5,"hacer","to do, make",null,5,"deber",15,"to owe, must, should, ought to","Regular-ER",null,5,"apagar",{"$error":"#N/A"},"to turn off"]
[6,"poder","to be able, can",null,6,"leer",60,"to read","Regular-ER",null,6,"poner",16,{"$f":"INDEX($C$3:$C$202,MATCH(L8,$B$3:$B$202,0))","v":"to put, place, set"}]
[7,"decir","to say, tell",null,7,"comer",103,"to eat","Regular-ER"]
[8,"ir","to go",null,8,"aprender",111,"to learn","Regular-ER"]
[9,"ver","to see",null,9,"vivir",32,"to live","Regular-IR",null,"Added to database",null,null,"Removed from top 250 since not in database"]
[10,"dar","to give",null,10,"escribir",42,"to write","Regular-IR",null,"haber",null,null,"existir",null,"removed to make even 200"]
[11,"saber","to know (information)",null,11,"permitir",51,"to permit, allow","Regular-IR",null,"cambiar",null,null,"considerar",null,"exponer"]
[12,"querer","to want, love",null,12,"abrir",65,"to open","Regular-IR",null,"pretender",null,null,"partir",null,"durar"]
[13,"llegar","to arrive, come, reach",null,13,"buscar",39,"to search for, look for","Irregular-AR",null,null,null,null,"referir",null,"permanecer"]
[14,"pasar","to pass, to spend (time), to happen",null,14,"llegar",13,"to arrive, come, reach","Irregular-AR",null,null,null,null,"imaginar",null,"asistir"]
[15,"deber","to owe, must, should, ought to",null,15,"alcanzar",83,"to reach, catch up","Irregular-AR",null,"removed verbs from database",null,null,"reunir",null,"organizar"]
[16,"poner","to put, place, set",null,16,"parecer",17,"to seem, appear","Irregular-ER",null,"   that werent on either list",null,null,"representar",null,"contener"]
[17,"parecer","to seem, appear",null,17,"conocer",31,"to know (people, places)","Irregular-ER",null,null,null,null,"asegurar",null,"informar"]
[18,"quedar","to stay, remain",null,18,"creer",19,"to believe","Irregular-ER",null,null,null,null,"corresponder",null,"enviar"]
[19,"creer","to believe",null,19,"producir",44,"to produce","Irregular-IR",null,null,null,null,"adquirir",null,"extender"]
[20,"hablar","to speak",null,20,"dirigir",85,"to direct","Irregular-IR",null,null,null,null,"aprovechar",null,"conducir"]
[21,"llevar","to carry, bring",null,21,"exigir",164,"to demand, require","Irregular-IR",null,null,null,null,"imponer",null,"firmar"]
[22,"dejar","to leave, abandon, to let, allow",null,22,"pensar",27,"to think","Stem Change-AR",null,null,null,null,"disponer",null,"respetar"]
[23,"seguir","to follow, continue",null,23,"empezar",37,"to begin, start","Stem Change-AR",null,null,null,null,"quitar",null,"advertir"]
[24,"encontrar","to find, encounter",null,24,"encontrar",24,"to find, encounter","Stem Change-AR",null,null,null,null,"tender",null,"cruzar"]
[25,"llamar","to call, to name",null,25,"recordar",49,"to remember, remind","Stem Change-AR",null,null,null,null,"comentar",null,"anunciar"]
[26,"venir","to come",null,26,"jugar",91,"to play (a game or sport)","Stem Change-AR",null,null,null,null,"impedir"]
[27,"pensar","to think",null,27,"querer",12,"to want, love","Stem Change-ER",null,null,null,null,"escapar"]
[28,"salir","to leave, go out",null,28,"perder",43,"to lose","Stem Change-ER",null,null,null,null,"preocupar"]
[29,"volver","to return, go back",null,29,"entender",46,"to understand","Stem Change-ER",null,null,null,null,"prestar"]
[30,"tomar","to take, drink",null,30,"poder",6,"to be able, can","Stem Change-ER",null,null,null,null,"separar"]
[31,"conocer","to know (people, places)",null,31,"volver",29,"to return, go back","Stem Change-ER",null,null,null,null,"contemplar"]
[32,"vivir","to live",null,32,"seguir",23,"to follow, continue","Stem Change-IR",null,null,null,null,"recorrer"]
[33,"sentir","to feel, regret",null,33,"pedir",{"$f":"INDEX($A$3:$A$202,MATCH(F35,$B$3:$B$202,0))","v":47},{"$f":"INDEX($C$3:$C$202,MATCH(F35,$B$3:$B$202,0))","v":"to request, ask for"},"Stem Change-IR",null,null,null,null,"retirar"]
[34,"tratar","to treat, handle",null,34,"conseguir",53,"to get, obtain","Stem Change-IR",null,null,null,null,"intervenir"]
[35,"mirar","to watch, look at",null,35,"sentir",33,"to feel, regret","Stem Change-IR",null,null,null,null,"comprobar"]
[36,"contar","to count, relate, tell",null,36,"morir",72,"to die","Stem Change-IR",null,null,null,null,"discutir"]
[37,"empezar","to begin, start",null,37,"ser",1,"to be (essential/permanent quality)","Common Irregular",null,null,null,null,"enfrentar"]
[38,"esperar","to wait for, to hope",null,38,"haber",2,"to have (to do something, auxiliary verb)","Common Irregular",null,null,null,null,"sostener"]
[39,"buscar","to search for, look for",null,39,"estar",3,"to be (health, location, state)","Common Irregular",null,null,null,null,"transformar"]
[40,"entrar","to enter, go in, come in",null,40,"tener",4,"to have","Common Irregular",null,null,null,null,"bastar"]
[41,"trabajar","to work",null,41,"hacer",5,"to do, make","Common Irregular",null,null,null,null,"mencionar"]
[42,"escribir","to write",null,42,"decir",7,"to say, tell","Common Irregular",null,null,null,null,"plantear"]
[43,"perder","to lose",null,43,"ir",8,"to go","Common Irregular",null,null,null,null,"ocupar"]
[44,"producir","to produce",null,44,"ver",9,"to see","Common Irregular",null,null,null,null,"observar"]
[45,"ocurrir","to occur, happen",null,45,"dar",10,"to give","Common Irregular"]
[46,"entender","to understand",null,46,"saber",11,"to know (information)","Common Irregular"]
[47,"pedir","to request, ask for",null,47,"poner",16,"to put, place, set","Common Irregular"]
[48,"recibir","to receive, to welcome, greet",null,48,"venir",26,"to come","Common Irregular"]
[49,"recordar","to remember, remind",null,49,"salir",28,"to leave, go out","Common Irregular"]
[50,"terminar","to finish, end",null,50,"traer",71,"to bring, to get, fetch, to carry","Common Irregular"]
[51,"permitir","to permit, allow"]
[52,"aparecer","to appear, show up"]
[53,"conseguir","to get, obtain",null,null,null,{"$f":"COUNTIF(G3:G52,\">100\")","v":3},"not on top 100"]
[54,"comenzar","to begin, start, commence",null,null,null,{"$f":"COUNTIF(G3:G52,\"<=50\")","v":38},"top 50"]
[55,"servir","to serve",null,null,null,{"$f":"COUNTIFS(G3:G52,\">50\",G3:G52,\"<=100\")","v":9},"bottom 50"]
[56,"sacar","to take out, stick out"]
[57,"necesitar","to need, require"]
[58,"mantener","to maintain, get"]
[59,"resultar","to turn out (to be)"]
[60,"leer","to read"]
[61,"caer","to fall"]
[62,"cambiar","to change"]
[63,"presentar","to introduce"]
[64,"crear","to create, to make"]
[65,"abrir","to open"]
[66,"oír","to hear"]
[67,"acabar","to finish, end"]
[68,"convertir","to convert, change"]
[69,"ganar","to win, gain, earn, get, acquire"]
[70,"formar","to form, shape, fashion, make"]
[71,"traer","to bring, to get, fetch, to carry"]
[72,"morir","to die"]
[73,"aceptar","to accept, approve, to agree to"]
[74,"realizar","to achieve, attain, accomplish"]
[75,"suponer","to suppose"]
[76,"comprender","to understand, comprehend"]
[77,"lograr","to get, obtain, to achieve, attain"]
[78,"explicar","to explain"]
[79,"preguntar","to ask, inquire"]
[80,"tocar","to touch, to play (an instrument)"]
[81,"reconocer","to recognize"]
[82,"estudiar","to study"]
[83,"alcanzar","to reach, catch up"]
[84,"nacer","to be born"]
[85,"dirigir","to direct"]
[86,"correr","to run"]
[87,"utilizar","to use, utilize"]
[88,"pagar","to pay, pay for"]
[89,"ayudar","to help"]
[90,"gustar","to please, be pleasing"]
[91,"jugar","to play (a game or sport)"]
[92,"escuchar","to listen, hear"]
[93,"cumplir","to fulfil, carry out"]
[94,"ofrecer","to offer"]
[95,"descubrir","to discover"]
[96,"levantar","to raise, to lift"]
[97,"intentar","to try, attempt"]
[98,"usar","to use"]
[99,"decidir","to decide, settle, resolve"]
[100,"repetir","to repeat"]
[101,"olvidar","to forget"]
[102,"valer","to be worth"]
[103,"comer","to eat"]
[104,"mostrar","to show"]
[105,"mover","to move"]
[106,"continuar","to continue"]
[107,"suceder","to happen, to succeed, follow"]
[108,"fijar","to fix, fasten, secure"]
[109,"acercar","to bring near"]
[110,"dedicar","to dedicate"]
[111,"aprender","to learn"]
[112,"comprar","to buy, purchase"]
[113,"subir","to go up, rise, move up, climb, raise up"]
[114,"evitar","to avoid, to prevent"]
[115,"interesar","to interest, be of interest (to)"]
[116,"cerrar","to close, shut"]
[117,"echar","to throw, cast, fling"]
[118,"responder","to respond, answer, reply to"]
[119,"sufrir","to suffer, to undergo, experience"]
[120,"importar","to import, to be important"]
[121,"obtener","to obtain, get"]
[122,"indicar","to indicate"]
[123,"soler","to be accustomed to"]
[124,"detener","to stop, to hold up, delay, to arrest, detain"]
[125,"desarrollar","to develop, expand, to unroll, unwind, to unfold"]
[126,"señalar","to point out, indicate, to signal"]
[127,"elegir","to elect, choose"]
[128,"preparar","to prepare, get (something) ready"]
[129,"proponer","to propose"]
[130,"demostrar","to demonstrate, show"]
[131,"significar","to signify, mean"]
[132,"faltar","to lack, be lacking, be missing"]
[133,"acompañar","to accompany"]
[134,"desear","to desire, want, wish"]
[135,"enseñar","to teach, instruct, train, educate"]
[136,"construir","to build, construct"]
[137,"vender","to sell"]
[138,"desaparecer","to disappear"]
[139,"mandar","to order (give an order), to send"]
[140,"andar","to walk"]
[141,"preferir","to prefer"]
[142,"crecer","to grow (up)"]
[143,"surgir","to arise, emerge, spring up, come out"]
[144,"matar","to kill, slaughter"]
[145,"entregar","to deliver, hand over"]
[146,"colocar","to locate, place"]
[147,"establecer","to establish"]
[148,"guardar","to guard, protect, to keep"]
[149,"iniciar","to initiate, begin, start"]
[150,"bajar","to lower, go down, descend, download"]
[151,"notar","to note, notice, observe"]
[152,"meter","to put (in), place, insert"]
[153,"actuar","to act, perform, operate"]
[154,"pretender","to attempt"]
[155,"acordar","to decide, resolve, agree (on)"]
[156,"cortar","to cut"]
[157,"romper","to break"]
[158,"lanzar","to throw, hurl, cast, fling"]
[159,"apoyar","to support, hold up, to back"]
[160,"negar","to deny, refuse"]
[161,"avanzar","to advance, move forward"]
[162,"resolver","to solve, to resolve, to settle (a debt, matter)"]
[163,"costar","to cost"]
[164,"exigir","to demand, require"]
[165,"aumentar","to increase, add to, rise"]
[166,"recoger","to pick up"]
[167,"abandonar","to abandon, leave behind, desert, to quit, give up"]
[168,"obligar","to oblige"]
[169,"aplicar","to apply"]
[170,"pertenecer","to belong, pertain"]
[171,"expresar","to express, voice, state"]
[172,"provocar","to provoke"]
[173,"defender","to defend"]
[174,"conservar","to preserve, conserve, to keep, retain"]
[175,"depender","to depend"]
[176,"marcar","to mark, stamp, to show, indicate"]
[177,"compartir","to share, to divide (up)"]
[178,"consistir","to consist"]
[179,"constituir","to constitute"]
[180,"cubrir","to cover"]
[181,"funcionar","to function, to run"]
[182,"caber","to fit (in something)"]
[183,"atender","to attend to, pay attention to"]
[184,"insistir","to insist"]
[185,"sentar","to seat, sit (someone down)"]
[186,"merecer","to deserve, merit"]
[187,"incluir","to include"]
[188,"despertar","to awaken (somebody), wake up (somebody)"]
[189,"publicar","to publish"]
[190,"cargar","to load, load up, to charge"]
[191,"participar","to participate, to share in, to inform"]
[192,"salvar","to save, rescue, to except, exclude"]
[193,"tirar","to throw, to shoot, to throw away, to pull"]
[194,"contestar","to answer"]
[195,"pesar","to weigh, to weigh down"]
[196,"viajar","to travel, journey"]
[197,"regresar","to return, go back"]
[198,"visitar","to visit"]
[199,"cuidar","to take care of, look after"]
[200,"dormir","to sleep"]

{"sheet":"working list","index":3,"n_rows":202,"n_cols":20,"rows_kept":202,"cut":false,"hidden":true,"merged":[]}
["Top 250 verbs - Linguasorb",null,null,null,"Language Lords 50 and I added top 50 to list that werent in it",null,null,null,null,null,null,null,null,null,"Resulting List of 50"]
["Number","Infinitive","Translation",null,"Number","Infinitive","Rank","Translation","Description","Descr2","e to ie",null,null,null,"Number","Infinitive","Rank","Translation","Description","Descr2"]
[1,"ser","to be (essential/permanent quality)",{"$f":"IF(RIGHT(B3,2)=\"ir\",\"Y\",\"\")","v":""},1,"ser",{"$f":"INDEX($A$3:$A$202,MATCH(F3,$B$3:$B$202,0))","v":1},{"$f":"INDEX($C$3:$C$202,MATCH(F3,$B$3:$B$202,0))","v":"to be (essential/permanent quality)"},"Common Irregular",null,"o to ue",null,null,null,1,"pasar",{"$f":"INDEX($A$3:$A$202,MATCH(P3,$B$3:$B$202,0))","v":14},{"$f":"INDEX($C$3:$C$202,MATCH(P3,$B$3:$B$202,0))","v":"to pass, to spend (time), to happen"},"Regular-AR"]
[2,"haber","to have (to do something, auxiliary verb)",{"$f":"IF(RIGHT(B4,2)=\"ir\",\"Y\",\"\")","v":""},19,"haber",2,"to have (to do something, auxiliary verb)","Common Irregular",null,"e to i",null,null,null,2,"hablar",20,"to speak","Regular-AR"]
[3,"estar","to be (health, location, state)","",2,"estar",3,"to be (health, location, state)","Common Irregular",null,"u to ue",null,null,null,3,"llevar",21,"to carry, bring","Regular-AR"]
[4,"tener","to have","",3,"tener",4,"to have","Common Irregular",null,"I to ie",null,null,null,4,"dejar",22,"to leave, abandon, to let, allow","Regular-AR"]
[5,"hacer","to do, make","",4,"hacer",5,"to do, make","Common Irregular",null,null,null,null,null,5,"deber",15,"to owe, must, should, ought to","Regular-ER"]
[6,"poder","to be able, can","",51,"decir",7,"to say, tell","Common Irregular",null,null,null,null,null,6,"leer",60,"to read","Regular-ER"]
[7,"decir","to say, tell","Y",5,"ir",8,"to go","Common Irregular",null,null,null,null,null,7,"comer",103,"to eat","Regular-ER"]
[8,"ir","to go","Y",6,"ver",9,"to see","Common Irregular",null,null,null,null,null,8,"aprender",111,"to learn","Regular-ER"]
[9,"ver","to see","",8,"dar",10,"to give","Common Irregular",null,null,null,null,null,9,"vivir",32,"to live","Regular-IR"]
[10,"dar","to give","",9,"saber",11,"to know (information)","Common Irregular",null,null,null,null,null,10,"escribir",42,"to write","Regular-IR"]
[11,"saber","to know (information)","",10,"poner",16,"to put, place, set","Common Irregular",null,null,null,null,null,11,"permitir",51,"to permit, allow","Regular-IR"]
[12,"querer","to want, love","",17,"venir",26,"to come","Common Irregular",null,null,null,null,null,12,"abrir",65,"to open","Regular-IR"]
[13,"llegar","to arrive, come, reach","",20,"salir",28,"to leave, go out","Common Irregular",null,null,null,null,null,13,"buscar",39,"to search for, look for","Irregular-AR","c to que"]
[14,"pasar","to pass, to spend (time), to happen","",15,"caer",61,"to fall","Common Irregular",null,null,null,null,null,14,"llegar",13,"to arrive, come, reach","Irregular-AR","g to gu"]
[15,"deber","to owe, must, should, ought to","",16,"oír",66,"to hear","Common Irregular",null,"common irregular",14,"13-16",null,15,"alcanzar",83,"to reach, catch up","Irregular-AR","z to c"]
[16,"poner","to put, place, set","",18,"traer",71,"to bring, to get, fetch, to carry","Common Irregular",null,"regulars",12,null,null,16,"parecer",17,"to seem, appear","Irregular-ER","c to zc"]
[17,"parecer","to seem, appear","",68,"ocurrir",45,"to occur, happen","defective",null,"irregulars",9,null,null,17,"conocer",31,"to know (people, places)","Irregular-ER","c to zc"]
[18,"quedar","to stay, remain","",47,"doler",{"$error":"#N/A"},{"$error":"#N/A"},"defective",null,"stem changes",15,null,null,18,"creer",19,"to believe","Irregular-ER","y add"]
[19,"creer","to believe","",35,"buscar",39,"to search for, look for","Irregular-AR","c to que","total",{"$f":"SUM(L17:L20)","v":50},null,null,19,"producir",44,"to produce","Irregular-IR","c to j"]
[20,"hablar","to speak","",34,"llegar",13,"to arrive, come, reach","Irregular-AR","g to gu",null,null,null,null,20,"dirigir",85,"to direct","Irregular-IR","g to j"]
[21,"llevar","to carry, bring","",33,"alcanzar",83,"to reach, catch up","Irregular-AR","z to c",null,null,null,null,21,"exigir",164,"to demand, require","Irregular-IR","g to j"]
[22,"dejar","to leave, abandon, to let, allow","",36,"parecer",17,"to seem, appear","Irregular-ER","c to zc",null,null,null,null,22,"pensar",27,"to think","Stem Change-AR","e to ie"]
[23,"seguir","to follow, continue","Y",37,"conocer",31,"to know (people, places)","Irregular-ER","c to zc",null,null,null,null,23,"empezar",37,"to begin, start","Stem Change-AR","e to ie"]
[24,"encontrar","to find, encounter","",54,"creer",19,"to believe","Irregular-ER","y add",null,null,null,null,24,"encontrar",24,"to find, encounter","Stem Change-AR","o to ue"]
[25,"llamar","to call, to name","",67,"producir",44,"to produce","Irregular-IR","c to j",null,null,null,null,25,"recordar",49,"to remember, remind","Stem Change-AR","o to ue"]
[26,"venir","to come","Y",39,"dirigir",85,"to direct","Irregular-IR","g to j",null,null,null,null,26,"jugar",91,"to play (a game or sport)","Stem Change-AR","u to ue"]
[27,"pensar","to think","",40,"construir",136,"to build, construct","Irregular-IR",null,null,null,null,null,27,"querer",12,"to want, love","Stem Change-ER","e to ie"]
[28,"salir","to leave, go out","Y",41,"exigir",164,"to demand, require","Irregular-IR",null,null,null,null,null,28,"perder",43,"to lose","Stem Change-ER","e to ie"]
[29,"volver","to return, go back","",52,"pasar",14,"to pass, to spend (time), to happen","Regular-AR",null,null,null,null,null,29,"entender",46,"to understand","Stem Change-ER","e to ie"]
[30,"tomar","to take, drink","",53,"quedar",18,"to stay, remain","Regular-AR",null,null,null,null,null,30,"poder",6,"to be able, can","Stem Change-ER","o to ue"]
[31,"conocer","to know (people, places)","",21,"hablar",20,"to speak","Regular-AR",null,null,null,null,null,31,"volver",29,"to return, go back","Stem Change-ER","o to ue"]
[32,"vivir","to live","Y",55,"llevar",21,"to carry, bring","Regular-AR",null,null,null,null,null,32,"seguir",23,"to follow, continue","Stem Change-IR","e to i"]
[33,"sentir","to feel, regret","Y",56,"dejar",{"$f":"INDEX($A$3:$A$202,MATCH(F35,$B$3:$B$202,0))","v":22},{"$f":"INDEX($C$3:$C$202,MATCH(F35,$B$3:$B$202,0))","v":"to leave, abandon, to let, allow"},"Regular-AR",null,null,null,null,null,33,"pedir",{"$f":"INDEX($A$3:$A$202,MATCH(P35,$B$3:$B$202,0))","v":47},{"$f":"INDEX($C$3:$C$202,MATCH(P35,$B$3:$B$202,0))","v":"to request, ask for"},"Stem Change-IR","e to i"]
[34,"tratar","to treat, handle","",58,"llamar",25,"to call, to name","Regular-AR",null,null,null,null,null,34,"conseguir",53,"to get, obtain","Stem Change-IR","e to i"]
[35,"mirar","to watch, look at","",59,"tomar",30,"to take, drink","Regular-AR",null,null,null,null,null,35,"sentir",33,"to feel, regret","Stem Change-IR","e to ie"]
[36,"contar","to count, relate, tell","",60,"tratar",34,"to treat, handle","Regular-AR",null,null,null,null,null,36,"morir",72,"to die","Stem Change-IR","o to ue"]
[37,"empezar","to begin, start","",22,"mirar",35,"to watch, look at","Regular-AR",null,null,null,null,null,37,"ser",1,"to be (essential/permanent quality)","Common Irregular"]
[38,"esperar","to wait for, to hope","",62,"esperar",38,"to wait for, to hope","Regular-AR",null,null,null,null,null,38,"haber",2,"to have (to do something, auxiliary verb)","Common Irregular"]
[39,"buscar","to search for, look for","",63,"entrar",40,"to enter, go in, come in","Regular-AR",null,null,null,null,null,39,"estar",3,"to be (health, location, state)","Common Irregular"]
[40,"entrar","to enter, go in, come in","",64,"trabajar",41,"to work","Regular-AR",null,null,null,null,null,40,"tener",4,"to have","Common Irregular"]
[41,"trabajar","to work","",70,"terminar",50,"to finish, end","Regular-AR",null,null,null,null,null,41,"hacer",5,"to do, make","Common Irregular"]
[42,"escribir","to write","Y",24,"ayudar",89,"to help","Regular-AR",null,null,null,null,null,42,"decir",7,"to say, tell","Common Irregular"]
[43,"perder","to lose","",23,"escuchar",92,"to listen, hear","Regular-AR",null,null,null,null,null,43,"ir",8,"to go","Common Irregular"]
[44,"producir","to produce","Y",27,"deber",15,"to owe, must, should, ought to","Regular-ER",null,null,null,null,null,44,"ver",9,"to see","Common Irregular"]
[45,"ocurrir","to occur, happen","Y",28,"leer",60,"to read","Regular-ER",null,null,null,null,null,45,"dar",10,"to give","Common Irregular"]
[46,"entender","to understand","",25,"comer",103,"to eat","Regular-ER",null,null,null,null,null,46,"saber",11,"to know (information)","Common Irregular"]
[47,"pedir","to request, ask for","Y",26,"aprender",111,"to learn","Regular-ER",null,null,null,null,null,47,"poner",16,"to put, place, set","Common Irregular"]
[48,"recibir","to receive, to welcome, greet","Y",29,"vivir",32,"to live","Regular-IR",null,null,null,null,null,48,"venir",26,"to come","Common Irregular"]
[49,"recordar","to remember, remind","",65,"escribir",42,"to write","Regular-IR",null,null,null,null,null,49,"salir",28,"to leave, go out","Common Irregular"]
[50,"terminar","to finish, end","",31,"recibir",48,"to receive, to welcome, greet","Regular-IR",null,null,null,null,null,50,"traer",71,"to bring, to get, fetch, to carry","Common Irregular"]
[51,"permitir","to permit, allow","Y",30,"permitir",51,"to permit, allow","Regular-IR"]
[52,"aparecer","to appear, show up","",32,"abrir",65,"to open","Regular-IR"]
[53,"conseguir","to get, obtain","Y",43,"pensar",27,"to think","Stem Change-AR","e to ie"]
[54,"comenzar","to begin, start, commence","",44,"empezar",37,"to begin, start","Stem Change-AR","e to ie"]
[55,"servir","to serve","Y",57,"encontrar",24,"to find, encounter","Stem Change-AR","o to ue"]
[56,"sacar","to take out, stick out","",61,"contar",36,"to count, relate, tell","Stem Change-AR","o to ue"]
[57,"necesitar","to need, require","",69,"recordar",49,"to remember, remind","Stem Change-AR","o to ue"]
[58,"mantener","to maintain, get","",42,"jugar",91,"to play (a game or sport)","Stem Change-AR","u to ue"]
[59,"resultar","to turn out (to be)","",38,"querer",12,"to want, love","Stem Change-ER","e to ie"]
[60,"leer","to read","",66,"perder",43,"to lose","Stem Change-ER","e to ie"]
[61,"caer","to fall","",45,"entender",46,"to understand","Stem Change-ER","e to ie"]
[62,"cambiar","to change","",7,"poder",6,"to be able, can","Stem Change-ER","o to ue"]
[63,"presentar","to introduce","",46,"volver",29,"to return, go back","Stem Change-ER","o to ue"]
[64,"crear","to create, to make","",71,"mover",105,"to move","Stem Change-ER","o to ue"]
[65,"abrir","to open","Y",12,"seguir",{"$f":"INDEX($A$3:$A$202,MATCH(F67,$B$3:$B$202,0))","v":23},{"$f":"INDEX($C$3:$C$202,MATCH(F67,$B$3:$B$202,0))","v":"to follow, continue"},"Stem Change-IR","e to i"]
[66,"oír","to hear",{"$f":"IF(RIGHT(B68,2)=\"ir\",\"Y\",\"\")","v":""},11,"pedir",47,"to request, ask for","Stem Change-IR","e to i"]
[67,"acabar","to finish, end","",50,"conseguir",53,"to get, obtain","Stem Change-IR","e to i"]
[68,"convertir","to convert, change","Y",13,"servir",55,"to serve","Stem Change-IR","e to i"]
[69,"ganar","to win, gain, earn, get, acquire","",14,"elegir",127,"to elect, choose","Stem Change-IR","e to i and g to j"]
[70,"formar","to form, shape, fashion, make","",48,"sentir",33,"to feel, regret","Stem Change-IR","e to ie"]
[71,"traer","to bring, to get, fetch, to carry","",49,"morir",72,"to die","Stem Change-IR","o to ue"]
[72,"morir","to die","Y"]
[73,"aceptar","to accept, approve, to agree to",""]
[74,"realizar","to achieve, attain, accomplish",""]
[75,"suponer","to suppose",""]
[76,"comprender","to understand, comprehend",""]
[77,"lograr","to get, obtain, to achieve, attain",""]
[78,"explicar","to explain",""]
[79,"preguntar","to ask, inquire",""]
[80,"tocar","to touch, to play (an instrument)",""]
[81,"reconocer","to recognize",""]
[82,"estudiar","to study",""]
[83,"alcanzar","to reach, catch up",""]
[84,"nacer","to be born",""]
[85,"dirigir","to direct","Y"]
[86,"correr","to run",""]
[87,"utilizar","to use, utilize",""]
[88,"pagar","to pay, pay for",""]
[89,"ayudar","to help",""]
[90,"gustar","to please, be pleasing",""]
[91,"jugar","to play (a game or sport)",""]
[92,"escuchar","to listen, hear",""]
[93,"cumplir","to fulfil, carry out","Y"]
[94,"ofrecer","to offer",""]
[95,"descubrir","to discover","Y"]
[96,"levantar","to raise, to lift",""]
[97,"intentar","to try, attempt",""]
[98,"usar","to use",""]
[99,"decidir","to decide, settle, resolve","Y"]
[100,"repetir","to repeat","Y"]
[101,"olvidar","to forget",""]
[102,"valer","to be worth",""]
[103,"comer","to eat",""]
[104,"mostrar","to show",""]
[105,"mover","to move",""]
[106,"continuar","to continue",""]
[107,"suceder","to happen, to succeed, follow",""]
[108,"fijar","to fix, fasten, secure",""]
[109,"acercar","to bring near",""]
[110,"dedicar","to dedicate",""]
[111,"aprender","to learn",""]
[112,"comprar","to buy, purchase",""]
[113,"subir","to go up, rise, move up, climb, raise up","Y"]
[114,"evitar","to avoid, to prevent",""]
[115,"interesar","to interest, be of interest (to)",""]
[116,"cerrar","to close, shut",""]
[117,"echar","to throw, cast, fling",""]
[118,"responder","to respond, answer, reply to",""]
[119,"sufrir","to suffer, to undergo, experience","Y"]
[120,"importar","to import, to be important",""]
[121,"obtener","to obtain, get",""]
[122,"indicar","to indicate",""]
[123,"soler","to be accustomed to",""]
[124,"detener","to stop, to hold up, delay, to arrest, detain",""]
[125,"desarrollar","to develop, expand, to unroll, unwind, to unfold",""]
[126,"señalar","to point out, indicate, to signal",""]
[127,"elegir","to elect, choose","Y"]
[128,"preparar","to prepare, get (something) ready",""]
[129,"proponer","to propose",""]
[130,"demostrar","to demonstrate, show",{"$f":"IF(RIGHT(B132,2)=\"ir\",\"Y\",\"\")","v":""}]
[131,"significar","to signify, mean",""]
[132,"faltar","to lack, be lacking, be missing",""]
[133,"acompañar","to accompany",""]
[134,"desear","to desire, want, wish",""]
[135,"enseñar","to teach, instruct, train, educate",""]
[136,"construir","to build, construct","Y"]
[137,"vender","to sell",""]
[138,"desaparecer","to disappear",""]
[139,"mandar","to order (give an order), to send",""]
[140,"andar","to walk",""]
[141,"preferir","to prefer","Y"]
[142,"crecer","to grow (up)",""]
[143,"surgir","to arise, emerge, spring up, come out","Y"]
[144,"matar","to kill, slaughter",""]
[145,"entregar","to deliver, hand over",""]
[146,"colocar","to locate, place",""]
[147,"establecer","to establish",""]
[148,"guardar","to guard, protect, to keep",""]
[149,"iniciar","to initiate, begin, start",""]
[150,"bajar","to lower, go down, descend, download",""]
[151,"notar","to note, notice, observe",""]
[152,"meter","to put (in), place, insert",""]
[153,"actuar","to act, perform, operate",""]
[154,"pretender","to attempt",""]
[155,"acordar","to decide, resolve, agree (on)",""]
[156,"cortar","to cut",""]
[157,"romper","to break",""]
[158,"lanzar","to throw, hurl, cast, fling",""]
[159,"apoyar","to support, hold up, to back",""]
[160,"negar","to deny, refuse",""]
[161,"avanzar","to advance, move forward",""]
[162,"resolver","to solve, to resolve, to settle (a debt, matter)",""]
[163,"costar","to cost",""]
[164,"exigir","to demand, require","Y"]
[165,"aumentar","to increase, add to, rise",""]
[166,"recoger","to pick up",""]
[167,"abandonar","to abandon, leave behind, desert, to quit, give up",""]
[168,"obligar","to oblige",""]
[169,"aplicar","to apply",""]
[170,"pertenecer","to belong, pertain",""]
[171,"expresar","to express, voice, state",""]
[172,"provocar","to provoke",""]
[173,"defender","to defend",""]
[174,"conservar","to preserve, conserve, to keep, retain",""]
[175,"depender","to depend",""]
[176,"marcar","to mark, stamp, to show, indicate",""]
[177,"compartir","to share, to divide (up)","Y"]
[178,"consistir","to consist","Y"]
[179,"constituir","to constitute","Y"]
[180,"cubrir","to cover","Y"]
[181,"funcionar","to function, to run",""]
[182,"caber","to fit (in something)",""]
[183,"atender","to attend to, pay attention to",""]
[184,"insistir","to insist","Y"]
[185,"sentar","to seat, sit (someone down)",""]
[186,"merecer","to deserve, merit",""]
[187,"incluir","to include","Y"]
[188,"despertar","to awaken (somebody), wake up (somebody)",""]
[189,"publicar","to publish",""]
[190,"cargar","to load, load up, to charge",""]
[191,"participar","to participate, to share in, to inform",""]
[192,"salvar","to save, rescue, to except, exclude",""]
[193,"tirar","to throw, to shoot, to throw away, to pull",""]
[194,"contestar","to answer",{"$f":"IF(RIGHT(B196,2)=\"ir\",\"Y\",\"\")","v":""}]
[195,"pesar","to weigh, to weigh down",""]
[196,"viajar","to travel, journey",""]
[197,"regresar","to return, go back",""]
[198,"visitar","to visit",""]
[199,"cuidar","to take care of, look after",""]
[200,"dormir","to sleep","Y"]

{"sheet":"Database","index":4,"n_rows":3575,"n_cols":17,"rows_kept":3575,"cut":false,"hidden":true,"merged":[]}
["infinitive","infinitive_english","mood","mood_english","tense","tense_english","verb_english","form_1s","form_2s","form_3s","form_1p","form_2p","form_3p","gerund","gerund_english","pastparticiple","pastparticiple_english"]
["abandonar","to abandon, leave behind, desert; to quit, give up","Imperativo Afirmativo","Imperative Affirmative","Presente","Present","Abandon! Don't abandon!",null,"abandona","abandonad",null,"abandone","abandonen","abandonando","abandoning","abandonado","abandoned"]
["abandonar","to abandon, leave behind, desert; to quit, give up","Imperativo Negativo","Imperative Negative","Presente","Present","Abandon! Don't abandon!",null,"no abandones","no abandonéis",null,"no abandone","no abandonen","abandonando","abandoning","abandonado","abandoned"]
["abandonar","to abandon, leave behind, desert; to quit, give up","Indicativo","Indicative","Presente","Present","I abandon, am abandoning","abandono","abandonas","abandona","abandonamos","abandonáis","abandonan","abandonando","abandoning","abandonado","abandoned"]
["abandonar","to abandon, leave behind, desert; to quit, give up","Indicativo","Indicative","Futuro","Future","I will abandon","abandonaré","abandonarás","abandonará","abandonaremos","abandonaréis","abandonarán","abandonando","abandoning","abandonado","abandoned"]
["abandonar","to abandon, leave behind, desert; to quit, give up","Indicativo","Indicative","Imperfecto","Imperfect","I was abandoning, used to abandon, abandoned","abandonaba","abandonabas","abandonaba","abandonábamos","abandonabais","abandonaban","abandonando","abandoning","abandonado","abandoned"]
["abandonar","to abandon, leave behind, desert; to quit, give up","Indicativo","Indicative","Pretérito","Preterite","I abandoned","abandoné","abandonaste","abandonó","abandonamos","abandonasteis","abandonaron","abandonando","abandoning","abandonado","abandoned"]
["abandonar","to abandon, leave behind, desert; to quit, give up","Indicativo","Indicative","Condicional","Conditional","I would abandon","abandonaría","abandonarías","abandonaría","abandonaríamos","abandonaríais","abandonarían","abandonando","abandoning","abandonado","abandoned"]
["abandonar","to abandon, leave behind, desert; to quit, give up","Indicativo","Indicative","Presente perfecto","Present Perfect","I have abandoned","he abandonado","has abandonado","ha abandonado","hemos abandonado","habéis abandonado","han abandonado","abandonando","abandoning","abandonado","abandoned"]
["abandonar","to abandon, leave behind, desert; to quit, give up","Indicativo","Indicative","Futuro perfecto","Future Perfect","I will have abandoned","habré abandonado","habrás abandonado","habrá abandonado","habremos abandonado","habréis abandonado","habrán abandonado","abandonando","abandoning","abandonado","abandoned"]
["abandonar","to abandon, leave behind, desert; to quit, give up","Indicativo","Indicative","Pluscuamperfecto","Past Perfect","I had abandoned","había abandonado","habías abandonado","había abandonado","habíamos abandonado","habíais abandonado","habían abandonado","abandonando","abandoning","abandonado","abandoned"]
["abandonar","to abandon, leave behind, desert; to quit, give up","Indicativo","Indicative","Pretérito anterior","Preterite (Archaic)","I had abandoned","hube abandonado","hubiste abandonado","hubo abandonado","hubimos abandonado","hubisteis abandonado","hubieron abandonado","abandonando","abandoning","abandonado","abandoned"]
["abandonar","to abandon, leave behind, desert; to quit, give up","Indicativo","Indicative","Condicional perfecto","Conditional Perfect","I would have abandoned","habría abandonado","habrías abandonado","habría abandonado","habríamos abandonado","habríais abandonado","habrían abandonado","abandonando","abandoning","abandonado","abandoned"]
["abandonar","to abandon, leave behind, desert; to quit, give up","Subjuntivo","Subjunctive","Presente","Present","I abandon, am abandoning","abandone","abandones","abandone","abandonemos","abandonéis","abandonen","abandonando","abandoning","abandonado","abandoned"]
["abandonar","to abandon, leave behind, desert; to quit, give up","Subjuntivo","Subjunctive","Imperfecto","Imperfect","I abandoned, was abandoning","abandonara","abandonaras","abandonara","abandonáramos","abandonarais","abandonaran","abandonando","abandoning","abandonado","abandoned"]
["abandonar","to abandon, leave behind, desert; to quit, give up","Subjuntivo","Subjunctive","Futuro","Future","I will abandon","abandonare","abandonares","abandonare","abandonáremos","abandonareis","abandonaren","abandonando","abandoning","abandonado","abandoned"]
["abandonar","to abandon, leave behind, desert; to quit, give up","Subjuntivo","Subjunctive","Presente perfecto","Present Perfect","I have abandoned, abandoned","haya abandonado","hayas abandonado","haya abandonado","hayamos abandonado","hayáis abandonado","hayan abandonado","abandonando","abandoning","abandonado","abandoned"]
["abandonar","to abandon, leave behind, desert; to quit, give up","Subjuntivo","Subjunctive","Futuro perfecto","Future Perfect","I will have abandoned","hubiere abandonado","hubieres abandonado","hubiere abandonado","hubiéremos abandonado","hubiereis abandonado","hubieren abandonado","abandonando","abandoning","abandonado","abandoned"]
["abandonar","to abandon, leave behind, desert; to quit, give up","Subjuntivo","Subjunctive","Pluscuamperfecto","Past Perfect","I had abandoned","hubiera abandonado","hubieras abandonado","hubiera abandonado","hubiéramos abandonado","hubierais abandonado","hubieran abandonado","abandonando","abandoning","abandonado","abandoned"]
["abrir","to open","Imperativo Afirmativo","Imperative Affirmative","Presente","Present","Open! Don't open!",null,"abre","abrid",null,"abra","abran","abriendo","opening","abierto","opened"]
["abrir","to open","Imperativo Negativo","Imperative Negative","Presente","Present","Open! Don't open!",null,"no abras","no abráis",null,"no abra","no abran","abriendo","opening","abierto","opened"]
["abrir","to open","Indicativo","Indicative","Presente","Present","I open, am opening","abro","abres","abre","abrimos","abrís","abren","abriendo","opening","abierto","opened"]
["abrir","to open","Indicativo","Indicative","Futuro","Future","I will open","abriré","abrirás","abrirá","abriremos","abriréis","abrirán","abriendo","opening","abierto","opened"]
["abrir","to open","Indicativo","Indicative","Imperfecto","Imperfect","I was opening, used to open, opened","abría","abrías","abría","abríamos","abríais","abrían","abriendo","opening","abierto","opened"]
["abrir","to open","Indicativo","Indicative","Pretérito","Preterite","I opened","abrí","abriste","abrió","abrimos","abristeis","abrieron","abriendo","opening","abierto","opened"]
["abrir","to open","Indicativo","Indicative","Condicional","Conditional","I would open","abriría","abrirías","abriría","abriríamos","abriríais","abrirían","abriendo","opening","abierto","opened"]
["abrir","to open","Indicativo","Indicative","Presente perfecto","Present Perfect","I have opened","he abierto","has abierto","ha abierto","hemos abierto","habéis abierto","han abierto","abriendo","opening","abierto","opened"]
["abrir","to open","Indicativo","Indicative","Futuro perfecto","Future Perfect","I will have opened","habré abierto","habrás abierto","habrá abierto","habremos abierto","habréis abierto","habrán abierto","abriendo","opening","abierto","opened"]
["abrir","to open","Indicativo","Indicative","Pluscuamperfecto","Past Perfect","I had opened","había abierto","habías abierto","había abierto","habíamos abierto","habíais abierto","habían abierto","abriendo","opening","abierto","opened"]
["abrir","to open","Indicativo","Indicative","Pretérito anterior","Preterite (Archaic)","I had opened","hube abierto","hubiste abierto","hubo abierto","hubimos abierto","hubisteis abierto","hubieron abierto","abriendo","opening","abierto","opened"]
["abrir","to open","Indicativo","Indicative","Condicional perfecto","Conditional Perfect","I would have opened","habría abierto","habrías abierto","habría abierto","habríamos abierto","habríais abierto","habrían abierto","abriendo","opening","abierto","opened"]
["abrir","to open","Subjuntivo","Subjunctive","Presente","Present","I open, am opening","abra","abras","abra","abramos","abráis","abran","abriendo","opening","abierto","opened"]
["abrir","to open","Subjuntivo","Subjunctive","Imperfecto","Imperfect","I opened, was opening","abriera","abrieras","abriera","abriéramos","abrierais","abrieran","abriendo","opening","abierto","opened"]
["abrir","to open","Subjuntivo","Subjunctive","Futuro","Future","I will open","abriere","abrieres","abriere","abriéremos","abriereis","abrieren","abriendo","opening","abierto","opened"]
["abrir","to open","Subjuntivo","Subjunctive","Presente perfecto","Present Perfect","I have opened, opened","haya abierto","hayas abierto","haya abierto","hayamos abierto","hayáis abierto","hayan abierto","abriendo","opening","abierto","opened"]
["abrir","to open","Subjuntivo","Subjunctive","Futuro perfecto","Future Perfect","I will have opened","hubiere abierto","hubieres abierto","hubiere abierto","hubiéremos abierto","hubiereis abierto","hubieren abierto","abriendo","opening","abierto","opened"]
["abrir","to open","Subjuntivo","Subjunctive","Pluscuamperfecto","Past Perfect","I had opened","hubiera abierto","hubieras abierto","hubiera abierto","hubiéramos abierto","hubierais abierto","hubieran abierto","abriendo","opening","abierto","opened"]
["acabar","to finish, end","Imperativo Afirmativo","Imperative Affirmative","Presente","Present","Finish! Don't finish!",null,"acaba","acabad",null,"acabe","acaben","acabando","finishing","acabado","finished"]
["acabar","to finish, end","Imperativo Negativo","Imperative Negative","Presente","Present","Finish! Don't finish!",null,"no acabes","no acabéis",null,"no acabe","no acaben","acabando","finishing","acabado","finished"]
["acabar","to finish, end","Indicativo","Indicative","Presente","Present","I finish, am finishing","acabo","acabas","acaba","acabamos","acabáis","acaban","acabando","finishing","acabado","finished"]
["acabar","to finish, end","Indicativo","Indicative","Futuro","Future","I will finish","acabaré","acabarás","acabará","acabaremos","acabaréis","acabarán","acabando","finishing","acabado","finished"]
["acabar","to finish, end","Indicativo","Indicative","Imperfecto","Imperfect","I was finishing, used to finish, finished","acababa","acababas","acababa","acabábamos","acababais","acababan","acabando","finishing","acabado","finished"]
["acabar","to finish, end","Indicativo","Indicative","Pretérito","Preterite","I finished","acabé","acabaste","acabó","acabamos","acabasteis","acabaron","acabando","finishing","acabado","finished"]
["acabar","to finish, end","Indicativo","Indicative","Condicional","Conditional","I would finish","acabaría","acabarías","acabaría","acabaríamos","acabaríais","acabarían","acabando","finishing","acabado","finished"]
["acabar","to finish, end","Indicativo","Indicative","Presente perfecto","Present Perfect","I have finished","he acabado","has acabado","ha acabado","hemos acabado","habéis acabado","han acabado","acabando","finishing","acabado","finished"]
["acabar","to finish, end","Indicativo","Indicative","Futuro perfecto","Future Perfect","I will have finished","habré acabado","habrás acabado","habrá acabado","habremos acabado","habréis acabado","habrán acabado","acabando","finishing","acabado","finished"]
["acabar","to finish, end","Indicativo","Indicative","Pluscuamperfecto","Past Perfect","I had finished","había acabado","habías acabado","había acabado","habíamos acabado","habíais acabado","habían acabado","acabando","finishing","acabado","finished"]
["acabar","to finish, end","Indicativo","Indicative","Pretérito anterior","Preterite (Archaic)","I had finished","hube acabado","hubiste acabado","hubo acabado","hubimos acabado","hubisteis acabado","hubieron acabado","acabando","finishing","acabado","finished"]
["acabar","to finish, end","Indicativo","Indicative","Condicional perfecto","Conditional Perfect","I would have finished","habría acabado","habrías acabado","habría acabado","habríamos acabado","habríais acabado","habrían acabado","acabando","finishing","acabado","finished"]
["acabar","to finish, end","Subjuntivo","Subjunctive","Presente","Present","I finish, am finishing","acabe","acabes","acabe","acabemos","acabéis","acaben","acabando","finishing","acabado","finished"]
["acabar","to finish, end","Subjuntivo","Subjunctive","Imperfecto","Imperfect","I finished, was finishing","acabara","acabaras","acabara","acabáramos","acabarais","acabaran","acabando","finishing","acabado","finished"]
["acabar","to finish, end","Subjuntivo","Subjunctive","Futuro","Future","I will finish","acabare","acabares","acabare","acabáremos","acabareis","acabaren","acabando","finishing","acabado","finished"]
["acabar","to finish, end","Subjuntivo","Subjunctive","Presente perfecto","Present Perfect","I have finished, finished","haya acabado","hayas acabado","haya acabado","hayamos acabado","hayáis acabado","hayan acabado","acabando","finishing","acabado","finished"]
["acabar","to finish, end","Subjuntivo","Subjunctive","Futuro perfecto","Future Perfect","I will have finished","hubiere acabado","hubieres acabado","hubiere acabado","hubiéremos acabado","hubiereis acabado","hubieren acabado","acabando","finishing","acabado","finished"]
["acabar","to finish, end","Subjuntivo","Subjunctive","Pluscuamperfecto","Past Perfect","I had finished","hubiera acabado","hubieras acabado","hubiera acabado","hubiéramos acabado","hubierais acabado","hubieran acabado","acabando","finishing","acabado","finished"]
["aceptar","to accept, approve; to agree to","Imperativo Afirmativo","Imperative Affirmative","Presente","Present","Accept! Don't accept!",null,"acepta","aceptad",null,"acepte","acepten","aceptando","accepting","aceptado","accepted"]
["aceptar","to accept, approve; to agree to","Imperativo Negativo","Imperative Negative","Presente","Present","Accept! Don't accept!",null,"no aceptes","no aceptéis",null,"no acepte","no acepten","aceptando","accepting","aceptado","accepted"]
["aceptar","to accept, approve; to agree to","Indicativo","Indicative","Presente","Present","I accept, am accepting","acepto","aceptas","acepta","aceptamos","aceptáis","aceptan","aceptando","accepting","aceptado","accepted"]
["aceptar","to accept, approve; to agree to","Indicativo","Indicative","Futuro","Future","I will accept","aceptaré","aceptarás","aceptará","aceptaremos","aceptaréis","aceptarán","aceptando","accepting","aceptado","accepted"]
["aceptar","to accept, approve; to agree to","Indicativo","Indicative","Imperfecto","Imperfect","I was accepting, used to accept, accepted","aceptaba","aceptabas","aceptaba","aceptábamos","aceptabais","aceptaban","aceptando","accepting","aceptado","accepted"]
["aceptar","to accept, approve; to agree to","Indicativo","Indicative","Pretérito","Preterite","I accepted","acepté","aceptaste","aceptó","aceptamos","aceptasteis","aceptaron","aceptando","accepting","aceptado","accepted"]
["aceptar","to accept, approve; to agree to","Indicativo","Indicative","Condicional","Conditional","I would accept","aceptaría","aceptarías","aceptaría","aceptaríamos","aceptaríais","aceptarían","aceptando","accepting","aceptado","accepted"]
["aceptar","to accept, approve; to agree to","Indicativo","Indicative","Presente perfecto","Present Perfect","I have accepted","he aceptado","has aceptado","ha aceptado","hemos aceptado","habéis aceptado","han aceptado","aceptando","accepting","aceptado","accepted"]
["aceptar","to accept, approve; to agree to","Indicativo","Indicative","Futuro perfecto","Future Perfect","I will have accepted","habré aceptado","habrás aceptado","habrá aceptado","habremos aceptado","habréis aceptado","habrán aceptado","aceptando","accepting","aceptado","accepted"]
["aceptar","to accept, approve; to agree to","Indicativo","Indicative","Pluscuamperfecto","Past Perfect","I had accepted","había aceptado","habías aceptado","había aceptado","habíamos aceptado","habíais aceptado","habían aceptado","aceptando","accepting","aceptado","accepted"]
["aceptar","to accept, approve; to agree to","Indicativo","Indicative","Pretérito anterior","Preterite (Archaic)","I had accepted","hube aceptado","hubiste aceptado","hubo aceptado","hubimos aceptado","hubisteis aceptado","hubieron aceptado","aceptando","accepting","aceptado","accepted"]
["aceptar","to accept, approve; to agree to","Indicativo","Indicative","Condicional perfecto","Conditional Perfect","I would have accepted","habría aceptado","habrías aceptado","habría aceptado","habríamos aceptado","habríais aceptado","habrían aceptado","aceptando","accepting","aceptado","accepted"]
["aceptar","to accept, approve; to agree to","Subjuntivo","Subjunctive","Presente","Present","I accept, am accepting","acepte","aceptes","acepte","aceptemos","aceptéis","acepten","aceptando","accepting","aceptado","accepted"]
["aceptar","to accept, approve; to agree to","Subjuntivo","Subjunctive","Imperfecto","Imperfect","I accepted, was accepting","aceptara","aceptaras","aceptara","aceptáramos","aceptarais","aceptaran","aceptando","accepting","aceptado","accepted"]
["aceptar","to accept, approve; to agree to","Subjuntivo","Subjunctive","Futuro","Future","I will accept","aceptare","aceptares","aceptare","aceptáremos","aceptareis","aceptaren","aceptando","accepting","aceptado","accepted"]
["aceptar","to accept, approve; to agree to","Subjuntivo","Subjunctive","Presente perfecto","Present Perfect","I have accepted, accepted","haya aceptado","hayas aceptado","haya aceptado","hayamos aceptado","hayáis aceptado","hayan aceptado","aceptando","accepting","aceptado","accepted"]
["aceptar","to accept, approve; to agree to","Subjuntivo","Subjunctive","Futuro perfecto","Future Perfect","I will have accepted","hubiere aceptado","hubieres aceptado","hubiere aceptado","hubiéremos aceptado","hubiereis aceptado","hubieren aceptado","aceptando","accepting","aceptado","accepted"]
["aceptar","to accept, approve; to agree to","Subjuntivo","Subjunctive","Pluscuamperfecto","Past Perfect","I had accepted","hubiera aceptado","hubieras aceptado","hubiera aceptado","hubiéramos aceptado","hubierais aceptado","hubieran aceptado","aceptando","accepting","aceptado","accepted"]
["acercar","to bring near[er], move [something] nearer","Imperativo Afirmativo","Imperative Affirmative","Presente","Present","Bring near(er)! Don't bring near(er)!",null,"acerca","acercad",null,"acerque","acerquen","acercando","bringing near(er)","acercado","brought near(er)"]
["acercar","to bring near[er], move [something] nearer","Imperativo Negativo","Imperative Negative","Presente","Present","Bring near(er)! Don't bring near(er)!",null,"no acerques","no acerquéis",null,"no acerque","no acerquen","acercando","bringing near(er)","acercado","brought near(er)"]
["acercar","to bring near[er], move [something] nearer","Indicativo","Indicative","Presente","Present","I bring near(er), am bringing near(er)","acerco","acercas","acerca","acercamos","acercáis","acercan","acercando","bringing near(er)","acercado","brought near(er)"]
["acercar","to bring near[er], move [something] nearer","Indicativo","Indicative","Futuro","Future","I will bring near(er)","acercaré","acercarás","acercará","acercaremos","acercaréis","acercarán","acercando","bringing near(er)","acercado","brought near(er)"]
["acercar","to bring near[er], move [something] nearer","Indicativo","Indicative","Imperfecto","Imperfect","I was bringing near(er), used to bring near(er), brought near(er)","acercaba","acercabas","acercaba","acercábamos","acercabais","acercaban","acercando","bringing near(er)","acercado","brought near(er)"]
["acercar","to bring near[er], move [something] nearer","Indicativo","Indicative","Pretérito","Preterite","I brought near(er)","acerqué","acercaste","acercó","acercamos","acercasteis","acercaron","acercando","bringing near(er)","acercado","brought near(er)"]
["acercar","to bring near[er], move [something] nearer","Indicativo","Indicative","Condicional","Conditional","I would bring near(er)","acercaría","acercarías","acercaría","acercaríamos","acercaríais","acercarían","acercando","bringing near(er)","acercado","brought near(er)"]
["acercar","to bring near[er], move [something] nearer","Indicativo","Indicative","Presente perfecto","Present Perfect","I have brought near(er)","he acercado","has acercado","ha acercado","hemos acercado","habéis acercado","han acercado","acercando","bringing near(er)","acercado","brought near(er)"]
["acercar","to bring near[er], move [something] nearer","Indicativo","Indicative","Futuro perfecto","Future Perfect","I will have brought near(er)","habré acercado","habrás acercado","habrá acercado","habremos acercado","habréis acercado","habrán acercado","acercando","bringing near(er)","acercado","brought near(er)"]
["acercar","to bring near[er], move [something] nearer","Indicativo","Indicative","Pluscuamperfecto","Past Perfect","I had brought near(er)","había acercado","habías acercado","había acercado","habíamos acercado","habíais acercado","habían acercado","acercando","bringing near(er)","acercado","brought near(er)"]
["acercar","to bring near[er], move [something] nearer","Indicativo","Indicative","Pretérito anterior","Preterite (Archaic)","I had brought near(er)","hube acercado","hubiste acercado","hubo acercado","hubimos acercado","hubisteis acercado","hubieron acercado","acercando","bringing near(er)","acercado","brought near(er)"]
["acercar","to bring near[er], move [something] nearer","Indicativo","Indicative","Condicional perfecto","Conditional Perfect","I would have brought near(er)","habría acercado","habrías acercado","habría acercado","habríamos acercado","habríais acercado","habrían acercado","acercando","bringing near(er)","acercado","brought near(er)"]
["acercar","to bring near[er], move [something] nearer","Subjuntivo","Subjunctive","Presente","Present","I bring near(er), am bringing near(er)","acerque","acerques","acerque","acerquemos","acerquéis","acerquen","acercando","bringing near(er)","acercado","brought near(er)"]
["acercar","to bring near[er], move [something] nearer","Subjuntivo","Subjunctive","Imperfecto","Imperfect","I brought near(er), was bringing near(er)","acercara","acercaras","acercara","acercáramos","acercarais","acercaran","acercando","bringing near(er)","acercado","brought near(er)"]
["acercar","to bring near[er], move [something] nearer","Subjuntivo","Subjunctive","Futuro","Future","I will bring near(er)","acercare","acercares","acercare","acercáremos","acercareis","acercaren","acercando","bringing near(er)","acercado","brought near(er)"]
["acercar","to bring near[er], move [something] nearer","Subjuntivo","Subjunctive","Presente perfecto","Present Perfect","I have brought near(er), brought near(er)","haya acercado","hayas acercado","haya acercado","hayamos acercado","hayáis acercado","hayan acercado","acercando","bringing near(er)","acercado","brought near(er)"]
["acercar","to bring near[er], move [something] nearer","Subjuntivo","Subjunctive","Futuro perfecto","Future Perfect","I will have brought near(er)","hubiere acercado","hubieres acercado","hubiere acercado","hubiéremos acercado","hubiereis acercado","hubieren acercado","acercando","bringing near(er)","acercado","brought near(er)"]
["acercar","to bring near[er], move [something] nearer","Subjuntivo","Subjunctive","Pluscuamperfecto","Past Perfect","I had brought near(er)","hubiera acercado","hubieras acercado","hubiera acercado","hubiéramos acercado","hubierais acercado","hubieran acercado","acercando","bringing near(er)","acercado","brought near(er)"]
["acompañar","to accompany, go with, escort","Imperativo Afirmativo","Imperative Affirmative","Presente","Present","Accompany! Don't accompany!",null,"acompaña","acompañad",null,"acompañe","acompañen","acompañando","accompanying","acompañado","accompanied"]
["acompañar","to accompany, go with, escort","Imperativo Negativo","Imperative Negative","Presente","Present","Accompany! Don't accompany!",null,"no acompañes","no acompañéis",null,"no acompañe","no acompañen","acompañando","accompanying","acompañado","accompanied"]
["acompañar","to accompany, go with, escort","Indicativo","Indicative","Presente","Present","I accompany, am accompanying","acompaño","acompañas","acompaña","acompañamos","acompañáis","acompañan","acompañando","accompanying","acompañado","accompanied"]
["acompañar","to accompany, go with, escort","Indicativo","Indicative","Futuro","Future","I will accompany","acompañaré","acompañarás","acompañará","acompañaremos","acompañaréis","acompañarán","acompañando","accompanying","acompañado","accompanied"]
["acompañar","to accompany, go with, escort","Indicativo","Indicative","Imperfecto","Imperfect","I was accompanying, used to accompany, accompanied","acompañaba","acompañabas","acompañaba","acompañábamos","acompañabais","acompañaban","acompañando","accompanying","acompañado","accompanied"]
["acompañar","to accompany, go with, escort","Indicativo","Indicative","Pretérito","Preterite","I accompanied","acompañé","acompañaste","acompañó","acompañamos","acompañasteis","acompañaron","acompañando","accompanying","acompañado","accompanied"]
["acompañar","to accompany, go with, escort","Indicativo","Indicative","Condicional","Conditional","I would accompany","acompañaría","acompañarías","acompañaría","acompañaríamos","acompañaríais","acompañarían","acompañando","accompanying","acompañado","accompanied"]
["acompañar","to accompany, go with, escort","Indicativo","Indicative","Presente perfecto","Present Perfect","I have accompanied","he acompañado","has acompañado","ha acompañado","hemos acompañado","habéis acompañado","han acompañado","acompañando","accompanying","acompañado","accompanied"]
["acompañar","to accompany, go with, escort","Indicativo","Indicative","Futuro perfecto","Future Perfect","I will have accompanied","habré acompañado","habrás acompañado","habrá acompañado","habremos acompañado","habréis acompañado","habrán acompañado","acompañando","accompanying","acompañado","accompanied"]
["acompañar","to accompany, go with, escort","Indicativo","Indicative","Pluscuamperfecto","Past Perfect","I had accompanied","había acompañado","habías acompañado","había acompañado","habíamos acompañado","habíais acompañado","habían acompañado","acompañando","accompanying","acompañado","accompanied"]
["acompañar","to accompany, go with, escort","Indicativo","Indicative","Pretérito anterior","Preterite (Archaic)","I had accompanied","hube acompañado","hubiste acompañado","hubo acompañado","hubimos acompañado","hubisteis acompañado","hubieron acompañado","acompañando","accompanying","acompañado","accompanied"]
["acompañar","to accompany, go with, escort","Indicativo","Indicative","Condicional perfecto","Conditional Perfect","I would have accompanied","habría acompañado","habrías acompañado","habría acompañado","habríamos acompañado","habríais acompañado","habrían acompañado","acompañando","accompanying","acompañado","accompanied"]
["acompañar","to accompany, go with, escort","Subjuntivo","Subjunctive","Presente","Present","I accompany, am accompanying","acompañe","acompañes","acompañe","acompañemos","acompañéis","acompañen","acompañando","accompanying","acompañado","accompanied"]
["acompañar","to accompany, go with, escort","Subjuntivo","Subjunctive","Imperfecto","Imperfect","I accompanied, was accompanying","acompañara","acompañaras","acompañara","acompañáramos","acompañarais","acompañaran","acompañando","accompanying","acompañado","accompanied"]
["acompañar","to accompany, go with, escort","Subjuntivo","Subjunctive","Futuro","Future","I will accompany","acompañare","acompañares","acompañare","acompañáremos","acompañareis","acompañaren","acompañando","accompanying","acompañado","accompanied"]
["acompañar","to accompany, go with, escort","Subjuntivo","Subjunctive","Presente perfecto","Present Perfect","I have accompanied, accompanied","haya acompañado","hayas acompañado","haya acompañado","hayamos acompañado","hayáis acompañado","hayan acompañado","acompañando","accompanying","acompañado","accompanied"]
["acompañar","to accompany, go with, escort","Subjuntivo","Subjunctive","Futuro perfecto","Future Perfect","I will have accompanied","hubiere acompañado","hubieres acompañado","hubiere acompañado","hubiéremos acompañado","hubiereis acompañado","hubieren acompañado","acompañando","accompanying","acompañado","accompanied"]
["acompañar","to accompany, go with, escort","Subjuntivo","Subjunctive","Pluscuamperfecto","Past Perfect","I had accompanied","hubiera acompañado","hubieras acompañado","hubiera acompañado","hubiéramos acompañado","hubierais acompañado","hubieran acompañado","acompañando","accompanying","acompañado","accompanied"]
["acordar","to decide, resolve, agree [on]","Imperativo Afirmativo","Imperative Affirmative","Presente","Present","Decide! Don't decide!",null,"acuerda","acordad",null,"acuerde","acuerden","acordando","deciding","acordado","decided"]
["acordar","to decide, resolve, agree [on]","Imperativo Negativo","Imperative Negative","Presente","Present","Decide! Don't decide!",null,"no acuerdes","no acordéis",null,"no acuerde","no acuerden","acordando","deciding","acordado","decided"]
["acordar","to decide, resolve, agree [on]","Indicativo","Indicative","Condicional","Conditional","I would decide","acordaría","acordarías","acordaría","acordaríamos","acordaríais","acordarían","acordando","deciding","acordado","decided"]
["acordar","to decide, resolve, agree [on]","Indicativo","Indicative","Presente","Present","I decide, am deciding","acuerdo","acuerdas","acuerda","acordamos","acordáis","acuerdan","acordando","deciding","acordado","decided"]
["acordar","to decide, resolve, agree [on]","Indicativo","Indicative","Futuro","Future","I will decide","acordaré","acordarás","acordará","acordaremos","acordaréis","acordarán","acordando","deciding","acordado","decided"]
["acordar","to decide, resolve, agree [on]","Indicativo","Indicative","Imperfecto","Imperfect","I was deciding, used to decide, decided","acordaba","acordabas","acordaba","acordábamos","acordabais","acordaban","acordando","deciding","acordado","decided"]
["acordar","to decide, resolve, agree [on]","Indicativo","Indicative","Pretérito","Preterite","I decided","acordé","acordaste","acordó","acordamos","acordasteis","acordaron","acordando","deciding","acordado","decided"]
["acordar","to decide, resolve, agree [on]","Indicativo","Indicative","Presente perfecto","Present Perfect","I have decided","he acordado","has acordado","ha acordado","hemos acordado","habéis acordado","han acordado","acordando","deciding","acordado","decided"]
["acordar","to decide, resolve, agree [on]","Indicativo","Indicative","Futuro perfecto","Future Perfect","I will have decided","habré acordado","habrás acordado","habrá acordado","habremos acordado","habréis acordado","habrán acordado","acordando","deciding","acordado","decided"]
["acordar","to decide, resolve, agree [on]","Indicativo","Indicative","Pluscuamperfecto","Past Perfect","I had decided","había acordado","habías acordado","había acordado","habíamos acordado","habíais acordado","habían acordado","acordando","deciding","acordado","decided"]
["acordar","to decide, resolve, agree [on]","Indicativo","Indicative","Pretérito anterior","Preterite (Archaic)","I had decided","hube acordado","hubiste acordado","hubo acordado","hubimos acordado","hubisteis acordado","hubieron acordado","acordando","deciding","acordado","decided"]
["acordar","to decide, resolve, agree [on]","Indicativo","Indicative","Condicional perfecto","Conditional Perfect","I would have decided","habría acordado","habrías acordado","habría acordado","habríamos acordado","habríais acordado","habrían acordado","acordando","deciding","acordado","decided"]
["acordar","to decide, resolve, agree [on]","Subjuntivo","Subjunctive","Presente","Present","I decide, am deciding","acuerde","acuerdes","acuerde","acordemos","acordéis","acuerden","acordando","deciding","acordado","decided"]
["acordar","to decide, resolve, agree [on]","Subjuntivo","Subjunctive","Imperfecto","Imperfect","I decided, was deciding","acordara","acordaras","acordara","acordáramos","acordarais","acordaran","acordando","deciding","acordado","decided"]
["acordar","to decide, resolve, agree [on]","Subjuntivo","Subjunctive","Futuro","Future","I will decide","acordare","acordares","acordare","acordáremos","acordareis","acordaren","acordando","deciding","acordado","decided"]
["acordar","to decide, resolve, agree [on]","Subjuntivo","Subjunctive","Presente perfecto","Present Perfect","I have decided, decided","haya acordado","hayas acordado","haya acordado","hayamos acordado","hayáis acordado","hayan acordado","acordando","deciding","acordado","decided"]
["acordar","to decide, resolve, agree [on]","Subjuntivo","Subjunctive","Futuro perfecto","Future Perfect","I will have decided","hubiere acordado","hubieres acordado","hubiere acordado","hubiéremos acordado","hubiereis acordado","hubieren acordado","acordando","deciding","acordado","decided"]
["acordar","to decide, resolve, agree [on]","Subjuntivo","Subjunctive","Pluscuamperfecto","Past Perfect","I had decided","hubiera acordado","hubieras acordado","hubiera acordado","hubiéramos acordado","hubierais acordado","hubieran acordado","acordando","deciding","acordado","decided"]
["actuar","to act, perform, actuate, operate","Imperativo Afirmativo","Imperative Affirmative","Presente","Present","Act! Don't act!",null,"actúa","actuad",null,"actúe","actúen","actuando","acting","actuado","acted"]
["actuar","to act, perform, actuate, operate","Imperativo Negativo","Imperative Negative","Presente","Present","Act! Don't act!",null,"no actúes","no actuéis",null,"no actúe","no actúen","actuando","acting","actuado","acted"]
["actuar","to act, perform, actuate, operate","Indicativo","Indicative","Presente","Present","I act, am acting","actúo","actúas","actúa","actuamos","actuáis","actúan","actuando","acting","actuado","acted"]
["actuar","to act, perform, actuate, operate","Indicativo","Indicative","Futuro","Future","I will act","actuaré","actuarás","actuará","actuaremos","actuaréis","actuarán","actuando","acting","actuado","acted"]
["actuar","to act, perform, actuate, operate","Indicativo","Indicative","Imperfecto","Imperfect","I was acting, used to act, acted","actuaba","actuabas","actuaba","actuábamos","actuabais","actuaban","actuando","acting","actuado","acted"]
["actuar","to act, perform, actuate, operate","Indicativo","Indicative","Pretérito","Preterite","I acted","actué","actuaste","actuó","actuamos","actuasteis","actuaron","actuando","acting","actuado","acted"]
["actuar","to act, perform, actuate, operate","Indicativo","Indicative","Condicional","Conditional","I would act","actuaría","actuarías","actuaría","actuaríamos","actuaríais","actuarían","actuando","acting","actuado","acted"]
["actuar","to act, perform, actuate, operate","Indicativo","Indicative","Presente perfecto","Present Perfect","I have acted","he actuado","has actuado","ha actuado","hemos actuado","habéis actuado","han actuado","actuando","acting","actuado","acted"]
["actuar","to act, perform, actuate, operate","Indicativo","Indicative","Futuro perfecto","Future Perfect","I will have acted","habré actuado","habrás actuado","habrá actuado","habremos actuado","habréis actuado","habrán actuado","actuando","acting","actuado","acted"]
["actuar","to act, perform, actuate, operate","Indicativo","Indicative","Pluscuamperfecto","Past Perfect","I had acted","había actuado","habías actuado","había actuado","habíamos actuado","habíais actuado","habían actuado","actuando","acting","actuado","acted"]
["actuar","to act, perform, actuate, operate","Indicativo","Indicative","Pretérito anterior","Preterite (Archaic)","I had acted","hube actuado","hubiste actuado","hubo actuado","hubimos actuado","hubisteis actuado","hubieron actuado","actuando","acting","actuado","acted"]
["actuar","to act, perform, actuate, operate","Indicativo","Indicative","Condicional perfecto","Conditional Perfect","I would have acted","habría actuado","habrías actuado","habría actuado","habríamos actuado","habríais actuado","habrían actuado","actuando","acting","actuado","acted"]
["actuar","to act, perform, actuate, operate","Subjuntivo","Subjunctive","Presente perfecto","Present Perfect","I have acted, acted","haya actuado","hayas actuado","haya actuado","hayamos actuado","hayáis actuado","hayan actuado","actuando","acting","actuado","acted"]
["actuar","to act, perform, actuate, operate","Subjuntivo","Subjunctive","Presente","Present","I act, am acting","actúe","actúes","actúe","actuemos","actuéis","actúen","actuando","acting","actuado","acted"]
["actuar","to act, perform, actuate, operate","Subjuntivo","Subjunctive","Imperfecto","Imperfect","I acted, was acting","actuara","actuaras","actuara","actuáramos","actuarais","actuaran","actuando","acting","actuado","acted"]
["actuar","to act, perform, actuate, operate","Subjuntivo","Subjunctive","Futuro","Future","I will act","actuare","actuares","actuare","actuáremos","actuareis","actuaren","actuando","acting","actuado","acted"]
["actuar","to act, perform, actuate, operate","Subjuntivo","Subjunctive","Futuro perfecto","Future Perfect","I will have acted","hubiere actuado","hubieres actuado","hubiere actuado","hubiéremos actuado","hubiereis actuado","hubieren actuado","actuando","acting","actuado","acted"]
["actuar","to act, perform, actuate, operate","Subjuntivo","Subjunctive","Pluscuamperfecto","Past Perfect","I had acted","hubiera actuado","hubieras actuado","hubiera actuado","hubiéramos actuado","hubierais actuado","hubieran actuado","actuando","acting","actuado","acted"]
["alcanzar","to reach, catch, catch up to, catch up with","Imperativo Afirmativo","Imperative Affirmative","Presente","Present","Reach! Don't reach!",null,"alcanza","alcanzad",null,"alcance","alcancen","alcanzando","reaching","alcanzado","reached"]
["alcanzar","to reach, catch, catch up to, catch up with","Imperativo Negativo","Imperative Negative","Presente","Present","Reach! Don't reach!",null,"no alcances","no alcancéis",null,"no alcance","no alcancen","alcanzando","reaching","alcanzado","reached"]
["alcanzar","to reach, catch, catch up to, catch up with","Indicativo","Indicative","Presente","Present","I reach, am reaching","alcanzo","alcanzas","alcanza","alcanzamos","alcanzáis","alcanzan","alcanzando","reaching","alcanzado","reached"]
["alcanzar","to reach, catch, catch up to, catch up with","Indicativo","Indicative","Futuro","Future","I will reach","alcanzaré","alcanzarás","alcanzará","alcanzaremos","alcanzaréis","alcanzarán","alcanzando","reaching","alcanzado","reached"]
["alcanzar","to reach, catch, catch up to, catch up with","Indicativo","Indicative","Imperfecto","Imperfect","I was reaching, used to reach, reached","alcanzaba","alcanzabas","alcanzaba","alcanzábamos","alcanzabais","alcanzaban","alcanzando","reaching","alcanzado","reached"]
["alcanzar","to reach, catch, catch up to, catch up with","Indicativo","Indicative","Pretérito","Preterite","I reached","alcancé","alcanzaste","alcanzó","alcanzamos","alcanzasteis","alcanzaron","alcanzando","reaching","alcanzado","reached"]
["alcanzar","to reach, catch, catch up to, catch up with","Indicativo","Indicative","Condicional","Conditional","I would reach","alcanzaría","alcanzarías","alcanzaría","alcanzaríamos","alcanzaríais","alcanzarían","alcanzando","reaching","alcanzado","reached"]
["alcanzar","to reach, catch, catch up to, catch up with","Indicativo","Indicative","Presente perfecto","Present Perfect","I have reached","he alcanzado","has alcanzado","ha alcanzado","hemos alcanzado","habéis alcanzado","han alcanzado","alcanzando","reaching","alcanzado","reached"]
["alcanzar","to reach, catch, catch up to, catch up with","Indicativo","Indicative","Futuro perfecto","Future Perfect","I will have reached","habré alcanzado","habrás alcanzado","habrá alcanzado","habremos alcanzado","habréis alcanzado","habrán alcanzado","alcanzando","reaching","alcanzado","reached"]
["alcanzar","to reach, catch, catch up to, catch up with","Indicativo","Indicative","Pluscuamperfecto","Past Perfect","I had reached","había alcanzado","habías alcanzado","había alcanzado","habíamos alcanzado","habíais alcanzado","habían alcanzado","alcanzando","reaching","alcanzado","reached"]
["alcanzar","to reach, catch, catch up to, catch up with","Indicativo","Indicative","Pretérito anterior","Preterite (Archaic)","I had reached","hube alcanzado","hubiste alcanzado","hubo alcanzado","hubimos alcanzado","hubisteis alcanzado","hubieron alcanzado","alcanzando","reaching","alcanzado","reached"]
["alcanzar","to reach, catch, catch up to, catch up with","Indicativo","Indicative","Condicional perfecto","Conditional Perfect","I would have reached","habría alcanzado","habrías alcanzado","habría alcanzado","habríamos alcanzado","habríais alcanzado","habrían alcanzado","alcanzando","reaching","alcanzado","reached"]
["alcanzar","to reach, catch, catch up to, catch up with","Subjuntivo","Subjunctive","Presente","Present","I reach, am reaching","alcance","alcances","alcance","alcancemos","alcancéis","alcancen","alcanzando","reaching","alcanzado","reached"]
["alcanzar","to reach, catch, catch up to, catch up with","Subjuntivo","Subjunctive","Imperfecto","Imperfect","I reached, was reaching","alcanzara","alcanzaras","alcanzara","alcanzáramos","alcanzarais","alcanzaran","alcanzando","reaching","alcanzado","reached"]
["alcanzar","to reach, catch, catch up to, catch up with","Subjuntivo","Subjunctive","Futuro","Future","I will reach","alcanzare","alcanzares","alcanzare","alcanzáremos","alcanzareis","alcanzaren","alcanzando","reaching","alcanzado","reached"]
["alcanzar","to reach, catch, catch up to, catch up with","Subjuntivo","Subjunctive","Presente perfecto","Present Perfect","I have reached, reached","haya alcanzado","hayas alcanzado","haya alcanzado","hayamos alcanzado","hayáis alcanzado","hayan alcanzado","alcanzando","reaching","alcanzado","reached"]
["alcanzar","to reach, catch, catch up to, catch up with","Subjuntivo","Subjunctive","Futuro perfecto","Future Perfect","I will have reached","hubiere alcanzado","hubieres alcanzado","hubiere alcanzado","hubiéremos alcanzado","hubiereis alcanzado","hubieren alcanzado","alcanzando","reaching","alcanzado","reached"]
["alcanzar","to reach, catch, catch up to, catch up with","Subjuntivo","Subjunctive","Pluscuamperfecto","Past Perfect","I had reached","hubiera alcanzado","hubieras alcanzado","hubiera alcanzado","hubiéramos alcanzado","hubierais alcanzado","hubieran alcanzado","alcanzando","reaching","alcanzado","reached"]
["andar","to walk, go","Imperativo Afirmativo","Imperative Affirmative","Presente","Present","Walk! Don't walk!",null,"anda","andad",null,"ande","anden","andando","walking","andado","walked"]
["andar","to walk, go","Imperativo Negativo","Imperative Negative","Presente","Present","Walk! Don't walk!",null,"no andes","no andéis",null,"no ande","no anden","andando","walking","andado","walked"]
["andar","to walk, go","Indicativo","Indicative","Presente","Present","I walk, am walking","ando","andas","anda","andamos","andáis","andan","andando","walking","andado","walked"]
["andar","to walk, go","Indicativo","Indicative","Futuro","Future","I will walk","andaré","andarás","andará","andaremos","andaréis","andarán","andando","walking","andado","walked"]
["andar","to walk, go","Indicativo","Indicative","Imperfecto","Imperfect","I was walking, used to walk, walked","andaba","andabas","andaba","andábamos","andabais","andaban","andando","walking","andado","walked"]
["andar","to walk, go","Indicativo","Indicative","Pretérito","Preterite","I walked","anduve","anduviste","anduvo","anduvimos","anduvisteis","anduvieron","andando","walking","andado","walked"]
["andar","to walk, go","Indicativo","Indicative","Condicional","Conditional","I would walk","andaría","andarías","andaría","andaríamos","andaríais","andarían","andando","walking","andado","walked"]
["andar","to walk, go","Indicativo","Indicative","Presente perfecto","Present Perfect","I have walked","he andado","has andado","ha andado","hemos andado","habéis andado","han andado","andando","walking","andado","walked"]
["andar","to walk, go","Indicativo","Indicative","Futuro perfecto","Future Perfect","I will have walked","habré andado","habrás andado","habrá andado","habremos andado","habréis andado","habrán andado","andando","walking","andado","walked"]
["andar","to walk, go","Indicativo","Indicative","Pluscuamperfecto","Past Perfect","I had walked","había andado","habías andado","había andado","habíamos andado","habíais andado","habían andado","andando","walking","andado","walked"]
["andar","to walk, go","Indicativo","Indicative","Pretérito anterior","Preterite (Archaic)","I had walked","hube andado","hubiste andado","hubo andado","hubimos andado","hubisteis andado","hubieron andado","andando","walking","andado","walked"]
["andar","to walk, go","Indicativo","Indicative","Condicional perfecto","Conditional Perfect","I would have walked","habría andado","habrías andado","habría andado","habríamos andado","habríais andado","habrían andado","andando","walking","andado","walked"]
["andar","to walk, go","Subjuntivo","Subjunctive","Presente","Present","I walk, am walking","ande","andes","ande","andemos","andéis","anden","andando","walking","andado","walked"]
["andar","to walk, go","Subjuntivo","Subjunctive","Imperfecto","Imperfect","I walked, was walking","anduviera","anduvieras","anduviera","anduviéramos","anduvierais","anduvieran","andando","walking","andado","walked"]
["andar","to walk, go","Subjuntivo","Subjunctive","Futuro","Future","I will walk","anduviere","anduvieres","anduviere","anduviéremos","anduviereis","anduvieren","andando","walking","andado","walked"]
["andar","to walk, go","Subjuntivo","Subjunctive","Presente perfecto","Present Perfect","I have walked, walked","haya andado","hayas andado","haya andado","hayamos andado","hayáis andado","hayan andado","andando","walking","andado","walked"]
["andar","to walk, go","Subjuntivo","Subjunctive","Futuro perfecto","Future Perfect","I will have walked","hubiere andado","hubieres andado","hubiere andado","hubiéremos andado","hubiereis andado","hubieren andado","andando","walking","andado","walked"]
["andar","to walk, go","Subjuntivo","Subjunctive","Pluscuamperfecto","Past Perfect","I had walked","hubiera andado","hubieras andado","hubiera andado","hubiéramos andado","hubierais andado","hubieran andado","andando","walking","andado","walked"]
["aparecer","to appear","Imperativo Afirmativo","Imperative Affirmative","Presente","Present","Appear! Don't appear!",null,"aparece","apareced",null,"aparezca","aparezcan","apareciendo","appearing","aparecido","appeared"]
["aparecer","to appear","Imperativo Negativo","Imperative Negative","Presente","Present","Appear! Don't appear!",null,"no aparezcas","no aparezcáis",null,"no aparezca","no aparezcan","apareciendo","appearing","aparecido","appeared"]
["aparecer","to appear","Indicativo","Indicative","Presente","Present","I appear, am appearing","aparezco","apareces","aparece","aparecemos","aparecéis","aparecen","apareciendo","appearing","aparecido","appeared"]
["aparecer","to appear","Indicativo","Indicative","Futuro","Future","I will appear","apareceré","aparecerás","aparecerá","apareceremos","apareceréis","aparecerán","apareciendo","appearing","aparecido","appeared"]
["aparecer","to appear","Indicativo","Indicative","Imperfecto","Imperfect","I was appearing, used to appear, appeared","aparecía","aparecías","aparecía","aparecíamos","aparecíais","aparecían","apareciendo","appearing","aparecido","appeared"]
["aparecer","to appear","Indicativo","Indicative","Pretérito","Preterite","I appeared","aparecí","apareciste","apareció","aparecimos","aparecisteis","aparecieron","apareciendo","appearing","aparecido","appeared"]
["aparecer","to appear","Indicativo","Indicative","Condicional","Conditional","I would appear","aparecería","aparecerías","aparecería","apareceríamos","apareceríais","aparecerían","apareciendo","appearing","aparecido","appeared"]
["aparecer","to appear","Indicativo","Indicative","Presente perfecto","Present Perfect","I have appeared","he aparecido","has aparecido","ha aparecido","hemos aparecido","habéis aparecido","han aparecido","apareciendo","appearing","aparecido","appeared"]
["aparecer","to appear","Indicativo","Indicative","Futuro perfecto","Future Perfect","I will have appeared","habré aparecido","habrás aparecido","habrá aparecido","habremos aparecido","habréis aparecido","habrán aparecido","apareciendo","appearing","aparecido","appeared"]
["aparecer","to appear","Indicativo","Indicative","Pluscuamperfecto","Past Perfect","I had appeared","había aparecido","habías aparecido","había aparecido","habíamos aparecido","habíais aparecido","habían aparecido","apareciendo","appearing","aparecido","appeared"]
["aparecer","to appear","Indicativo","Indicative","Pretérito anterior","Preterite (Archaic)","I had appeared","hube aparecido","hubiste aparecido","hubo aparecido","hubimos aparecido","hubisteis aparecido","hubieron aparecido","apareciendo","appearing","aparecido","appeared"]
["aparecer","to appear","Indicativo","Indicative","Condicional perfecto","Conditional Perfect","I would have appeared","habría aparecido","habrías aparecido","habría aparecido","habríamos aparecido","habríais aparecido","habrían aparecido","apareciendo","appearing","aparecido","appeared"]
["aparecer","to appear","Subjuntivo","Subjunctive","Presente","Present","I appear, am appearing","aparezca","aparezcas","aparezca","aparezcamos","aparezcáis","aparezcan","apareciendo","appearing","aparecido","appeared"]
["aparecer","to appear","Subjuntivo","Subjunctive","Imperfecto","Imperfect","I appeared, was appearing","apareciera","aparecieras","apareciera","apareciéramos","aparecierais","aparecieran","apareciendo","appearing","aparecido","appeared"]
["aparecer","to appear","Subjuntivo","Subjunctive","Futuro","Future","I will appear","apareciere","aparecieres","apareciere","apareciéremos","apareciereis","aparecieren","apareciendo","appearing","aparecido","appeared"]
["aparecer","to appear","Subjuntivo","Subjunctive","Presente perfecto","Present Perfect","I have appeared, appeared","haya aparecido","hayas aparecido","haya aparecido","hayamos aparecido","hayáis aparecido","hayan aparecido","apareciendo","appearing","aparecido","appeared"]
["aparecer","to appear","Subjuntivo","Subjunctive","Futuro perfecto","Future Perfect","I will have appeared","hubiere aparecido","hubieres aparecido","hubiere aparecido","hubiéremos aparecido","hubiereis aparecido","hubieren aparecido","apareciendo","appearing","aparecido","appeared"]
["aparecer","to appear","Subjuntivo","Subjunctive","Pluscuamperfecto","Past Perfect","I had appeared","hubiera aparecido","hubieras aparecido","hubiera aparecido","hubiéramos aparecido","hubierais aparecido","hubieran aparecido","apareciendo","appearing","aparecido","appeared"]
["aplicar","to apply","Imperativo Afirmativo","Imperative Affirmative","Presente","Present","Apply! Don't apply!",null,"aplica","aplicad",null,"aplique","apliquen","aplicando","applying","aplicado","applied"]
["aplicar","to apply","Imperativo Negativo","Imperative Negative","Presente","Present","Apply! Don't apply!",null,"no apliques","no apliquéis",null,"no aplique","no apliquen","aplicando","applying","aplicado","applied"]
["aplicar","to apply","Indicativo","Indicative","Presente","Present","I apply, am applying","aplico","aplicas","aplica","aplicamos","aplicáis","aplican","aplicando","applying","aplicado","applied"]
["aplicar","to apply","Indicativo","Indicative","Futuro","Future","I will apply","aplicaré","aplicarás","aplicará","aplicaremos","aplicaréis","aplicarán","aplicando","applying","aplicado","applied"]
["aplicar","to apply","Indicativo","Indicative","Imperfecto","Imperfect","I was applying, used to apply, applied","aplicaba","aplicabas","aplicaba","aplicábamos","aplicabais","aplicaban","aplicando","applying","aplicado","applied"]
["aplicar","to apply","Indicativo","Indicative","Pretérito","Preterite","I applied","apliqué","aplicaste","aplicó","aplicamos","aplicasteis","aplicaron","aplicando","applying","aplicado","applied"]
["aplicar","to apply","Indicativo","Indicative","Condicional","Conditional","I would apply","aplicaría","aplicarías","aplicaría","aplicaríamos","aplicaríais","aplicarían","aplicando","applying","aplicado","applied"]
["aplicar","to apply","Indicativo","Indicative","Presente perfecto","Present Perfect","I have applied","he aplicado","has aplicado","ha aplicado","hemos aplicado","habéis aplicado","han aplicado","aplicando","applying","aplicado","applied"]
["aplicar","to apply","Indicativo","Indicative","Futuro perfecto","Future Perfect","I will have applied","habré aplicado","habrás aplicado","habrá aplicado","habremos aplicado","habréis aplicado","habrán aplicado","aplicando","applying","aplicado","applied"]
["aplicar","to apply","Indicativo","Indicative","Pluscuamperfecto","Past Perfect","I had applied","había aplicado","habías aplicado","había aplicado","habíamos aplicado","habíais aplicado","habían aplicado","aplicando","applying","aplicado","applied"]
["aplicar","to apply","Indicativo","Indicative","Pretérito anterior","Preterite (Archaic)","I had applied","hube aplicado","hubiste aplicado","hubo aplicado","hubimos aplicado","hubisteis aplicado","hubieron aplicado","aplicando","applying","aplicado","applied"]
["aplicar","to apply","Indicativo","Indicative","Condicional perfecto","Conditional Perfect","I would have applied","habría aplicado","habrías aplicado","habría aplicado","habríamos aplicado","habríais aplicado","habrían aplicado","aplicando","applying","aplicado","applied"]
["aplicar","to apply","Subjuntivo","Subjunctive","Presente","Present","I apply, am applying","aplique","apliques","aplique","apliquemos","apliquéis","apliquen","aplicando","applying","aplicado","applied"]
["aplicar","to apply","Subjuntivo","Subjunctive","Imperfecto","Imperfect","I applied, was applying","aplicara","aplicaras","aplicara","aplicáramos","aplicarais","aplicaran","aplicando","applying","aplicado","applied"]
["aplicar","to apply","Subjuntivo","Subjunctive","Futuro","Future","I will apply","aplicare","aplicares","aplicare","aplicáremos","aplicareis","aplicaren","aplicando","applying","aplicado","applied"]
["aplicar","to apply","Subjuntivo","Subjunctive","Presente perfecto","Present Perfect","I have applied, applied","haya aplicado","hayas aplicado","haya aplicado","hayamos aplicado","hayáis aplicado","hayan aplicado","aplicando","applying","aplicado","applied"]
["aplicar","to apply","Subjuntivo","Subjunctive","Futuro perfecto","Future Perfect","I will have applied","hubiere aplicado","hubieres aplicado","hubiere aplicado","hubiéremos aplicado","hubiereis aplicado","hubieren aplicado","aplicando","applying","aplicado","applied"]
["aplicar","to apply","Subjuntivo","Subjunctive","Pluscuamperfecto","Past Perfect","I had applied","hubiera aplicado","hubieras aplicado","hubiera aplicado","hubiéramos aplicado","hubierais aplicado","hubieran aplicado","aplicando","applying","aplicado","applied"]
["apoyar","to support, hold up, prop up; to back","Imperativo Afirmativo","Imperative Affirmative","Presente","Present","Support! Don't support!",null,"apoya","apoyad",null,"apoye","apoyen","apoyando","supporting","apoyado","supported"]
["apoyar","to support, hold up, prop up; to back","Imperativo Negativo","Imperative Negative","Presente","Present","Support! Don't support!",null,"no apoyes","no apoyéis",null,"no apoye","no apoyen","apoyando","supporting","apoyado","supported"]
["apoyar","to support, hold up, prop up; to back","Indicativo","Indicative","Presente","Present","I support, am supporting","apoyo","apoyas","apoya","apoyamos","apoyáis","apoyan","apoyando","supporting","apoyado","supported"]
["apoyar","to support, hold up, prop up; to back","Indicativo","Indicative","Futuro","Future","I will support","apoyaré","apoyarás","apoyará","apoyaremos","apoyaréis","apoyarán","apoyando","supporting","apoyado","supported"]
["apoyar","to support, hold up, prop up; to back","Indicativo","Indicative","Imperfecto","Imperfect","I was supporting, used to support, supported","apoyaba","apoyabas","apoyaba","apoyábamos","apoyabais","apoyaban","apoyando","supporting","apoyado","supported"]
["apoyar","to support, hold up, prop up; to back","Indicativo","Indicative","Pretérito","Preterite","I supported","apoyé","apoyaste","apoyó","apoyamos","apoyasteis","apoyaron","apoyando","supporting","apoyado","supported"]
["apoyar","to support, hold up, prop up; to back","Indicativo","Indicative","Condicional","Conditional","I would support","apoyaría","apoyarías","apoyaría","apoyaríamos","apoyaríais","apoyarían","apoyando","supporting","apoyado","supported"]
["apoyar","to support, hold up, prop up; to back","Indicativo","Indicative","Presente perfecto","Present Perfect","I have supported","he apoyado","has apoyado","ha apoyado","hemos apoyado","habéis apoyado","han apoyado","apoyando","supporting","apoyado","supported"]
["apoyar","to support, hold up, prop up; to back","Indicativo","Indicative","Futuro perfecto","Future Perfect","I will have supported","habré apoyado","habrás apoyado","habrá apoyado","habremos apoyado","habréis apoyado","habrán apoyado","apoyando","supporting","apoyado","supported"]
["apoyar","to support, hold up, prop up; to back","Indicativo","Indicative","Pluscuamperfecto","Past Perfect","I had supported","había apoyado","habías apoyado","había apoyado","habíamos apoyado","habíais apoyado","habían apoyado","apoyando","supporting","apoyado","supported"]
["apoyar","to support, hold up, prop up; to back","Indicativo","Indicative","Pretérito anterior","Preterite (Archaic)","I had supported","hube apoyado","hubiste apoyado","hubo apoyado","hubimos apoyado","hubisteis apoyado","hubieron apoyado","apoyando","supporting","apoyado","supported"]
["apoyar","to support, hold up, prop up; to back","Indicativo","Indicative","Condicional perfecto","Conditional Perfect","I would have supported","habría apoyado","habrías apoyado","habría apoyado","habríamos apoyado","habríais apoyado","habrían apoyado","apoyando","supporting","apoyado","supported"]
["apoyar","to support, hold up, prop up; to back","Subjuntivo","Subjunctive","Imperfecto","Imperfect","I supported, was supporting","apoyara","apoyaras","apoyara","apoyáramos","apoyarais","apoyaran","apoyando","supporting","apoyado","supported"]
["apoyar","to support, hold up, prop up; to back","Subjuntivo","Subjunctive","Presente","Present","I support, am supporting","apoye","apoyes","apoye","apoyemos","apoyéis","apoyen","apoyando","supporting","apoyado","supported"]
["apoyar","to support, hold up, prop up; to back","Subjuntivo","Subjunctive","Futuro","Future","I will support","apoyare","apoyares","apoyare","apoyáremos","apoyareis","apoyaren","apoyando","supporting","apoyado","supported"]
["apoyar","to support, hold up, prop up; to back","Subjuntivo","Subjunctive","Presente perfecto","Present Perfect","I have supported, supported","haya apoyado","hayas apoyado","haya apoyado","hayamos apoyado","hayáis apoyado","hayan apoyado","apoyando","supporting","apoyado","supported"]
["apoyar","to support, hold up, prop up; to back","Subjuntivo","Subjunctive","Futuro perfecto","Future Perfect","I will have supported","hubiere apoyado","hubieres apoyado","hubiere apoyado","hubiéremos apoyado","hubiereis apoyado","hubieren apoyado","apoyando","supporting","apoyado","supported"]
["apoyar","to support, hold up, prop up; to back","Subjuntivo","Subjunctive","Pluscuamperfecto","Past Perfect","I had supported","hubiera apoyado","hubieras apoyado","hubiera apoyado","hubiéramos apoyado","hubierais apoyado","hubieran apoyado","apoyando","supporting","apoyado","supported"]
["aprender","to learn","Imperativo Afirmativo","Imperative Affirmative","Presente","Present","Learn! Don't learn!",null,"aprende","aprended",null,"aprenda","aprendan","aprendiendo","learning","aprendido","learned"]
["aprender","to learn","Imperativo Negativo","Imperative Negative","Presente","Present","Learn! Don't learn!",null,"no aprendas","no aprendáis",null,"no aprenda","no aprendan","aprendiendo","learning","aprendido","learned"]
["aprender","to learn","Indicativo","Indicative","Presente","Present","I learn, am learning","aprendo","aprendes","aprende","aprendemos","aprendéis","aprenden","aprendiendo","learning","aprendido","learned"]
["aprender","to learn","Indicativo","Indicative","Futuro","Future","I will learn","aprenderé","aprenderás","aprenderá","aprenderemos","aprenderéis","aprenderán","aprendiendo","learning","aprendido","learned"]
["aprender","to learn","Indicativo","Indicative","Imperfecto","Imperfect","I was learning, used to learn, learned","aprendía","aprendías","aprendía","aprendíamos","aprendíais","aprendían","aprendiendo","learning","aprendido","learned"]
["aprender","to learn","Indicativo","Indicative","Pretérito","Preterite","I learned","aprendí","aprendiste","aprendió","aprendimos","aprendisteis","aprendieron","aprendiendo","learning","aprendido","learned"]
["aprender","to learn","Indicativo","Indicative","Condicional","Conditional","I would learn","aprendería","aprenderías","aprendería","aprenderíamos","aprenderíais","aprenderían","aprendiendo","learning","aprendido","learned"]
["aprender","to learn","Indicativo","Indicative","Presente perfecto","Present Perfect","I have learned","he aprendido","has aprendido","ha aprendido","hemos aprendido","habéis aprendido","han aprendido","aprendiendo","learning","aprendido","learned"]
["aprender","to learn","Indicativo","Indicative","Futuro perfecto","Future Perfect","I will have learned","habré aprendido","habrás aprendido","habrá aprendido","habremos aprendido","habréis aprendido","habrán aprendido","aprendiendo","learning","aprendido","learned"]
["aprender","to learn","Indicativo","Indicative","Pluscuamperfecto","Past Perfect","I had learned","había aprendido","habías aprendido","había aprendido","habíamos aprendido","habíais aprendido","habían aprendido","aprendiendo","learning","aprendido","learned"]
["aprender","to learn","Indicativo","Indicative","Pretérito anterior","Preterite (Archaic)","I had learned","hube aprendido","hubiste aprendido","hubo aprendido","hubimos aprendido","hubisteis aprendido","hubieron aprendido","aprendiendo","learning","aprendido","learned"]
["aprender","to learn","Indicativo","Indicative","Condicional perfecto","Conditional Perfect","I would have learned","habría aprendido","habrías aprendido","habría aprendido","habríamos aprendido","habríais aprendido","habrían aprendido","aprendiendo","learning","aprendido","learned"]
["aprender","to learn","Subjuntivo","Subjunctive","Presente","Present","I learn, am learning","aprenda","aprendas","aprenda","aprendamos","aprendáis","aprendan","aprendiendo","learning","aprendido","learned"]
["aprender","to learn","Subjuntivo","Subjunctive","Imperfecto","Imperfect","I learned, was learning","aprendiera","aprendieras","aprendiera","aprendiéramos","aprendierais","aprendieran","aprendiendo","learning","aprendido","learned"]
["aprender","to learn","Subjuntivo","Subjunctive","Futuro","Future","I will learn","aprendiere","aprendieres","aprendiere","aprendiéremos","aprendiereis","aprendieren","aprendiendo","learning","aprendido","learned"]
["aprender","to learn","Subjuntivo","Subjunctive","Presente perfecto","Present Perfect","I have learned, learned","haya aprendido","hayas aprendido","haya aprendido","hayamos aprendido","hayáis aprendido","hayan aprendido","aprendiendo","learning","aprendido","learned"]
["aprender","to learn","Subjuntivo","Subjunctive","Futuro perfecto","Future Perfect","I will have learned","hubiere aprendido","hubieres aprendido","hubiere aprendido","hubiéremos aprendido","hubiereis aprendido","hubieren aprendido","aprendiendo","learning","aprendido","learned"]
["aprender","to learn","Subjuntivo","Subjunctive","Pluscuamperfecto","Past Perfect","I had learned","hubiera aprendido","hubieras aprendido","hubiera aprendido","hubiéramos aprendido","hubierais aprendido","hubieran aprendido","aprendiendo","learning","aprendido","learned"]
["atender","to attend to, pay attention to","Imperativo Afirmativo","Imperative Affirmative","Presente","Present","Attend to! Don't attend to!",null,"atiende","atended",null,"atienda","atiendan","atendiendo","attending to","atendido","attended to"]
["atender","to attend to, pay attention to","Imperativo Negativo","Imperative Negative","Presente","Present","Attend to! Don't attend to!",null,"no atiendas","no atendáis",null,"no atienda","no atiendan","atendiendo","attending to","atendido","attended to"]
["atender","to attend to, pay attention to","Indicativo","Indicative","Presente","Present","I attend to, am attending to","atiendo","atiendes","atiende","atendemos","atendéis","atienden","atendiendo","attending to","atendido","attended to"]
["atender","to attend to, pay attention to","Indicativo","Indicative","Futuro","Future","I will attend to","atenderé","atenderás","atenderá","atenderemos","atenderéis","atenderán","atendiendo","attending to","atendido","attended to"]
["atender","to attend to, pay attention to","Indicativo","Indicative","Imperfecto","Imperfect","I was attending to, used to attend to, attended to","atendía","atendías","atendía","atendíamos","atendíais","atendían","atendiendo","attending to","atendido","attended to"]
["atender","to attend to, pay attention to","Indicativo","Indicative","Pretérito","Preterite","I attended to","atendí","atendiste","atendió","atendimos","atendisteis","atendieron","atendiendo","attending to","atendido","attended to"]
["atender","to attend to, pay attention to","Indicativo","Indicative","Condicional","Conditional","I would attend to","atendería","atenderías","atendería","atenderíamos","atenderíais","atenderían","atendiendo","attending to","atendido","attended to"]
["atender","to attend to, pay attention to","Indicativo","Indicative","Presente perfecto","Present Perfect","I have attended to","he atendido","has atendido","ha atendido","hemos atendido","habéis atendido","han atendido","atendiendo","attending to","atendido","attended to"]
["atender","to attend to, pay attention to","Indicativo","Indicative","Futuro perfecto","Future Perfect","I will have attended to","habré atendido","habrás atendido","habrá atendido","habremos atendido","habréis atendido","habrán atendido","atendiendo","attending to","atendido","attended to"]
["atender","to attend to, pay attention to","Indicativo","Indicative","Pluscuamperfecto","Past Perfect","I had attended to","había atendido","habías atendido","había atendido","habíamos atendido","habíais atendido","habían atendido","atendiendo","attending to","atendido","attended to"]
["atender","to attend to, pay attention to","Indicativo","Indicative","Pretérito anterior","Preterite (Archaic)","I had attended to","hube atendido","hubiste atendido","hubo atendido","hubimos atendido","hubisteis atendido","hubieron atendido","atendiendo","attending to","atendido","attended to"]
["atender","to attend to, pay attention to","Indicativo","Indicative","Condicional perfecto","Conditional Perfect","I would have attended to","habría atendido","habrías atendido","habría atendido","habríamos atendido","habríais atendido","habrían atendido","atendiendo","attending to","atendido","attended to"]
["atender","to attend to, pay attention to","Subjuntivo","Subjunctive","Presente","Present","I attend to, am attending to","atienda","atiendas","atienda","atendamos","atendáis","atiendan","atendiendo","attending to","atendido","attended to"]
["atender","to attend to, pay attention to","Subjuntivo","Subjunctive","Imperfecto","Imperfect","I attended to, was attending to","atendiera","atendieras","atendiera","atendiéramos","atendierais","atendieran","atendiendo","attending to","atendido","attended to"]
["atender","to attend to, pay attention to","Subjuntivo","Subjunctive","Futuro","Future","I will attend to","atendiere","atendieres","atendiere","atendiéremos","atendiereis","atendieren","atendiendo","attending to","atendido","attended to"]
["atender","to attend to, pay attention to","Subjuntivo","Subjunctive","Presente perfecto","Present Perfect","I have attended to, attended to","haya atendido","hayas atendido","haya atendido","hayamos atendido","hayáis atendido","hayan atendido","atendiendo","attending to","atendido","attended to"]
["atender","to attend to, pay attention to","Subjuntivo","Subjunctive","Futuro perfecto","Future Perfect","I will have attended to","hubiere atendido","hubieres atendido","hubiere atendido","hubiéremos atendido","hubiereis atendido","hubieren atendido","atendiendo","attending to","atendido","attended to"]
["atender","to attend to, pay attention to","Subjuntivo","Subjunctive","Pluscuamperfecto","Past Perfect","I had attended to","hubiera atendido","hubieras atendido","hubiera atendido","hubiéramos atendido","hubierais atendido","hubieran atendido","atendiendo","attending to","atendido","attended to"]
["aumentar","to increase, add to, augment; to be on the increase, rise","Imperativo Afirmativo","Imperative Affirmative","Presente","Present","Increase! Don't increase!",null,"aumenta","aumentad",null,"aumente","aumenten","aumentando","increasing","aumentado","increased"]
["aumentar","to increase, add to, augment; to be on the increase, rise","Imperativo Negativo","Imperative Negative","Presente","Present","Increase! Don't increase!",null,"no aumentes","no aumentéis",null,"no aumente","no aumenten","aumentando","increasing","aumentado","increased"]
["aumentar","to increase, add to, augment; to be on the increase, rise","Indicativo","Indicative","Presente","Present","I increase, am increasing","aumento","aumentas","aumenta","aumentamos","aumentáis","aumentan","aumentando","increasing","aumentado","increased"]
["aumentar","to increase, add to, augment; to be on the increase, rise","Indicativo","Indicative","Futuro","Future","I will increase","aumentaré","aumentarás","aumentará","aumentaremos","aumentaréis","aumentarán","aumentando","increasing","aumentado","increased"]
["aumentar","to increase, add to, augment; to be on the increase, rise","Indicativo","Indicative","Imperfecto","Imperfect","I was increasing, used to increase, increased","aumentaba","aumentabas","aumentaba","aumentábamos","aumentabais","aumentaban","aumentando","increasing","aumentado","increased"]
["aumentar","to increase, add to, augment; to be on the increase, rise","Indicativo","Indicative","Pretérito","Preterite","I increased","aumenté","aumentaste","aumentó","aumentamos","aumentasteis","aumentaron","aumentando","increasing","aumentado","increased"]
["aumentar","to increase, add to, augment; to be on the increase, rise","Indicativo","Indicative","Condicional","Conditional","I would increase","aumentaría","aumentarías","aumentaría","aumentaríamos","aumentaríais","aumentarían","aumentando","increasing","aumentado","increased"]
["aumentar","to increase, add to, augment; to be on the increase, rise","Indicativo","Indicative","Presente perfecto","Present Perfect","I have increased","he aumentado","has aumentado","ha aumentado","hemos aumentado","habéis aumentado","han aumentado","aumentando","increasing","aumentado","increased"]
["aumentar","to increase, add to, augment; to be on the increase, rise","Indicativo","Indicative","Futuro perfecto","Future Perfect","I will have increased","habré aumentado","habrás aumentado","habrá aumentado","habremos aumentado","habréis aumentado","habrán aumentado","aumentando","increasing","aumentado","increased"]
["aumentar","to increase, add to, augment; to be on the increase, rise","Indicativo","Indicative","Pluscuamperfecto","Past Perfect","I had increased","había aumentado","habías aumentado","había aumentado","habíamos aumentado","habíais aumentado","habían aumentado","aumentando","increasing","aumentado","increased"]
["aumentar","to increase, add to, augment; to be on the increase, rise","Indicativo","Indicative","Pretérito anterior","Preterite (Archaic)","I had increased","hube aumentado","hubiste aumentado","hubo aumentado","hubimos aumentado","hubisteis aumentado","hubieron aumentado","aumentando","increasing","aumentado","increased"]
["aumentar","to increase, add to, augment; to be on the increase, rise","Indicativo","Indicative","Condicional perfecto","Conditional Perfect","I would have increased","habría aumentado","habrías aumentado","habría aumentado","habríamos aumentado","habríais aumentado","habrían aumentado","aumentando","increasing","aumentado","increased"]
["aumentar","to increase, add to, augment; to be on the increase, rise","Subjuntivo","Subjunctive","Presente","Present","I increase, am increasing","aumente","aumentes","aumente","aumentemos","aumentéis","aumenten","aumentando","increasing","aumentado","increased"]
["aumentar","to increase, add to, augment; to be on the increase, rise","Subjuntivo","Subjunctive","Imperfecto","Imperfect","I increased, was increasing","aumentara","aumentaras","aumentara","aumentáramos","aumentarais","aumentaran","aumentando","increasing","aumentado","increased"]
["aumentar","to increase, add to, augment; to be on the increase, rise","Subjuntivo","Subjunctive","Futuro","Future","I will increase","aumentare","aumentares","aumentare","aumentáremos","aumentareis","aumentaren","aumentando","increasing","aumentado","increased"]
["aumentar","to increase, add to, augment; to be on the increase, rise","Subjuntivo","Subjunctive","Presente perfecto","Present Perfect","I have increased, increased","haya aumentado","hayas aumentado","haya aumentado","hayamos aumentado","hayáis aumentado","hayan aumentado","aumentando","increasing","aumentado","increased"]
["aumentar","to increase, add to, augment; to be on the increase, rise","Subjuntivo","Subjunctive","Futuro perfecto","Future Perfect","I will have increased","hubiere aumentado","hubieres aumentado","hubiere aumentado","hubiéremos aumentado","hubiereis aumentado","hubieren aumentado","aumentando","increasing","aumentado","increased"]
["aumentar","to increase, add to, augment; to be on the increase, rise","Subjuntivo","Subjunctive","Pluscuamperfecto","Past Perfect","I had increased","hubiera aumentado","hubieras aumentado","hubiera aumentado","hubiéramos aumentado","hubierais aumentado","hubieran aumentado","aumentando","increasing","aumentado","increased"]
["avanzar","to advance, move forward","Imperativo Afirmativo","Imperative Affirmative","Presente","Present","Advance! Don't advance!",null,"avanza","avanzad",null,"avance","avancen","avanzando","advancing","avanzado","advanced"]
["avanzar","to advance, move forward","Imperativo Negativo","Imperative Negative","Presente","Present","Advance! Don't advance!",null,"no avances","no avancéis",null,"no avance","no avancen","avanzando","advancing","avanzado","advanced"]
["avanzar","to advance, move forward","Indicativo","Indicative","Presente","Present","I advance, am advancing","avanzo","avanzas","avanza","avanzamos","avanzáis","avanzan","avanzando","advancing","avanzado","advanced"]
["avanzar","to advance, move forward","Indicativo","Indicative","Futuro","Future","I will advance","avanzaré","avanzarás","avanzará","avanzaremos","avanzaréis","avanzarán","avanzando","advancing","avanzado","advanced"]
["avanzar","to advance, move forward","Indicativo","Indicative","Imperfecto","Imperfect","I was advancing, used to advance, advanced","avanzaba","avanzabas","avanzaba","avanzábamos","avanzabais","avanzaban","avanzando","advancing","avanzado","advanced"]
["avanzar","to advance, move forward","Indicativo","Indicative","Pretérito","Preterite","I advanced","avancé","avanzaste","avanzó","avanzamos","avanzasteis","avanzaron","avanzando","advancing","avanzado","advanced"]
["avanzar","to advance, move forward","Indicativo","Indicative","Condicional","Conditional","I would advance","avanzaría","avanzarías","avanzaría","avanzaríamos","avanzaríais","avanzarían","avanzando","advancing","avanzado","advanced"]
["avanzar","to advance, move forward","Indicativo","Indicative","Presente perfecto","Present Perfect","I have advanced","he avanzado","has avanzado","ha avanzado","hemos avanzado","habéis avanzado","han avanzado","avanzando","advancing","avanzado","advanced"]
["avanzar","to advance, move forward","Indicativo","Indicative","Futuro perfecto","Future Perfect","I will have advanced","habré avanzado","habrás avanzado","habrá avanzado","habremos avanzado","habréis avanzado","habrán avanzado","avanzando","advancing","avanzado","advanced"]
["avanzar","to advance, move forward","Indicativo","Indicative","Pluscuamperfecto","Past Perfect","I had advanced","había avanzado","habías avanzado","había avanzado","habíamos avanzado","habíais avanzado","habían avanzado","avanzando","advancing","avanzado","advanced"]
["avanzar","to advance, move forward","Indicativo","Indicative","Pretérito anterior","Preterite (Archaic)","I had advanced","hube avanzado","hubiste avanzado","hubo avanzado","hubimos avanzado","hubisteis avanzado","hubieron avanzado","avanzando","advancing","avanzado","advanced"]
["avanzar","to advance, move forward","Indicativo","Indicative","Condicional perfecto","Conditional Perfect","I would have advanced","habría avanzado","habrías avanzado","habría avanzado","habríamos avanzado","habríais avanzado","habrían avanzado","avanzando","advancing","avanzado","advanced"]
["avanzar","to advance, move forward","Subjuntivo","Subjunctive","Presente","Present","I advance, am advancing","avance","avances","avance","avancemos","avancéis","avancen","avanzando","advancing","avanzado","advanced"]
["avanzar","to advance, move forward","Subjuntivo","Subjunctive","Imperfecto","Imperfect","I advanced, was advancing","avanzara","avanzaras","avanzara","avanzáramos","avanzarais","avanzaran","avanzando","advancing","avanzado","advanced"]
["avanzar","to advance, move forward","Subjuntivo","Subjunctive","Futuro","Future","I will advance","avanzare","avanzares","avanzare","avanzáremos","avanzareis","avanzaren","avanzando","advancing","avanzado","advanced"]
["avanzar","to advance, move forward","Subjuntivo","Subjunctive","Presente perfecto","Present Perfect","I have advanced, advanced","haya avanzado","hayas avanzado","haya avanzado","hayamos avanzado","hayáis avanzado","hayan avanzado","avanzando","advancing","avanzado","advanced"]
["avanzar","to advance, move forward","Subjuntivo","Subjunctive","Futuro perfecto","Future Perfect","I will have advanced","hubiere avanzado","hubieres avanzado","hubiere avanzado","hubiéremos avanzado","hubiereis avanzado","hubieren avanzado","avanzando","advancing","avanzado","advanced"]
["avanzar","to advance, move forward","Subjuntivo","Subjunctive","Pluscuamperfecto","Past Perfect","I had advanced","hubiera avanzado","hubieras avanzado","hubiera avanzado","hubiéramos avanzado","hubierais avanzado","hubieran avanzado","avanzando","advancing","avanzado","advanced"]
["ayudar","to help","Imperativo Afirmativo","Imperative Affirmative","Presente","Present","Help! Don't help!",null,"ayuda","ayudad",null,"ayude","ayuden","ayudando","helping","ayudado","helped"]
["ayudar","to help","Imperativo Negativo","Imperative Negative","Presente","Present","Help! Don't help!",null,"no ayudes","no ayudéis",null,"no ayude","no ayuden","ayudando","helping","ayudado","helped"]
["ayudar","to help","Indicativo","Indicative","Presente","Present","I help, am helping","ayudo","ayudas","ayuda","ayudamos","ayudáis","ayudan","ayudando","helping","ayudado","helped"]
["ayudar","to help","Indicativo","Indicative","Futuro","Future","I will help","ayudaré","ayudarás","ayudará","ayudaremos","ayudaréis","ayudarán","ayudando","helping","ayudado","helped"]
["ayudar","to help","Indicativo","Indicative","Imperfecto","Imperfect","I was helping, used to help, helped","ayudaba","ayudabas","ayudaba","ayudábamos","ayudabais","ayudaban","ayudando","helping","ayudado","helped"]
["ayudar","to help","Indicativo","Indicative","Pretérito","Preterite","I helped","ayudé","ayudaste","ayudó","ayudamos","ayudasteis","ayudaron","ayudando","helping","ayudado","helped"]
["ayudar","to help","Indicativo","Indicative","Condicional","Conditional","I would help","ayudaría","ayudarías","ayudaría","ayudaríamos","ayudaríais","ayudarían","ayudando","helping","ayudado","helped"]
["ayudar","to help","Indicativo","Indicative","Presente perfecto","Present Perfect","I have helped","he ayudado","has ayudado","ha ayudado","hemos ayudado","habéis ayudado","han ayudado","ayudando","helping","ayudado","helped"]
["ayudar","to help","Indicativo","Indicative","Futuro perfecto","Future Perfect","I will have helped","habré ayudado","habrás ayudado","habrá ayudado","habremos ayudado","habréis ayudado","habrán ayudado","ayudando","helping","ayudado","helped"]
["ayudar","to help","Indicativo","Indicative","Pluscuamperfecto","Past Perfect","I had helped","había ayudado","habías ayudado","había ayudado","habíamos ayudado","habíais ayudado","habían ayudado","ayudando","helping","ayudado","helped"]
["ayudar","to help","Indicativo","Indicative","Pretérito anterior","Preterite (Archaic)","I had helped","hube ayudado","hubiste ayudado","hubo ayudado","hubimos ayudado","hubisteis ayudado","hubieron ayudado","ayudando","helping","ayudado","helped"]
["ayudar","to help","Indicativo","Indicative","Condicional perfecto","Conditional Perfect","I would have helped","habría ayudado","habrías ayudado","habría ayudado","habríamos ayudado","habríais ayudado","habrían ayudado","ayudando","helping","ayudado","helped"]
["ayudar","to help","Subjuntivo","Subjunctive","Presente","Present","I help, am helping","ayude","ayudes","ayude","ayudemos","ayudéis","ayuden","ayudando","helping","ayudado","helped"]
["ayudar","to help","Subjuntivo","Subjunctive","Imperfecto","Imperfect","I helped, was helping","ayudara","ayudaras","ayudara","ayudáramos","ayudarais","ayudaran","ayudando","helping","ayudado","helped"]
["ayudar","to help","Subjuntivo","Subjunctive","Futuro","Future","I will help","ayudare","ayudares","ayudare","ayudáremos","ayudareis","ayudaren","ayudando","helping","ayudado","helped"]
["ayudar","to help","Subjuntivo","Subjunctive","Presente perfecto","Present Perfect","I have helped, helped","haya ayudado","hayas ayudado","haya ayudado","hayamos ayudado","hayáis ayudado","hayan ayudado","ayudando","helping","ayudado","helped"]
["ayudar","to help","Subjuntivo","Subjunctive","Futuro perfecto","Future Perfect","I will have helped","hubiere ayudado","hubieres ayudado","hubiere ayudado","hubiéremos ayudado","hubiereis ayudado","hubieren ayudado","ayudando","helping","ayudado","helped"]
["ayudar","to help","Subjuntivo","Subjunctive","Pluscuamperfecto","Past Perfect","I had helped","hubiera ayudado","hubieras ayudado","hubiera ayudado","hubiéramos ayudado","hubierais ayudado","hubieran ayudado","ayudando","helping","ayudado","helped"]
["bajar","to lower, go down, descend, download","Imperativo Afirmativo","Imperative Affirmative","Presente","Present","Lower! Don't lower!",null,"baja","bajad",null,"baje","bajen","bajando","lowering","bajado","lowered"]
["bajar","to lower, go down, descend, download","Imperativo Negativo","Imperative Negative","Presente","Present","Lower! Don't lower!",null,"no bajes","no bajéis",null,"no baje","no bajen","bajando","lowering","bajado","lowered"]
["bajar","to lower, go down, descend, download","Indicativo","Indicative","Presente","Present","I lower, am lowering","bajo","bajas","baja","bajamos","bajáis","bajan","bajando","lowering","bajado","lowered"]
["bajar","to lower, go down, descend, download","Indicativo","Indicative","Futuro","Future","I will lower","bajaré","bajarás","bajará","bajaremos","bajaréis","bajarán","bajando","lowering","bajado","lowered"]
["bajar","to lower, go down, descend, download","Indicativo","Indicative","Imperfecto","Imperfect","I was lowering, used to lower, lowered","bajaba","bajabas","bajaba","bajábamos","bajabais","bajaban","bajando","lowering","bajado","lowered"]
["bajar","to lower, go down, descend, download","Indicativo","Indicative","Pretérito","Preterite","I lowered","bajé","bajaste","bajó","bajamos","bajasteis","bajaron","bajando","lowering","bajado","lowered"]
["bajar","to lower, go down, descend, download","Indicativo","Indicative","Condicional","Conditional","I would lower","bajaría","bajarías","bajaría","bajaríamos","bajaríais","bajarían","bajando","lowering","bajado","lowered"]
["bajar","to lower, go down, descend, download","Indicativo","Indicative","Presente perfecto","Present Perfect","I have lowered","he bajado","has bajado","ha bajado","hemos bajado","habéis bajado","han bajado","bajando","lowering","bajado","lowered"]
["bajar","to lower, go down, descend, download","Indicativo","Indicative","Futuro perfecto","Future Perfect","I will have lowered","habré bajado","habrás bajado","habrá bajado","habremos bajado","habréis bajado","habrán bajado","bajando","lowering","bajado","lowered"]
["bajar","to lower, go down, descend, download","Indicativo","Indicative","Pluscuamperfecto","Past Perfect","I had lowered","había bajado","habías bajado","había bajado","habíamos bajado","habíais bajado","habían bajado","bajando","lowering","bajado","lowered"]
["bajar","to lower, go down, descend, download","Indicativo","Indicative","Pretérito anterior","Preterite (Archaic)","I had lowered","hube bajado","hubiste bajado","hubo bajado","hubimos bajado","hubisteis bajado","hubieron bajado","bajando","lowering","bajado","lowered"]
["bajar","to lower, go down, descend, download","Indicativo","Indicative","Condicional perfecto","Conditional Perfect","I would have lowered","habría bajado","habrías bajado","habría bajado","habríamos bajado","habríais bajado","habrían bajado","bajando","lowering","bajado","lowered"]
["bajar","to lower, go down, descend, download","Subjuntivo","Subjunctive","Presente","Present","I lower, am lowering","baje","bajes","baje","bajemos","bajéis","bajen","bajando","lowering","bajado","lowered"]
["bajar","to lower, go down, descend, download","Subjuntivo","Subjunctive","Imperfecto","Imperfect","I lowered, was lowering","bajara","bajaras","bajara","bajáramos","bajarais","bajaran","bajando","lowering","bajado","lowered"]
["bajar","to lower, go down, descend, download","Subjuntivo","Subjunctive","Futuro","Future","I will lower","bajare","bajares","bajare","bajáremos","bajareis","bajaren","bajando","lowering","bajado","lowered"]
["bajar","to lower, go down, descend, download","Subjuntivo","Subjunctive","Presente perfecto","Present Perfect","I have lowered, lowered","haya bajado","hayas bajado","haya bajado","hayamos bajado","hayáis bajado","hayan bajado","bajando","lowering","bajado","lowered"]
["bajar","to lower, go down, descend, download","Subjuntivo","Subjunctive","Futuro perfecto","Future Perfect","I will have lowered","hubiere bajado","hubieres bajado","hubiere bajado","hubiéremos bajado","hubiereis bajado","hubieren bajado","bajando","lowering","bajado","lowered"]
["bajar","to lower, go down, descend, download","Subjuntivo","Subjunctive","Pluscuamperfecto","Past Perfect","I had lowered","hubiera bajado","hubieras bajado","hubiera bajado","hubiéramos bajado","hubierais bajado","hubieran bajado","bajando","lowering","bajado","lowered"]
["buscar","to search for, look for","Imperativo Afirmativo","Imperative Affirmative","Presente","Present","Search for! Don't search for!",null,"busca","buscad",null,"busque","busquen","buscando","searching for","buscado","searched for"]
["buscar","to search for, look for","Imperativo Negativo","Imperative Negative","Presente","Present","Search for! Don't search for!",null,"no busques","no busquéis",null,"no busque","no busquen","buscando","searching for","buscado","searched for"]
["buscar","to search for, look for","Indicativo","Indicative","Presente","Present","I search for, am searching for","busco","buscas","busca","buscamos","buscáis","buscan","buscando","searching for","buscado","searched for"]
["buscar","to search for, look for","Indicativo","Indicative","Futuro","Future","I will search for","buscaré","buscarás","buscará","buscaremos","buscaréis","buscarán","buscando","searching for","buscado","searched for"]
["buscar","to search for, look for","Indicativo","Indicative","Imperfecto","Imperfect","I was searching for, used to search for, searched for","buscaba","buscabas","buscaba","buscábamos","buscabais","buscaban","buscando","searching for","buscado","searched for"]
["buscar","to search for, look for","Indicativo","Indicative","Pretérito","Preterite","I searched for","busqué","buscaste","buscó","buscamos","buscasteis","buscaron","buscando","searching for","buscado","searched for"]
["buscar","to search for, look for","Indicativo","Indicative","Condicional","Conditional","I would search for","buscaría","buscarías","buscaría","buscaríamos","buscaríais","buscarían","buscando","searching for","buscado","searched for"]
["buscar","to search for, look for","Indicativo","Indicative","Presente perfecto","Present Perfect","I have searched for","he buscado","has buscado","ha buscado","hemos buscado","habéis buscado","han buscado","buscando","searching for","buscado","searched for"]
["buscar","to search for, look for","Indicativo","Indicative","Futuro perfecto","Future Perfect","I will have searched for","habré buscado","habrás buscado","habrá buscado","habremos buscado","habréis buscado","habrán buscado","buscando","searching for","buscado","searched for"]
["buscar","to search for, look for","Indicativo","Indicative","Pluscuamperfecto","Past Perfect","I had searched for","había buscado","habías buscado","había buscado","habíamos buscado","habíais buscado","habían buscado","buscando","searching for","buscado","searched for"]
["buscar","to search for, look for","Indicativo","Indicative","Pretérito anterior","Preterite (Archaic)","I had searched for","hube buscado","hubiste buscado","hubo buscado","hubimos buscado","hubisteis buscado","hubieron buscado","buscando","searching for","buscado","searched for"]
["buscar","to search for, look for","Indicativo","Indicative","Condicional perfecto","Conditional Perfect","I would have searched for","habría buscado","habrías buscado","habría buscado","habríamos buscado","habríais buscado","habrían buscado","buscando","searching for","buscado","searched for"]
["buscar","to search for, look for","Subjuntivo","Subjunctive","Presente","Present","I search for, am searching for","busque","busques","busque","busquemos","busquéis","busquen","buscando","searching for","buscado","searched for"]
["buscar","to search for, look for","Subjuntivo","Subjunctive","Imperfecto","Imperfect","I searched for, was searching for","buscara","buscaras","buscara","buscáramos","buscarais","buscaran","buscando","searching for","buscado","searched for"]
["buscar","to search for, look for","Subjuntivo","Subjunctive","Futuro","Future","I will search for","buscare","buscares","buscare","buscáremos","buscareis","buscaren","buscando","searching for","buscado","searched for"]
["buscar","to search for, look for","Subjuntivo","Subjunctive","Presente perfecto","Present Perfect","I have searched for, searched for","haya buscado","hayas buscado","haya buscado","hayamos buscado","hayáis buscado","hayan buscado","buscando","searching for","buscado","searched for"]
["buscar","to search for, look for","Subjuntivo","Subjunctive","Futuro perfecto","Future Perfect","I will have searched for","hubiere buscado","hubieres buscado","hubiere buscado","hubiéremos buscado","hubiereis buscado","hubieren buscado","buscando","searching for","buscado","searched for"]
["buscar","to search for, look for","Subjuntivo","Subjunctive","Pluscuamperfecto","Past Perfect","I had searched for","hubiera buscado","hubieras buscado","hubiera buscado","hubiéramos buscado","hubierais buscado","hubieran buscado","buscando","searching for","buscado","searched for"]
["caber","to fit","Imperativo Afirmativo","Imperative Affirmative","Presente","Present","Fit! Don't fit!",null,"cabe","cabed",null,"quepa","quepan","cabiendo","fitting","cabido","fit"]
["caber","to fit","Imperativo Negativo","Imperative Negative","Presente","Present","Fit! Don't fit!",null,"no quepas","no quepáis",null,"no quepa","no quepan","cabiendo","fitting","cabido","fit"]
["caber","to fit","Indicativo","Indicative","Presente","Present","I fit","quepo","cabes","cabe","cabemos","cabéis","caben","cabiendo","fitting","cabido","fit"]
["caber","to fit","Indicativo","Indicative","Futuro","Future","I will fit","cabré","cabrás","cabrá","cabremos","cabréis","cabrán","cabiendo","fitting","cabido","fit"]
["caber","to fit","Indicativo","Indicative","Imperfecto","Imperfect","I used to fit, fit","cabía","cabías","cabía","cabíamos","cabíais","cabían","cabiendo","fitting","cabido","fit"]
["caber","to fit","Indicativo","Indicative","Pretérito","Preterite","I fit","cupe","cupiste","cupo","cupimos","cupisteis","cupieron","cabiendo","fitting","cabido","fit"]
["caber","to fit","Indicativo","Indicative","Condicional","Conditional","I would fit","cabría","cabrías","cabría","cabríamos","cabríais","cabrían","cabiendo","fitting","cabido","fit"]
["caber","to fit","Indicativo","Indicative","Presente perfecto","Present Perfect","I have fit","he cabido","has cabido","ha cabido","hemos cabido","habéis cabido","han cabido","cabiendo","fitting","cabido","fit"]
["caber","to fit","Indicativo","Indicative","Futuro perfecto","Future Perfect","I will have fit","habré cabido","habrás cabido","habrá cabido","habremos cabido","habréis cabido","habrán cabido","cabiendo","fitting","cabido","fit"]
["caber","to fit","Indicativo","Indicative","Pluscuamperfecto","Past Perfect","I had fit","había cabido","habías cabido","había cabido","habíamos cabido","habíais cabido","habían cabido","cabiendo","fitting","cabido","fit"]
["caber","to fit","Indicativo","Indicative","Pretérito anterior","Preterite (Archaic)","I had fit","hube cabido","hubiste cabido","hubo cabido","hubimos cabido","hubisteis cabido","hubieron cabido","cabiendo","fitting","cabido","fit"]
["caber","to fit","Indicativo","Indicative","Condicional perfecto","Conditional Perfect","I would have fit","habría cabido","habrías cabido","habría cabido","habríamos cabido","habríais cabido","habrían cabido","cabiendo","fitting","cabido","fit"]
["caber","to fit","Subjuntivo","Subjunctive","Presente","Present","I fit","quepa","quepas","quepa","quepamos","quepáis","quepan","cabiendo","fitting","cabido","fit"]
["caber","to fit","Subjuntivo","Subjunctive","Imperfecto","Imperfect","I fit, was fitting","cupiera","cupieras","cupiera","cupiéramos","cupierais","cupieran","cabiendo","fitting","cabido","fit"]
["caber","to fit","Subjuntivo","Subjunctive","Futuro","Future","I will fit","cupiere","cupieres","cupiere","cupiéremos","cupiereis","cupieren","cabiendo","fitting","cabido","fit"]
["caber","to fit","Subjuntivo","Subjunctive","Presente perfecto","Present Perfect","I have fit, fit","haya cabido","hayas cabido","haya cabido","hayamos cabido","hayáis cabido","hayan cabido","cabiendo","fitting","cabido","fit"]
["caber","to fit","Subjuntivo","Subjunctive","Futuro perfecto","Future Perfect","I will have fit","hubiere cabido","hubieres cabido","hubiere cabido","hubiéremos cabido","hubiereis cabido","hubieren cabido","cabiendo","fitting","cabido","fit"]
["caber","to fit","Subjuntivo","Subjunctive","Pluscuamperfecto","Past Perfect","I had fit","hubiera cabido","hubieras cabido","hubiera cabido","hubiéramos cabido","hubierais cabido","hubieran cabido","cabiendo","fitting","cabido","fit"]
["caer","to fall","Imperativo Afirmativo","Imperative Affirmative","Presente","Present","Fall! Don't fall!",null,"cae","caed",null,"caiga","caigan","cayendo","falling","caído","fallen"]
["caer","to fall","Imperativo Negativo","Imperative Negative","Presente","Present","Fall! Don't fall!",null,"no caigas","no caigáis",null,"no caiga","no caigan","cayendo","falling","caído","fallen"]
["caer","to fall","Indicativo","Indicative","Presente","Present","I fall, am falling","caigo","caes","cae","caemos","caéis","caen","cayendo","falling","caído","fallen"]
["caer","to fall","Indicativo","Indicative","Futuro","Future","I will fall","caeré","caerás","caerá","caeremos","caeréis","caerán","cayendo","falling","caído","fallen"]
["caer","to fall","Indicativo","Indicative","Imperfecto","Imperfect","I was falling, used to fall, fell","caía","caías","caía","caíamos","caíais","caían","cayendo","falling","caído","fallen"]
["caer","to fall","Indicativo","Indicative","Pretérito","Preterite","I fell","caí","caíste","cayó","caímos","caísteis","cayeron","cayendo","falling","caído","fallen"]
["caer","to fall","Indicativo","Indicative","Condicional","Conditional","I would fall","caería","caerías","caería","caeríamos","caeríais","caerían","cayendo","falling","caído","fallen"]
["caer","to fall","Indicativo","Indicative","Presente perfecto","Present Perfect","I have fallen","he caído","has caído","ha caído","hemos caído","habéis caído","han caído","cayendo","falling","caído","fallen"]
["caer","to fall","Indicativo","Indicative","Futuro perfecto","Future Perfect","I will have fallen","habré caído","habrás caído","habrá caído","habremos caído","habréis caído","habrán caído","cayendo","falling","caído","fallen"]
["caer","to fall","Indicativo","Indicative","Pluscuamperfecto","Past Perfect","I had fallen","había caído","habías caído","había caído","habíamos caído","habíais caído","habían caído","cayendo","falling","caído","fallen"]
["caer","to fall","Indicativo","Indicative","Pretérito anterior","Preterite (Archaic)","I had fallen","hube caído","hubiste caído","hubo caído","hubimos caído","hubisteis caído","hubieron caído","cayendo","falling","caído","fallen"]
["caer","to fall","Indicativo","Indicative","Condicional perfecto","Conditional Perfect","I would have fallen","habría caído","habrías caído","habría caído","habríamos caído","habríais caído","habrían caído","cayendo","falling","caído","fallen"]
["caer","to fall","Subjuntivo","Subjunctive","Presente","Present","I fall, am falling","caiga","caigas","caiga","caigamos","caigáis","caigan","cayendo","falling","caído","fallen"]
["caer","to fall","Subjuntivo","Subjunctive","Imperfecto","Imperfect","I fell, was falling","cayera","cayeras","cayera","cayéramos","cayerais","cayeran","cayendo","falling","caído","fallen"]
["caer","to fall","Subjuntivo","Subjunctive","Futuro","Future","I will fall","cayere","cayeres","cayere","cayéremos","cayereis","cayeren","cayendo","falling","caído","fallen"]
["caer","to fall","Subjuntivo","Subjunctive","Presente perfecto","Present Perfect","I have fallen, fell","haya caído","hayas caído","haya caído","hayamos caído","hayáis caído","hayan caído","cayendo","falling","caído","fallen"]
["caer","to fall","Subjuntivo","Subjunctive","Futuro perfecto","Future Perfect","I will have fallen","hubiere caído","hubieres caído","hubiere caído","hubiéremos caído","hubiereis caído","hubieren caído","cayendo","falling","caído","fallen"]
["caer","to fall","Subjuntivo","Subjunctive","Pluscuamperfecto","Past Perfect","I had fallen","hubiera caído","hubieras caído","hubiera caído","hubiéramos caído","hubierais caído","hubieran caído","cayendo","falling","caído","fallen"]
["cambiar","to change","Indicativo","Indicative","Presente","Present",null,"cambio","cambias","cambia","cambiamos","cambiáis","cambian","cambiando",null,"cambiado"]
["cambiar","to change","Indicativo","Indicative","Futuro","Future",null,"cambiaré","cambiarás","cambiará","cambiaremos","cambiaréis","cambiarán","cambiando",null,"cambiado"]
["cambiar","to change","Indicativo","Indicative","Imperfecto","Imperfect",null,"cambiaba","cambiabas","cambiaba","cambiábamos","cambiabais","cambiaban","cambiando",null,"cambiado"]
["cambiar","to change","Indicativo","Indicative","Pretérito","Preterite",null,"cambié","cambiaste","cambió","cambiamos","cambiasteis","cambiaron","cambiando",null,"cambiado"]
["cambiar","to change","Indicativo","Indicative","Condicional","Conditional",null,"cambiaría","cambiarías","cambiaría","cambiaríamos","cambiaríais","cambiarían","cambiando",null,"cambiado"]
["cambiar","to change","Subjuntivo","Subjunctive","Presente","Present",null,"cambie","cambies","cambie","cambiemos","cambiéis","cambien","cambiando",null,"cambiado"]
["cambiar","to change","Subjuntivo","Subjunctive","Imperfecto","Imperfect",null,"cambiara","cambiaras","cambiara","cambiáramos","cambiarais","cambiaran","cambiando",null,"cambiado"]
["cambiar","to change","Subjuntivo","Subjunctive","Futuro","Future",null,"cambiare","cambiares","cambiare","cambiáremos","cambiareis","cambiaren","cambiando",null,"cambiado"]
["cambiar","to change","Imperativo Afirmativo","Imperative Affirmative","Presente","Present",null,null,"cambia","cambie","cambiemos","cambiad","cambien","cambiando",null,"cambiado"]
["cambiar","to change","Imperativo Negativo","Imperative Negative","Presente","Present",null,null,"no cambies","no cambie","no cambiemos","no cambiéis","no cambien","cambiando",null,"cambiado"]
["cargar","to load, load up; to charge","Imperativo Afirmativo","Imperative Affirmative","Presente","Present","Load! Don't load!",null,"carga","cargad",null,"cargue","carguen","cargando","loading","cargado","loaded"]
["cargar","to load, load up; to charge","Imperativo Negativo","Imperative Negative","Presente","Present","Load! Don't load!",null,"no cargues","no carguéis",null,"no cargue","no carguen","cargando","loading","cargado","loaded"]
["cargar","to load, load up; to charge","Indicativo","Indicative","Presente","Present","I load, am loading","cargo","cargas","carga","cargamos","cargáis","cargan","cargando","loading","cargado","loaded"]
["cargar","to load, load up; to charge","Indicativo","Indicative","Futuro","Future","I will load","cargaré","cargarás","cargará","cargaremos","cargaréis","cargarán","cargando","loading","cargado","loaded"]
["cargar","to load, load up; to charge","Indicativo","Indicative","Imperfecto","Imperfect","I was loading, used to load, loaded","cargaba","cargabas","cargaba","cargábamos","cargabais","cargaban","cargando","loading","cargado","loaded"]
["cargar","to load, load up; to charge","Indicativo","Indicative","Pretérito","Preterite","I loaded","cargué","cargaste","cargó","cargamos","cargasteis","cargaron","cargando","loading","cargado","loaded"]
["cargar","to load, load up; to charge","Indicativo","Indicative","Condicional","Conditional","I would load","cargaría","cargarías","cargaría","cargaríamos","cargaríais","cargarían","cargando","loading","cargado","loaded"]
["cargar","to load, load up; to charge","Indicativo","Indicative","Presente perfecto","Present Perfect","I have loaded","he cargado","has cargado","ha cargado","hemos cargado","habéis cargado","han cargado","cargando","loading","cargado","loaded"]
["cargar","to load, load up; to charge","Indicativo","Indicative","Futuro perfecto","Future Perfect","I will have loaded","habré cargado","habrás cargado","habrá cargado","habremos cargado","habréis cargado","habrán cargado","cargando","loading","cargado","loaded"]
["cargar","to load, load up; to charge","Indicativo","Indicative","Pluscuamperfecto","Past Perfect","I had loaded","había cargado","habías cargado","había cargado","habíamos cargado","habíais cargado","habían cargado","cargando","loading","cargado","loaded"]
["cargar","to load, load up; to charge","Indicativo","Indicative","Pretérito anterior","Preterite (Archaic)","I had loaded","hube cargado","hubiste cargado","hubo cargado","hubimos cargado","hubisteis cargado","hubieron cargado","cargando","loading","cargado","loaded"]
["cargar","to load, load up; to charge","Indicativo","Indicative","Condicional perfecto","Conditional Perfect","I would have loaded","habría cargado","habrías cargado","habría cargado","habríamos cargado","habríais cargado","habrían cargado","cargando","loading","cargado","loaded"]
["cargar","to load, load up; to charge","Subjuntivo","Subjunctive","Presente","Present","I load, am loading","cargue","cargues","cargue","carguemos","carguéis","carguen","cargando","loading","cargado","loaded"]
["cargar","to load, load up; to charge","Subjuntivo","Subjunctive","Imperfecto","Imperfect","I loaded, was loading","cargara","cargaras","cargara","cargáramos","cargarais","cargaran","cargando","loading","cargado","loaded"]
["cargar","to load, load up; to charge","Subjuntivo","Subjunctive","Futuro","Future","I will load","cargare","cargares","cargare","cargáremos","cargareis","cargaren","cargando","loading","cargado","loaded"]
["cargar","to load, load up; to charge","Subjuntivo","Subjunctive","Presente perfecto","Present Perfect","I have loaded, loaded","haya cargado","hayas cargado","haya cargado","hayamos cargado","hayáis cargado","hayan cargado","cargando","loading","cargado","loaded"]
["cargar","to load, load up; to charge","Subjuntivo","Subjunctive","Futuro perfecto","Future Perfect","I will have loaded","hubiere cargado","hubieres cargado","hubiere cargado","hubiéremos cargado","hubiereis cargado","hubieren cargado","cargando","loading","cargado","loaded"]
["cargar","to load, load up; to charge","Subjuntivo","Subjunctive","Pluscuamperfecto","Past Perfect","I had loaded","hubiera cargado","hubieras cargado","hubiera cargado","hubiéramos cargado","hubierais cargado","hubieran cargado","cargando","loading","cargado","loaded"]
["cerrar","to close, shut","Imperativo Afirmativo","Imperative Affirmative","Presente","Present","Close! Don't close!",null,"cierra","cerrad",null,"cierre","cierren","cerrando","closing","cerrado","closed"]
["cerrar","to close, shut","Imperativo Negativo","Imperative Negative","Presente","Present","Close! Don't close!",null,"no cierres","no cerréis",null,"no cierre","no cierren","cerrando","closing","cerrado","closed"]
["cerrar","to close, shut","Indicativo","Indicative","Presente","Present","I close, am closing","cierro","cierras","cierra","cerramos","cerráis","cierran","cerrando","closing","cerrado","closed"]
["cerrar","to close, shut","Indicativo","Indicative","Futuro","Future","I will close","cerraré","cerrarás","cerrará","cerraremos","cerraréis","cerrarán","cerrando","closing","cerrado","closed"]
["cerrar","to close, shut","Indicativo","Indicative","Imperfecto","Imperfect","I was closing, used to close, closed","cerraba","cerrabas","cerraba","cerrábamos","cerrabais","cerraban","cerrando","closing","cerrado","closed"]
["cerrar","to close, shut","Indicativo","Indicative","Pretérito","Preterite","I closed","cerré","cerraste","cerró","cerramos","cerrasteis","cerraron","cerrando","closing","cerrado","closed"]
["cerrar","to close, shut","Indicativo","Indicative","Condicional","Conditional","I would close","cerraría","cerrarías","cerraría","cerraríamos","cerraríais","cerrarían","cerrando","closing","cerrado","closed"]
["cerrar","to close, shut","Indicativo","Indicative","Presente perfecto","Present Perfect","I have closed","he cerrado","has cerrado","ha cerrado","hemos cerrado","habéis cerrado","han cerrado","cerrando","closing","cerrado","closed"]
["cerrar","to close, shut","Indicativo","Indicative","Futuro perfecto","Future Perfect","I will have closed","habré cerrado","habrás cerrado","habrá cerrado","habremos cerrado","habréis cerrado","habrán cerrado","cerrando","closing","cerrado","closed"]
["cerrar","to close, shut","Indicativo","Indicative","Pluscuamperfecto","Past Perfect","I had closed","había cerrado","habías cerrado","había cerrado","habíamos cerrado","habíais cerrado","habían cerrado","cerrando","closing","cerrado","closed"]
["cerrar","to close, shut","Indicativo","Indicative","Pretérito anterior","Preterite (Archaic)","I had closed","hube cerrado","hubiste cerrado","hubo cerrado","hubimos cerrado","hubisteis cerrado","hubieron cerrado","cerrando","closing","cerrado","closed"]
["cerrar","to close, shut","Indicativo","Indicative","Condicional perfecto","Conditional Perfect","I would have closed","habría cerrado","habrías cerrado","habría cerrado","habríamos cerrado","habríais cerrado","habrían cerrado","cerrando","closing","cerrado","closed"]
["cerrar","to close, shut","Subjuntivo","Subjunctive","Presente","Present","I close, am closing","cierre","cierres","cierre","cerremos","cerréis","cierren","cerrando","closing","cerrado","closed"]
["cerrar","to close, shut","Subjuntivo","Subjunctive","Imperfecto","Imperfect","I closed, was closing","cerrara","cerraras","cerrara","cerráramos","cerrarais","cerraran","cerrando","closing","cerrado","closed"]
["cerrar","to close, shut","Subjuntivo","Subjunctive","Futuro","Future","I will close","cerrare","cerrares","cerrare","cerráremos","cerrareis","cerraren","cerrando","closing","cerrado","closed"]
["cerrar","to close, shut","Subjuntivo","Subjunctive","Presente perfecto","Present Perfect","I have closed, closed","haya cerrado","hayas cerrado","haya cerrado","hayamos cerrado","hayáis cerrado","hayan cerrado","cerrando","closing","cerrado","closed"]
["cerrar","to close, shut","Subjuntivo","Subjunctive","Futuro perfecto","Future Perfect","I will have closed","hubiere cerrado","hubieres cerrado","hubiere cerrado","hubiéremos cerrado","hubiereis cerrado","hubieren cerrado","cerrando","closing","cerrado","closed"]
["cerrar","to close, shut","Subjuntivo","Subjunctive","Pluscuamperfecto","Past Perfect","I had closed","hubiera cerrado","hubieras cerrado","hubiera cerrado","hubiéramos cerrado","hubierais cerrado","hubieran cerrado","cerrando","closing","cerrado","closed"]
["colocar","to locate, place","Imperativo Afirmativo","Imperative Affirmative","Presente","Present","Locate! Don't locate!",null,"coloca","colocad",null,"coloque","coloquen","colocando","locating","colocado","located"]
["colocar","to locate, place","Imperativo Negativo","Imperative Negative","Presente","Present","Locate! Don't locate!",null,"no coloques","no coloquéis",null,"no coloque","no coloquen","colocando","locating","colocado","located"]
["colocar","to locate, place","Indicativo","Indicative","Presente","Present","I locate, am locating","coloco","colocas","coloca","colocamos","colocáis","colocan","colocando","locating","colocado","located"]
["colocar","to locate, place","Indicativo","Indicative","Futuro","Future","I will locate","colocaré","colocarás","colocará","colocaremos","colocaréis","colocarán","colocando","locating","colocado","located"]
["colocar","to locate, place","Indicativo","Indicative","Imperfecto","Imperfect","I was locating, used to locate, located","colocaba","colocabas","colocaba","colocábamos","colocabais","colocaban","colocando","locating","colocado","located"]
["colocar","to locate, place","Indicativo","Indicative","Pretérito","Preterite","I located","coloqué","colocaste","colocó","colocamos","colocasteis","colocaron","colocando","locating","colocado","located"]
["colocar","to locate, place","Indicativo","Indicative","Condicional","Conditional","I would locate","colocaría","colocarías","colocaría","colocaríamos","colocaríais","colocarían","colocando","locating","colocado","located"]
["colocar","to locate, place","Indicativo","Indicative","Presente perfecto","Present Perfect","I have located","he colocado","has colocado","ha colocado","hemos colocado","habéis colocado","han colocado","colocando","locating","colocado","located"]
["colocar","to locate, place","Indicativo","Indicative","Futuro perfecto","Future Perfect","I will have located","habré colocado","habrás colocado","habrá colocado","habremos colocado","habréis colocado","habrán colocado","colocando","locating","colocado","located"]
["colocar","to locate, place","Indicativo","Indicative","Pluscuamperfecto","Past Perfect","I had located","había colocado","habías colocado","había colocado","habíamos colocado","habíais colocado","habían colocado","colocando","locating","colocado","located"]
["colocar","to locate, place","Indicativo","Indicative","Pretérito anterior","Preterite (Archaic)","I had located","hube colocado","hubiste colocado","hubo colocado","hubimos colocado","hubisteis colocado","hubieron colocado","colocando","locating","colocado","located"]
["colocar","to locate, place","Indicativo","Indicative","Condicional perfecto","Conditional Perfect","I would have located","habría colocado","habrías colocado","habría colocado","habríamos colocado","habríais colocado","habrían colocado","colocando","locating","colocado","located"]
["colocar","to locate, place","Subjuntivo","Subjunctive","Presente","Present","I locate, am locating","coloque","coloques","coloque","coloquemos","coloquéis","coloquen","colocando","locating","colocado","located"]
["colocar","to locate, place","Subjuntivo","Subjunctive","Imperfecto","Imperfect","I located, was locating","colocara","colocaras","colocara","colocáramos","colocarais","colocaran","colocando","locating","colocado","located"]
["colocar","to locate, place","Subjuntivo","Subjunctive","Futuro","Future","I will locate","colocare","colocares","colocare","colocáremos","colocareis","colocaren","colocando","locating","colocado","located"]
["colocar","to locate, place","Subjuntivo","Subjunctive","Presente perfecto","Present Perfect","I have located, located","haya colocado","hayas colocado","haya colocado","hayamos colocado","hayáis colocado","hayan colocado","colocando","locating","colocado","located"]
["colocar","to locate, place","Subjuntivo","Subjunctive","Futuro perfecto","Future Perfect","I will have located","hubiere colocado","hubieres colocado","hubiere colocado","hubiéremos colocado","hubiereis colocado","hubieren colocado","colocando","locating","colocado","located"]
["colocar","to locate, place","Subjuntivo","Subjunctive","Pluscuamperfecto","Past Perfect","I had located","hubiera colocado","hubieras colocado","hubiera colocado","hubiéramos colocado","hubierais colocado","hubieran colocado","colocando","locating","colocado","located"]
["comenzar","to begin, start, commence","Imperativo Afirmativo","Imperative Affirmative","Presente","Present","Begin! Don't begin!",null,"comienza","comenzad",null,"comience","comiencen","comenzando","beginning","comenzado","begun"]
["comenzar","to begin, start, commence","Imperativo Negativo","Imperative Negative","Presente","Present","Begin! Don't begin!",null,"no comiences","no comencéis",null,"no comience","no comiencen","comenzando","beginning","comenzado","begun"]
["comenzar","to begin, start, commence","Indicativo","Indicative","Presente","Present","I begin, am beginning","comienzo","comienzas","comienza","comenzamos","comenzáis","comienzan","comenzando","beginning","comenzado","begun"]
["comenzar","to begin, start, commence","Indicativo","Indicative","Futuro","Future","I will begin","comenzaré","comenzarás","comenzará","comenzaremos","comenzaréis","comenzarán","comenzando","beginning","comenzado","begun"]
["comenzar","to begin, start, commence","Indicativo","Indicative","Imperfecto","Imperfect","I was beginning, used to begin, began","comenzaba","comenzabas","comenzaba","comenzábamos","comenzabais","comenzaban","comenzando","beginning","comenzado","begun"]
["comenzar","to begin, start, commence","Indicativo","Indicative","Pretérito","Preterite","I began","comencé","comenzaste","comenzó","comenzamos","comenzasteis","comenzaron","comenzando","beginning","comenzado","begun"]
["comenzar","to begin, start, commence","Indicativo","Indicative","Condicional","Conditional","I would begin","comenzaría","comenzarías","comenzaría","comenzaríamos","comenzaríais","comenzarían","comenzando","beginning","comenzado","begun"]
["comenzar","to begin, start, commence","Indicativo","Indicative","Presente perfecto","Present Perfect","I have begun","he comenzado","has comenzado","ha comenzado","hemos comenzado","habéis comenzado","han comenzado","comenzando","beginning","comenzado","begun"]
["comenzar","to begin, start, commence","Indicativo","Indicative","Futuro perfecto","Future Perfect","I will have begun","habré comenzado","habrás comenzado","habrá comenzado","habremos comenzado","habréis comenzado","habrán comenzado","comenzando","beginning","comenzado","begun"]
["comenzar","to begin, start, commence","Indicativo","Indicative","Pluscuamperfecto","Past Perfect","I had begun","había comenzado","habías comenzado","había comenzado","habíamos comenzado","habíais comenzado","habían comenzado","comenzando","beginning","comenzado","begun"]
["comenzar","to begin, start, commence","Indicativo","Indicative","Pretérito anterior","Preterite (Archaic)","I had begun","hube comenzado","hubiste comenzado","hubo comenzado","hubimos comenzado","hubisteis comenzado","hubieron comenzado","comenzando","beginning","comenzado","begun"]
["comenzar","to begin, start, commence","Indicativo","Indicative","Condicional perfecto","Conditional Perfect","I would have begun","habría comenzado","habrías comenzado","habría comenzado","habríamos comenzado","habríais comenzado","habrían comenzado","comenzando","beginning","comenzado","begun"]
["comenzar","to begin, start, commence","Subjuntivo","Subjunctive","Presente","Present","I begin, am beginning","comience","comiences","comience","comencemos","comencéis","comiencen","comenzando","beginning","comenzado","begun"]
["comenzar","to begin, start, commence","Subjuntivo","Subjunctive","Imperfecto","Imperfect","I began, was beginning","comenzara","comenzaras","comenzara","comenzáramos","comenzarais","comenzaran","comenzando","beginning","comenzado","begun"]
["comenzar","to begin, start, commence","Subjuntivo","Subjunctive","Futuro","Future","I will begin","comenzare","comenzares","comenzare","comenzáremos","comenzareis","comenzaren","comenzando","beginning","comenzado","begun"]
["comenzar","to begin, start, commence","Subjuntivo","Subjunctive","Presente perfecto","Present Perfect","I have begun, began","haya comenzado","hayas comenzado","haya comenzado","hayamos comenzado","hayáis comenzado","hayan comenzado","comenzando","beginning","comenzado","begun"]
["comenzar","to begin, start, commence","Subjuntivo","Subjunctive","Futuro perfecto","Future Perfect","I will have begun","hubiere comenzado","hubieres comenzado","hubiere comenzado","hubiéremos comenzado","hubiereis comenzado","hubieren comenzado","comenzando","beginning","comenzado","begun"]
["comenzar","to begin, start, commence","Subjuntivo","Subjunctive","Pluscuamperfecto","Past Perfect","I had begun","hubiera comenzado","hubieras comenzado","hubiera comenzado","hubiéramos comenzado","hubierais comenzado","hubieran comenzado","comenzando","beginning","comenzado","begun"]
["comer","to eat","Imperativo Afirmativo","Imperative Affirmative","Presente","Present","Eat! Don't eat!",null,"come","comed",null,"coma","coman","comiendo","eating","comido","eaten"]
["comer","to eat","Imperativo Negativo","Imperative Negative","Presente","Present","Eat! Don't eat!",null,"no comas","no comáis",null,"no coma","no coman","comiendo","eating","comido","eaten"]
["comer","to eat","Indicativo","Indicative","Condicional","Conditional","I would eat","comería","comerías","comería","comeríamos","comeríais","comerían","comiendo","eating","comido","eaten"]
["comer","to eat","Indicativo","Indicative","Presente perfecto","Present Perfect","I have eaten","he comido","has comido","ha comido","hemos comido","habéis comido","han comido","comiendo","eating","comido","eaten"]
["comer","to eat","Indicativo","Indicative","Presente","Present","I eat, am eating","como","comes","come","comemos","coméis","comen","comiendo","eating","comido","eaten"]
["comer","to eat","Indicativo","Indicative","Futuro","Future","I will eat","comeré","comerás","comerá","comeremos","comeréis","comerán","comiendo","eating","comido","eaten"]
["comer","to eat","Indicativo","Indicative","Imperfecto","Imperfect","I was eating, used to eat, ate","comía","comías","comía","comíamos","comíais","comían","comiendo","eating","comido","eaten"]
["comer","to eat","Indicativo","Indicative","Pretérito","Preterite","I ate","comí","comiste","comió","comimos","comisteis","comieron","comiendo","eating","comido","eaten"]
["comer","to eat","Indicativo","Indicative","Futuro perfecto","Future Perfect","I will have eaten","habré comido","habrás comido","habrá comido","habremos comido","habréis comido","habrán comido","comiendo","eating","comido","eaten"]
["comer","to eat","Indicativo","Indicative","Pluscuamperfecto","Past Perfect","I had eaten","había comido","habías comido","había comido","habíamos comido","habíais comido","habían comido","comiendo","eating","comido","eaten"]
["comer","to eat","Indicativo","Indicative","Pretérito anterior","Preterite (Archaic)","I had eaten","hube comido","hubiste comido","hubo comido","hubimos comido","hubisteis comido","hubieron comido","comiendo","eating","comido","eaten"]
["comer","to eat","Indicativo","Indicative","Condicional perfecto","Conditional Perfect","I would have eaten","habría comido","habrías comido","habría comido","habríamos comido","habríais comido","habrían comido","comiendo","eating","comido","eaten"]
["comer","to eat","Subjuntivo","Subjunctive","Presente","Present","I eat, am eating","coma","comas","coma","comamos","comáis","coman","comiendo","eating","comido","eaten"]
["comer","to eat","Subjuntivo","Subjunctive","Imperfecto","Imperfect","I ate, was eating","comiera","comieras","comiera","comiéramos","comierais","comieran","comiendo","eating","comido","eaten"]
["comer","to eat","Subjuntivo","Subjunctive","Futuro","Future","I will eat","comiere","comieres","comiere","comiéremos","comiereis","comieren","comiendo","eating","comido","eaten"]
["comer","to eat","Subjuntivo","Subjunctive","Presente perfecto","Present Perfect","I have eaten, ate","haya comido","hayas comido","haya comido","hayamos comido","hayáis comido","hayan comido","comiendo","eating","comido","eaten"]
["comer","to eat","Subjuntivo","Subjunctive","Futuro perfecto","Future Perfect","I will have eaten","hubiere comido","hubieres comido","hubiere comido","hubiéremos comido","hubiereis comido","hubieren comido","comiendo","eating","comido","eaten"]
["comer","to eat","Subjuntivo","Subjunctive","Pluscuamperfecto","Past Perfect","I had eaten","hubiera comido","hubieras comido","hubiera comido","hubiéramos comido","hubierais comido","hubieran comido","comiendo","eating","comido","eaten"]
["compartir","to share; to divide [up]","Imperativo Afirmativo","Imperative Affirmative","Presente","Present","Share! Don't share!",null,"comparte","compartid",null,"comparta","compartan","compartiendo","sharing","compartido","shared"]
["compartir","to share; to divide [up]","Imperativo Negativo","Imperative Negative","Presente","Present","Share! Don't share!",null,"no compartas","no compartáis",null,"no comparta","no compartan","compartiendo","sharing","compartido","shared"]
["compartir","to share; to divide [up]","Indicativo","Indicative","Presente","Present","I share, am sharing","comparto","compartes","comparte","compartimos","compartís","comparten","compartiendo","sharing","compartido","shared"]
["compartir","to share; to divide [up]","Indicativo","Indicative","Futuro","Future","I will share","compartiré","compartirás","compartirá","compartiremos","compartiréis","compartirán","compartiendo","sharing","compartido","shared"]
["compartir","to share; to divide [up]","Indicativo","Indicative","Imperfecto","Imperfect","I was sharing, used to share, shared","compartía","compartías","compartía","compartíamos","compartíais","compartían","compartiendo","sharing","compartido","shared"]
["compartir","to share; to divide [up]","Indicativo","Indicative","Pretérito","Preterite","I shared","compartí","compartiste","compartió","compartimos","compartisteis","compartieron","compartiendo","sharing","compartido","shared"]
["compartir","to share; to divide [up]","Indicativo","Indicative","Condicional","Conditional","I would share","compartiría","compartirías","compartiría","compartiríamos","compartiríais","compartirían","compartiendo","sharing","compartido","shared"]
["compartir","to share; to divide [up]","Indicativo","Indicative","Presente perfecto","Present Perfect","I have shared","he compartido","has compartido","ha compartido","hemos compartido","habéis compartido","han compartido","compartiendo","sharing","compartido","shared"]
["compartir","to share; to divide [up]","Indicativo","Indicative","Futuro perfecto","Future Perfect","I will have shared","habré compartido","habrás compartido","habrá compartido","habremos compartido","habréis compartido","habrán compartido","compartiendo","sharing","compartido","shared"]
["compartir","to share; to divide [up]","Indicativo","Indicative","Pluscuamperfecto","Past Perfect","I had shared","había compartido","habías compartido","había compartido","habíamos compartido","habíais compartido","habían compartido","compartiendo","sharing","compartido","shared"]
["compartir","to share; to divide [up]","Indicativo","Indicative","Pretérito anterior","Preterite (Archaic)","I had shared","hube compartido","hubiste compartido","hubo compartido","hubimos compartido","hubisteis compartido","hubieron compartido","compartiendo","sharing","compartido","shared"]
["compartir","to share; to divide [up]","Indicativo","Indicative","Condicional perfecto","Conditional Perfect","I would have shared","habría compartido","habrías compartido","habría compartido","habríamos compartido","habríais compartido","habrían compartido","compartiendo","sharing","compartido","shared"]
["compartir","to share; to divide [up]","Subjuntivo","Subjunctive","Presente","Present","I share, am sharing","comparta","compartas","comparta","compartamos","compartáis","compartan","compartiendo","sharing","compartido","shared"]
["compartir","to share; to divide [up]","Subjuntivo","Subjunctive","Imperfecto","Imperfect","I shared, was sharing","compartiera","compartieras","compartiera","compartiéramos","compartierais","compartieran","compartiendo","sharing","compartido","shared"]
["compartir","to share; to divide [up]","Subjuntivo","Subjunctive","Futuro","Future","I will share","compartiere","compartieres","compartiere","compartiéremos","compartiereis","compartieren","compartiendo","sharing","compartido","shared"]
["compartir","to share; to divide [up]","Subjuntivo","Subjunctive","Presente perfecto","Present Perfect","I have shared, shared","haya compartido","hayas compartido","haya compartido","hayamos compartido","hayáis compartido","hayan compartido","compartiendo","sharing","compartido","shared"]
["compartir","to share; to divide [up]","Subjuntivo","Subjunctive","Futuro perfecto","Future Perfect","I will have shared","hubiere compartido","hubieres compartido","hubiere compartido","hubiéremos compartido","hubiereis compartido","hubieren compartido","compartiendo","sharing","compartido","shared"]
["compartir","to share; to divide [up]","Subjuntivo","Subjunctive","Pluscuamperfecto","Past Perfect","I had shared","hubiera compartido","hubieras compartido","hubiera compartido","hubiéramos compartido","hubierais compartido","hubieran compartido","compartiendo","sharing","compartido","shared"]
["comprar","to buy, purchase","Imperativo Afirmativo","Imperative Affirmative","Presente","Present","Buy! Don't buy!",null,"compra","comprad",null,"compre","compren","comprando","buying","comprado","bought"]
["comprar","to buy, purchase","Imperativo Negativo","Imperative Negative","Presente","Present","Buy! Don't buy!",null,"no compres","no compréis",null,"no compre","no compren","comprando","buying","comprado","bought"]
["comprar","to buy, purchase","Indicativo","Indicative","Futuro","Future","I will buy","compraré","comprarás","comprará","compraremos","compraréis","comprarán","comprando","buying","comprado","bought"]
["comprar","to buy, purchase","Indicativo","Indicative","Presente","Present","I buy, am buying","compro","compras","compra","compramos","compráis","compran","comprando","buying","comprado","bought"]
["comprar","to buy, purchase","Indicativo","Indicative","Imperfecto","Imperfect","I was buying, used to buy, bought","compraba","comprabas","compraba","comprábamos","comprabais","compraban","comprando","buying","comprado","bought"]
["comprar","to buy, purchase","Indicativo","Indicative","Pretérito","Preterite","I bought","compré","compraste","compró","compramos","comprasteis","compraron","comprando","buying","comprado","bought"]
["comprar","to buy, purchase","Indicativo","Indicative","Condicional","Conditional","I would buy","compraría","comprarías","compraría","compraríamos","compraríais","comprarían","comprando","buying","comprado","bought"]
["comprar","to buy, purchase","Indicativo","Indicative","Presente perfecto","Present Perfect","I have bought","he comprado","has comprado","ha comprado","hemos comprado","habéis comprado","han comprado","comprando","buying","comprado","bought"]
["comprar","to buy, purchase","Indicativo","Indicative","Futuro perfecto","Future Perfect","I will have bought","habré comprado","habrás comprado","habrá comprado","habremos comprado","habréis comprado","habrán comprado","comprando","buying","comprado","bought"]
["comprar","to buy, purchase","Indicativo","Indicative","Pluscuamperfecto","Past Perfect","I had bought","había comprado","habías comprado","había comprado","habíamos comprado","habíais comprado","habían comprado","comprando","buying","comprado","bought"]
["comprar","to buy, purchase","Indicativo","Indicative","Pretérito anterior","Preterite (Archaic)","I had bought","hube comprado","hubiste comprado","hubo comprado","hubimos comprado","hubisteis comprado","hubieron comprado","comprando","buying","comprado","bought"]
["comprar","to buy, purchase","Indicativo","Indicative","Condicional perfecto","Conditional Perfect","I would have bought","habría comprado","habrías comprado","habría comprado","habríamos comprado","habríais comprado","habrían comprado","comprando","buying","comprado","bought"]
["comprar","to buy, purchase","Subjuntivo","Subjunctive","Presente","Present","I buy, am buying","compre","compres","compre","compremos","compréis","compren","comprando","buying","comprado","bought"]
["comprar","to buy, purchase","Subjuntivo","Subjunctive","Imperfecto","Imperfect","I bought, was buying","comprara","compraras","comprara","compráramos","comprarais","compraran","comprando","buying","comprado","bought"]
["comprar","to buy, purchase","Subjuntivo","Subjunctive","Futuro","Future","I will buy","comprare","comprares","comprare","compráremos","comprareis","compraren","comprando","buying","comprado","bought"]
["comprar","to buy, purchase","Subjuntivo","Subjunctive","Presente perfecto","Present Perfect","I have bought, bought","haya comprado","hayas comprado","haya comprado","hayamos comprado","hayáis comprado","hayan comprado","comprando","buying","comprado","bought"]
["comprar","to buy, purchase","Subjuntivo","Subjunctive","Futuro perfecto","Future Perfect","I will have bought","hubiere comprado","hubieres comprado","hubiere comprado","hubiéremos comprado","hubiereis comprado","hubieren comprado","comprando","buying","comprado","bought"]
["comprar","to buy, purchase","Subjuntivo","Subjunctive","Pluscuamperfecto","Past Perfect","I had bought","hubiera comprado","hubieras comprado","hubiera comprado","hubiéramos comprado","hubierais comprado","hubieran comprado","comprando","buying","comprado","bought"]
["comprender","to understand, comprehend","Imperativo Afirmativo","Imperative Affirmative","Presente","Present","Understand! Don't understand!",null,"comprende","comprended",null,"comprenda","comprendan","comprendiendo","understanding","comprendido","understood"]
["comprender","to understand, comprehend","Imperativo Negativo","Imperative Negative","Presente","Present","Understand! Don't understand!",null,"no comprendas","no comprendáis",null,"no comprenda","no comprendan","comprendiendo","understanding","comprendido","understood"]
["comprender","to understand, comprehend","Indicativo","Indicative","Presente","Present","I understand, am understanding","comprendo","comprendes","comprende","comprendemos","comprendéis","comprenden","comprendiendo","understanding","comprendido","understood"]
["comprender","to understand, comprehend","Indicativo","Indicative","Futuro","Future","I will understand","comprenderé","comprenderás","comprenderá","comprenderemos","comprenderéis","comprenderán","comprendiendo","understanding","comprendido","understood"]
["comprender","to understand, comprehend","Indicativo","Indicative","Imperfecto","Imperfect","I was understanding, used to understand, understood","comprendía","comprendías","comprendía","comprendíamos","comprendíais","comprendían","comprendiendo","understanding","comprendido","understood"]
["comprender","to understand, comprehend","Indicativo","Indicative","Pretérito","Preterite","I understood","comprendí","comprendiste","comprendió","comprendimos","comprendisteis","comprendieron","comprendiendo","understanding","comprendido","understood"]
["comprender","to understand, comprehend","Indicativo","Indicative","Condicional","Conditional","I would understand","comprendería","comprenderías","comprendería","comprenderíamos","comprenderíais","comprenderían","comprendiendo","understanding","comprendido","understood"]
["comprender","to understand, comprehend","Indicativo","Indicative","Presente perfecto","Present Perfect","I have understood","he comprendido","has comprendido","ha comprendido","hemos comprendido","habéis comprendido","han comprendido","comprendiendo","understanding","comprendido","understood"]
["comprender","to understand, comprehend","Indicativo","Indicative","Futuro perfecto","Future Perfect","I will have understood","habré comprendido","habrás comprendido","habrá comprendido","habremos comprendido","habréis comprendido","habrán comprendido","comprendiendo","understanding","comprendido","understood"]
["comprender","to understand, comprehend","Indicativo","Indicative","Pluscuamperfecto","Past Perfect","I had understood","había comprendido","habías comprendido","había comprendido","habíamos comprendido","habíais comprendido","habían comprendido","comprendiendo","understanding","comprendido","understood"]
["comprender","to understand, comprehend","Indicativo","Indicative","Pretérito anterior","Preterite (Archaic)","I had understood","hube comprendido","hubiste comprendido","hubo comprendido","hubimos comprendido","hubisteis comprendido","hubieron comprendido","comprendiendo","understanding","comprendido","understood"]
["comprender","to understand, comprehend","Indicativo","Indicative","Condicional perfecto","Conditional Perfect","I would have understood","habría comprendido","habrías comprendido","habría comprendido","habríamos comprendido","habríais comprendido","habrían comprendido","comprendiendo","understanding","comprendido","understood"]
["comprender","to understand, comprehend","Subjuntivo","Subjunctive","Presente","Present","I understand, am understanding","comprenda","comprendas","comprenda","comprendamos","comprendáis","comprendan","comprendiendo","understanding","comprendido","understood"]
["comprender","to understand, comprehend","Subjuntivo","Subjunctive","Imperfecto","Imperfect","I understood, was understanding","comprendiera","comprendieras","comprendiera","comprendiéramos","comprendierais","comprendieran","comprendiendo","understanding","comprendido","understood"]
["comprender","to understand, comprehend","Subjuntivo","Subjunctive","Futuro","Future","I will understand","comprendiere","comprendieres","comprendiere","comprendiéremos","comprendiereis","comprendieren","comprendiendo","understanding","comprendido","understood"]
["comprender","to understand, comprehend","Subjuntivo","Subjunctive","Presente perfecto","Present Perfect","I have understood, understood","haya comprendido","hayas comprendido","haya comprendido","hayamos comprendido","hayáis comprendido","hayan comprendido","comprendiendo","understanding","comprendido","understood"]
["comprender","to understand, comprehend","Subjuntivo","Subjunctive","Futuro perfecto","Future Perfect","I will have understood","hubiere comprendido","hubieres comprendido","hubiere comprendido","hubiéremos comprendido","hubiereis comprendido","hubieren comprendido","comprendiendo","understanding","comprendido","understood"]
["comprender","to understand, comprehend","Subjuntivo","Subjunctive","Pluscuamperfecto","Past Perfect","I had understood","hubiera comprendido","hubieras comprendido","hubiera comprendido","hubiéramos comprendido","hubierais comprendido","hubieran comprendido","comprendiendo","understanding","comprendido","understood"]
["conocer","to know","Imperativo Afirmativo","Imperative Affirmative","Presente","Present","Know! Don't know!",null,"conoce","conoced",null,"conozca","conozcan","conociendo","knowing","conocido","known"]
["conocer","to know","Imperativo Negativo","Imperative Negative","Presente","Present","Know! Don't know!",null,"no conozcas","no conozcáis",null,"no conozca","no conozcan","conociendo","knowing","conocido","known"]
["conocer","to know","Indicativo","Indicative","Presente","Present","I know","conozco","conoces","conoce","conocemos","conocéis","conocen","conociendo","knowing","conocido","known"]
["conocer","to know","Indicativo","Indicative","Futuro","Future","I will know","conoceré","conocerás","conocerá","conoceremos","conoceréis","conocerán","conociendo","knowing","conocido","known"]
["conocer","to know","Indicativo","Indicative","Imperfecto","Imperfect","I used to know, knew","conocía","conocías","conocía","conocíamos","conocíais","conocían","conociendo","knowing","conocido","known"]
["conocer","to know","Indicativo","Indicative","Pretérito","Preterite","I knew","conocí","conociste","conoció","conocimos","conocisteis","conocieron","conociendo","knowing","conocido","known"]
["conocer","to know","Indicativo","Indicative","Condicional","Conditional","I would know","conocería","conocerías","conocería","conoceríamos","conoceríais","conocerían","conociendo","knowing","conocido","known"]
["conocer","to know","Indicativo","Indicative","Presente perfecto","Present Perfect","I have known","he conocido","has conocido","ha conocido","hemos conocido","habéis conocido","han conocido","conociendo","knowing","conocido","known"]
["conocer","to know","Indicativo","Indicative","Futuro perfecto","Future Perfect","I will have known","habré conocido","habrás conocido","habrá conocido","habremos conocido","habréis conocido","habrán conocido","conociendo","knowing","conocido","known"]
["conocer","to know","Indicativo","Indicative","Pluscuamperfecto","Past Perfect","I had known","había conocido","habías conocido","había conocido","habíamos conocido","habíais conocido","habían conocido","conociendo","knowing","conocido","known"]
["conocer","to know","Indicativo","Indicative","Pretérito anterior","Preterite (Archaic)","I had known","hube conocido","hubiste conocido","hubo conocido","hubimos conocido","hubisteis conocido","hubieron conocido","conociendo","knowing","conocido","known"]
["conocer","to know","Indicativo","Indicative","Condicional perfecto","Conditional Perfect","I would have known","habría conocido","habrías conocido","habría conocido","habríamos conocido","habríais conocido","habrían conocido","conociendo","knowing","conocido","known"]
["conocer","to know","Subjuntivo","Subjunctive","Presente","Present","I know","conozca","conozcas","conozca","conozcamos","conozcáis","conozcan","conociendo","knowing","conocido","known"]
["conocer","to know","Subjuntivo","Subjunctive","Imperfecto","Imperfect","I knew, was knowing","conociera","conocieras","conociera","conociéramos","conocierais","conocieran","conociendo","knowing","conocido","known"]
["conocer","to know","Subjuntivo","Subjunctive","Futuro","Future","I will know","conociere","conocieres","conociere","conociéremos","conociereis","conocieren","conociendo","knowing","conocido","known"]
["conocer","to know","Subjuntivo","Subjunctive","Presente perfecto","Present Perfect","I have known, knew","haya conocido","hayas conocido","haya conocido","hayamos conocido","hayáis conocido","hayan conocido","conociendo","knowing","conocido","known"]
["conocer","to know","Subjuntivo","Subjunctive","Futuro perfecto","Future Perfect","I will have known","hubiere conocido","hubieres conocido","hubiere conocido","hubiéremos conocido","hubiereis conocido","hubieren conocido","conociendo","knowing","conocido","known"]
["conocer","to know","Subjuntivo","Subjunctive","Pluscuamperfecto","Past Perfect","I had known","hubiera conocido","hubieras conocido","hubiera conocido","hubiéramos conocido","hubierais conocido","hubieran conocido","conociendo","knowing","conocido","known"]
["conseguir","to get, obtain","Imperativo Afirmativo","Imperative Affirmative","Presente","Present","Get! Don't get!",null,"consigue","conseguid",null,"consiga","consigan","consiguiendo","getting","conseguido","gotten"]
["conseguir","to get, obtain","Imperativo Negativo","Imperative Negative","Presente","Present","Get! Don't get!",null,"no consigas","no consigáis",null,"no consiga","no consigan","consiguiendo","getting","conseguido","gotten"]
["conseguir","to get, obtain","Indicativo","Indicative","Presente","Present","I get, am getting","consigo","consigues","consigue","conseguimos","conseguís","consiguen","consiguiendo","getting","conseguido","gotten"]
["conseguir","to get, obtain","Indicativo","Indicative","Futuro","Future","I will get","conseguiré","conseguirás","conseguirá","conseguiremos","conseguiréis","conseguirán","consiguiendo","getting","conseguido","gotten"]
["conseguir","to get, obtain","Indicativo","Indicative","Imperfecto","Imperfect","I was getting, used to get, got","conseguía","conseguías","conseguía","conseguíamos","conseguíais","conseguían","consiguiendo","getting","conseguido","gotten"]
["conseguir","to get, obtain","Indicativo","Indicative","Pretérito","Preterite","I got","conseguí","conseguiste","consiguió","conseguimos","conseguisteis","consiguieron","consiguiendo","getting","conseguido","gotten"]
["conseguir","to get, obtain","Indicativo","Indicative","Condicional","Conditional","I would get","conseguiría","conseguirías","conseguiría","conseguiríamos","conseguiríais","conseguirían","consiguiendo","getting","conseguido","gotten"]
["conseguir","to get, obtain","Indicativo","Indicative","Presente perfecto","Present Perfect","I have gotten","he conseguido","has conseguido","ha conseguido","hemos conseguido","habéis conseguido","han conseguido","consiguiendo","getting","conseguido","gotten"]
["conseguir","to get, obtain","Indicativo","Indicative","Futuro perfecto","Future Perfect","I will have gotten","habré conseguido","habrás conseguido","habrá conseguido","habremos conseguido","habréis conseguido","habrán conseguido","consiguiendo","getting","conseguido","gotten"]
["conseguir","to get, obtain","Indicativo","Indicative","Pluscuamperfecto","Past Perfect","I had gotten","había conseguido","habías conseguido","había conseguido","habíamos conseguido","habíais conseguido","habían conseguido","consiguiendo","getting","conseguido","gotten"]
["conseguir","to get, obtain","Indicativo","Indicative","Pretérito anterior","Preterite (Archaic)","I had gotten","hube conseguido","hubiste conseguido","hubo conseguido","hubimos conseguido","hubisteis conseguido","hubieron conseguido","consiguiendo","getting","conseguido","gotten"]
["conseguir","to get, obtain","Indicativo","Indicative","Condicional perfecto","Conditional Perfect","I would have gotten","habría conseguido","habrías conseguido","habría conseguido","habríamos conseguido","habríais conseguido","habrían conseguido","consiguiendo","getting","conseguido","gotten"]
["conseguir","to get, obtain","Subjuntivo","Subjunctive","Presente","Present","I get, am getting","consiga","consigas","consiga","consigamos","consigáis","consigan","consiguiendo","getting","conseguido","gotten"]
["conseguir","to get, obtain","Subjuntivo","Subjunctive","Imperfecto","Imperfect","I got, was getting","consiguiera","consiguieras","consiguiera","consiguiéramos","consiguierais","consiguieran","consiguiendo","getting","conseguido","gotten"]
["conseguir","to get, obtain","Subjuntivo","Subjunctive","Futuro","Future","I will get","consiguiere","consiguieres","consiguiere","consiguiéremos","consiguiereis","consiguieren","consiguiendo","getting","conseguido","gotten"]
["conseguir","to get, obtain","Subjuntivo","Subjunctive","Presente perfecto","Present Perfect","I have gotten, got","haya conseguido","hayas conseguido","haya conseguido","hayamos conseguido","hayáis conseguido","hayan conseguido","consiguiendo","getting","conseguido","gotten"]
["conseguir","to get, obtain","Subjuntivo","Subjunctive","Futuro perfecto","Future Perfect","I will have gotten","hubiere conseguido","hubieres conseguido","hubiere conseguido","hubiéremos conseguido","hubiereis conseguido","hubieren conseguido","consiguiendo","getting","conseguido","gotten"]
["conseguir","to get, obtain","Subjuntivo","Subjunctive","Pluscuamperfecto","Past Perfect","I had gotten","hubiera conseguido","hubieras conseguido","hubiera conseguido","hubiéramos conseguido","hubierais conseguido","hubieran conseguido","consiguiendo","getting","conseguido","gotten"]
["conservar","to preserve, conserve; to keep, retain","Imperativo Afirmativo","Imperative Affirmative","Presente","Present","Preserve! Don't preserve!",null,"conserva","conservad",null,"conserve","conserven","conservando","preserving","conservado","preserved"]
["conservar","to preserve, conserve; to keep, retain","Imperativo Negativo","Imperative Negative","Presente","Present","Preserve! Don't preserve!",null,"no conserves","no conservéis",null,"no conserve","no conserven","conservando","preserving","conservado","preserved"]
["conservar","to preserve, conserve; to keep, retain","Indicativo","Indicative","Presente","Present","I preserve, am preserving","conservo","conservas","conserva","conservamos","conserváis","conservan","conservando","preserving","conservado","preserved"]
["conservar","to preserve, conserve; to keep, retain","Indicativo","Indicative","Futuro","Future","I will preserve","conservaré","conservarás","conservará","conservaremos","conservaréis","conservarán","conservando","preserving","conservado","preserved"]
["conservar","to preserve, conserve; to keep, retain","Indicativo","Indicative","Imperfecto","Imperfect","I was preserving, used to preserve, preserved","conservaba","conservabas","conservaba","conservábamos","conservabais","conservaban","conservando","preserving","conservado","preserved"]
["conservar","to preserve, conserve; to keep, retain","Indicativo","Indicative","Pretérito","Preterite","I preserved","conservé","conservaste","conservó","conservamos","conservasteis","conservaron","conservando","preserving","conservado","preserved"]
["conservar","to preserve, conserve; to keep, retain","Indicativo","Indicative","Condicional","Conditional","I would preserve","conservaría","conservarías","conservaría","conservaríamos","conservaríais","conservarían","conservando","preserving","conservado","preserved"]
["conservar","to preserve, conserve; to keep, retain","Indicativo","Indicative","Presente perfecto","Present Perfect","I have preserved","he conservado","has conservado","ha conservado","hemos conservado","habéis conservado","han conservado","conservando","preserving","conservado","preserved"]
["conservar","to preserve, conserve; to keep, retain","Indicativo","Indicative","Futuro perfecto","Future Perfect","I will have preserved","habré conservado","habrás conservado","habrá conservado","habremos conservado","habréis conservado","habrán conservado","conservando","preserving","conservado","preserved"]
["conservar","to preserve, conserve; to keep, retain","Indicativo","Indicative","Pluscuamperfecto","Past Perfect","I had preserved","había conservado","habías conservado","había conservado","habíamos conservado","habíais conservado","habían conservado","conservando","preserving","conservado","preserved"]
["conservar","to preserve, conserve; to keep, retain","Indicativo","Indicative","Pretérito anterior","Preterite (Archaic)","I had preserved","hube conservado","hubiste conservado","hubo conservado","hubimos conservado","hubisteis conservado","hubieron conservado","conservando","preserving","conservado","preserved"]
["conservar","to preserve, conserve; to keep, retain","Indicativo","Indicative","Condicional perfecto","Conditional Perfect","I would have preserved","habría conservado","habrías conservado","habría conservado","habríamos conservado","habríais conservado","habrían conservado","conservando","preserving","conservado","preserved"]
["conservar","to preserve, conserve; to keep, retain","Subjuntivo","Subjunctive","Presente","Present","I preserve, am preserving","conserve","conserves","conserve","conservemos","conservéis","conserven","conservando","preserving","conservado","preserved"]
["conservar","to preserve, conserve; to keep, retain","Subjuntivo","Subjunctive","Imperfecto","Imperfect","I preserved, was preserving","conservara","conservaras","conservara","conserváramos","conservarais","conservaran","conservando","preserving","conservado","preserved"]
["conservar","to preserve, conserve; to keep, retain","Subjuntivo","Subjunctive","Futuro","Future","I will preserve","conservare","conservares","conservare","conserváremos","conservareis","conservaren","conservando","preserving","conservado","preserved"]
["conservar","to preserve, conserve; to keep, retain","Subjuntivo","Subjunctive","Presente perfecto","Present Perfect","I have preserved, preserved","haya conservado","hayas conservado","haya conservado","hayamos conservado","hayáis conservado","hayan conservado","conservando","preserving","conservado","preserved"]
["conservar","to preserve, conserve; to keep, retain","Subjuntivo","Subjunctive","Futuro perfecto","Future Perfect","I will have preserved","hubiere conservado","hubieres conservado","hubiere conservado","hubiéremos conservado","hubiereis conservado","hubieren conservado","conservando","preserving","conservado","preserved"]
["conservar","to preserve, conserve; to keep, retain","Subjuntivo","Subjunctive","Pluscuamperfecto","Past Perfect","I had preserved","hubiera conservado","hubieras conservado","hubiera conservado","hubiéramos conservado","hubierais conservado","hubieran conservado","conservando","preserving","conservado","preserved"]
["consistir","to consist [of], be composed [of]","Imperativo Afirmativo","Imperative Affirmative","Presente","Present","Consist! Don't consist!",null,"consiste","consistid",null,"consista","consistan","consistiendo","consisting","consistido","consisted"]
["consistir","to consist [of], be composed [of]","Imperativo Negativo","Imperative Negative","Presente","Present","Consist! Don't consist!",null,"no consistas","no consistáis",null,"no consista","no consistan","consistiendo","consisting","consistido","consisted"]
["consistir","to consist [of], be composed [of]","Indicativo","Indicative","Presente","Present","I consist, am consisting","consisto","consistes","consiste","consistimos","consistís","consisten","consistiendo","consisting","consistido","consisted"]
["consistir","to consist [of], be composed [of]","Indicativo","Indicative","Futuro","Future","I will consist","consistiré","consistirás","consistirá","consistiremos","consistiréis","consistirán","consistiendo","consisting","consistido","consisted"]
["consistir","to consist [of], be composed [of]","Indicativo","Indicative","Imperfecto","Imperfect","I was consisting, used to consist, consisted","consistía","consistías","consistía","consistíamos","consistíais","consistían","consistiendo","consisting","consistido","consisted"]
["consistir","to consist [of], be composed [of]","Indicativo","Indicative","Pretérito","Preterite","I consisted","consistí","consististe","consistió","consistimos","consististeis","consistieron","consistiendo","consisting","consistido","consisted"]
["consistir","to consist [of], be composed [of]","Indicativo","Indicative","Condicional","Conditional","I would consist","consistiría","consistirías","consistiría","consistiríamos","consistiríais","consistirían","consistiendo","consisting","consistido","consisted"]
["consistir","to consist [of], be composed [of]","Indicativo","Indicative","Presente perfecto","Present Perfect","I have consisted","he consistido","has consistido","ha consistido","hemos consistido","habéis consistido","han consistido","consistiendo","consisting","consistido","consisted"]
["consistir","to consist [of], be composed [of]","Indicativo","Indicative","Futuro perfecto","Future Perfect","I will have consisted","habré consistido","habrás consistido","habrá consistido","habremos consistido","habréis consistido","habrán consistido","consistiendo","consisting","consistido","consisted"]
["consistir","to consist [of], be composed [of]","Indicativo","Indicative","Pluscuamperfecto","Past Perfect","I had consisted","había consistido","habías consistido","había consistido","habíamos consistido","habíais consistido","habían consistido","consistiendo","consisting","consistido","consisted"]
["consistir","to consist [of], be composed [of]","Indicativo","Indicative","Pretérito anterior","Preterite (Archaic)","I had consisted","hube consistido","hubiste consistido","hubo consistido","hubimos consistido","hubisteis consistido","hubieron consistido","consistiendo","consisting","consistido","consisted"]
["consistir","to consist [of], be composed [of]","Indicativo","Indicative","Condicional perfecto","Conditional Perfect","I would have consisted","habría consistido","habrías consistido","habría consistido","habríamos consistido","habríais consistido","habrían consistido","consistiendo","consisting","consistido","consisted"]
["consistir","to consist [of], be composed [of]","Subjuntivo","Subjunctive","Presente","Present","I consist, am consisting","consista","consistas","consista","consistamos","consistáis","consistan","consistiendo","consisting","consistido","consisted"]
["consistir","to consist [of], be composed [of]","Subjuntivo","Subjunctive","Imperfecto","Imperfect","I consisted, was consisting","consistiera","consistieras","consistiera","consistiéramos","consistierais","consistieran","consistiendo","consisting","consistido","consisted"]
["consistir","to consist [of], be composed [of]","Subjuntivo","Subjunctive","Futuro","Future","I will consist","consistiere","consistieres","consistiere","consistiéremos","consistiereis","consistieren","consistiendo","consisting","consistido","consisted"]
["consistir","to consist [of], be composed [of]","Subjuntivo","Subjunctive","Presente perfecto","Present Perfect","I have consisted, consisted","haya consistido","hayas consistido","haya consistido","hayamos consistido","hayáis consistido","hayan consistido","consistiendo","consisting","consistido","consisted"]
["consistir","to consist [of], be composed [of]","Subjuntivo","Subjunctive","Futuro perfecto","Future Perfect","I will have consisted","hubiere consistido","hubieres consistido","hubiere consistido","hubiéremos consistido","hubiereis consistido","hubieren consistido","consistiendo","consisting","consistido","consisted"]
["consistir","to consist [of], be composed [of]","Subjuntivo","Subjunctive","Pluscuamperfecto","Past Perfect","I had consisted","hubiera consistido","hubieras consistido","hubiera consistido","hubiéramos consistido","hubierais consistido","hubieran consistido","consistiendo","consisting","consistido","consisted"]
["constituir","to constitute","Imperativo Afirmativo","Imperative Affirmative","Presente","Present","Constitute! Don't constitute!",null,"constituye","constituid",null,"constituya","constituyan","constituyendo","constituting","constituido","constituted"]
["constituir","to constitute","Imperativo Negativo","Imperative Negative","Presente","Present","Constitute! Don't constitute!",null,"no constituyas","no constituyáis",null,"no constituya","no constituyan","constituyendo","constituting","constituido","constituted"]
["constituir","to constitute","Indicativo","Indicative","Presente","Present","I constitute, am constituting","constituyo","constituyes","constituye","constituimos","constituís","constituyen","constituyendo","constituting","constituido","constituted"]
["constituir","to constitute","Indicativo","Indicative","Futuro","Future","I will constitute","constituiré","constituirás","constituirá","constituiremos","constituiréis","constituirán","constituyendo","constituting","constituido","constituted"]
["constituir","to constitute","Indicativo","Indicative","Imperfecto","Imperfect","I was constituting, used to constitute, constituted","constituía","constituías","constituía","constituíamos","constituíais","constituían","constituyendo","constituting","constituido","constituted"]
["constituir","to constitute","Indicativo","Indicative","Pretérito","Preterite","I constituted","constituí","constituiste","constituyó","constituimos","constituisteis","constituyeron","constituyendo","constituting","constituido","constituted"]
["constituir","to constitute","Indicativo","Indicative","Condicional","Conditional","I would constitute","constituiría","constituirías","constituiría","constituiríamos","constituiríais","constituirían","constituyendo","constituting","constituido","constituted"]
["constituir","to constitute","Indicativo","Indicative","Presente perfecto","Present Perfect","I have constituted","he constituido","has constituido","ha constituido","hemos constituido","habéis constituido","han constituido","constituyendo","constituting","constituido","constituted"]
["constituir","to constitute","Indicativo","Indicative","Futuro perfecto","Future Perfect","I will have constituted","habré constituido","habrás constituido","habrá constituido","habremos constituido","habréis constituido","habrán constituido","constituyendo","constituting","constituido","constituted"]
["constituir","to constitute","Indicativo","Indicative","Pluscuamperfecto","Past Perfect","I had constituted","había constituido","habías constituido","había constituido","habíamos constituido","habíais constituido","habían constituido","constituyendo","constituting","constituido","constituted"]
["constituir","to constitute","Indicativo","Indicative","Pretérito anterior","Preterite (Archaic)","I had constituted","hube constituido","hubiste constituido","hubo constituido","hubimos constituido","hubisteis constituido","hubieron constituido","constituyendo","constituting","constituido","constituted"]
["constituir","to constitute","Indicativo","Indicative","Condicional perfecto","Conditional Perfect","I would have constituted","habría constituido","habrías constituido","habría constituido","habríamos constituido","habríais constituido","habrían constituido","constituyendo","constituting","constituido","constituted"]
["constituir","to constitute","Subjuntivo","Subjunctive","Presente","Present","I constitute, am constituting","constituya","constituyas","constituya","constituyamos","constituyáis","constituyan","constituyendo","constituting","constituido","constituted"]
["constituir","to constitute","Subjuntivo","Subjunctive","Imperfecto","Imperfect","I constituted, was constituting","constituyera","constituyeras","constituyera","constituyéramos","constituyerais","constituyeran","constituyendo","constituting","constituido","constituted"]
["constituir","to constitute","Subjuntivo","Subjunctive","Futuro","Future","I will constitute","constituyere","constituyeres","constituyere","constituyéremos","constituyereis","constituyeren","constituyendo","constituting","constituido","constituted"]
["constituir","to constitute","Subjuntivo","Subjunctive","Presente perfecto","Present Perfect","I have constituted, constituted","haya constituido","hayas constituido","haya constituido","hayamos constituido","hayáis constituido","hayan constituido","constituyendo","constituting","constituido","constituted"]
["constituir","to constitute","Subjuntivo","Subjunctive","Futuro perfecto","Future Perfect","I will have constituted","hubiere constituido","hubieres constituido","hubiere constituido","hubiéremos constituido","hubiereis constituido","hubieren constituido","constituyendo","constituting","constituido","constituted"]
["constituir","to constitute","Subjuntivo","Subjunctive","Pluscuamperfecto","Past Perfect","I had constituted","hubiera constituido","hubieras constituido","hubiera constituido","hubiéramos constituido","hubierais constituido","hubieran constituido","constituyendo","constituting","constituido","constituted"]
["construir","to build, construct","Imperativo Afirmativo","Imperative Affirmative","Presente","Present","Build! Don't build!",null,"construye","construid",null,"construya","construyan","construyendo","building","construido","built"]
["construir","to build, construct","Imperativo Negativo","Imperative Negative","Presente","Present","Build! Don't build!",null,"no construyas","no construyáis",null,"no construya","no construyan","construyendo","building","construido","built"]
["construir","to build, construct","Indicativo","Indicative","Presente","Present","I build, am building","construyo","construyes","construye","construimos","construís","construyen","construyendo","building","construido","built"]
["construir","to build, construct","Indicativo","Indicative","Futuro","Future","I will build","construiré","construirás","construirá","construiremos","construiréis","construirán","construyendo","building","construido","built"]
["construir","to build, construct","Indicativo","Indicative","Imperfecto","Imperfect","I was building, used to build, built","construía","construías","construía","construíamos","construíais","construían","construyendo","building","construido","built"]
["construir","to build, construct","Indicativo","Indicative","Pretérito","Preterite","I built","construí","construiste","construyó","construimos","construisteis","construyeron","construyendo","building","construido","built"]
["construir","to build, construct","Indicativo","Indicative","Condicional","Conditional","I would build","construiría","construirías","construiría","construiríamos","construiríais","construirían","construyendo","building","construido","built"]
["construir","to build, construct","Indicativo","Indicative","Presente perfecto","Present Perfect","I have built","he construido","has construido","ha construido","hemos construido","habéis construido","han construido","construyendo","building","construido","built"]
["construir","to build, construct","Indicativo","Indicative","Futuro perfecto","Future Perfect","I will have built","habré construido","habrás construido","habrá construido","habremos construido","habréis construido","habrán construido","construyendo","building","construido","built"]
["construir","to build, construct","Indicativo","Indicative","Pluscuamperfecto","Past Perfect","I had built","había construido","habías construido","había construido","habíamos construido","habíais construido","habían construido","construyendo","building","construido","built"]
["construir","to build, construct","Indicativo","Indicative","Pretérito anterior","Preterite (Archaic)","I had built","hube construido","hubiste construido","hubo construido","hubimos construido","hubisteis construido","hubieron construido","construyendo","building","construido","built"]
["construir","to build, construct","Indicativo","Indicative","Condicional perfecto","Conditional Perfect","I would have built","habría construido","habrías construido","habría construido","habríamos construido","habríais construido","habrían construido","construyendo","building","construido","built"]
["construir","to build, construct","Subjuntivo","Subjunctive","Presente","Present","I build, am building","construya","construyas","construya","construyamos","construyáis","construyan","construyendo","building","construido","built"]
["construir","to build, construct","Subjuntivo","Subjunctive","Imperfecto","Imperfect","I built, was building","construyera","construyeras","construyera","construyéramos","construyerais","construyeran","construyendo","building","construido","built"]
["construir","to build, construct","Subjuntivo","Subjunctive","Futuro","Future","I will build","construyere","construyeres","construyere","construyéremos","construyereis","construyeren","construyendo","building","construido","built"]
["construir","to build, construct","Subjuntivo","Subjunctive","Presente perfecto","Present Perfect","I have built, built","haya construido","hayas construido","haya construido","hayamos construido","hayáis construido","hayan construido","construyendo","building","construido","built"]
["construir","to build, construct","Subjuntivo","Subjunctive","Futuro perfecto","Future Perfect","I will have built","hubiere construido","hubieres construido","hubiere construido","hubiéremos construido","hubiereis construido","hubieren construido","construyendo","building","construido","built"]
["construir","to build, construct","Subjuntivo","Subjunctive","Pluscuamperfecto","Past Perfect","I had built","hubiera construido","hubieras construido","hubiera construido","hubiéramos construido","hubierais construido","hubieran construido","construyendo","building","construido","built"]
["contar","to count, relate, tell","Imperativo Afirmativo","Imperative Affirmative","Presente","Present","Count! Don't count!",null,"cuenta","contad",null,"cuente","cuenten","contando","counting","contado","counted"]
["contar","to count, relate, tell","Imperativo Negativo","Imperative Negative","Presente","Present","Count! Don't count!",null,"no cuentes","no contéis",null,"no cuente","no cuenten","contando","counting","contado","counted"]
["contar","to count, relate, tell","Indicativo","Indicative","Presente","Present","I count, am counting","cuento","cuentas","cuenta","contamos","contáis","cuentan","contando","counting","contado","counted"]
["contar","to count, relate, tell","Indicativo","Indicative","Futuro","Future","I will count","contaré","contarás","contará","contaremos","contaréis","contarán","contando","counting","contado","counted"]
["contar","to count, relate, tell","Indicativo","Indicative","Imperfecto","Imperfect","I was counting, used to count, counted","contaba","contabas","contaba","contábamos","contabais","contaban","contando","counting","contado","counted"]
["contar","to count, relate, tell","Indicativo","Indicative","Pretérito","Preterite","I counted","conté","contaste","contó","contamos","contasteis","contaron","contando","counting","contado","counted"]
["contar","to count, relate, tell","Indicativo","Indicative","Condicional","Conditional","I would count","contaría","contarías","contaría","contaríamos","contaríais","contarían","contando","counting","contado","counted"]
["contar","to count, relate, tell","Indicativo","Indicative","Presente perfecto","Present Perfect","I have counted","he contado","has contado","ha contado","hemos contado","habéis contado","han contado","contando","counting","contado","counted"]
["contar","to count, relate, tell","Indicativo","Indicative","Futuro perfecto","Future Perfect","I will have counted","habré contado","habrás contado","habrá contado","habremos contado","habréis contado","habrán contado","contando","counting","contado","counted"]
["contar","to count, relate, tell","Indicativo","Indicative","Pluscuamperfecto","Past Perfect","I had counted","había contado","habías contado","había contado","habíamos contado","habíais contado","habían contado","contando","counting","contado","counted"]
["contar","to count, relate, tell","Indicativo","Indicative","Pretérito anterior","Preterite (Archaic)","I had counted","hube contado","hubiste contado","hubo contado","hubimos contado","hubisteis contado","hubieron contado","contando","counting","contado","counted"]
["contar","to count, relate, tell","Indicativo","Indicative","Condicional perfecto","Conditional Perfect","I would have counted","habría contado","habrías contado","habría contado","habríamos contado","habríais contado","habrían contado","contando","counting","contado","counted"]
["contar","to count, relate, tell","Subjuntivo","Subjunctive","Presente","Present","I count, am counting","cuente","cuentes","cuente","contemos","contéis","cuenten","contando","counting","contado","counted"]
["contar","to count, relate, tell","Subjuntivo","Subjunctive","Imperfecto","Imperfect","I counted, was counting","contara","contaras","contara","contáramos","contarais","contaran","contando","counting","contado","counted"]
["contar","to count, relate, tell","Subjuntivo","Subjunctive","Futuro","Future","I will count","contare","contares","contare","contáremos","contareis","contaren","contando","counting","contado","counted"]
["contar","to count, relate, tell","Subjuntivo","Subjunctive","Presente perfecto","Present Perfect","I have counted, counted","haya contado","hayas contado","haya contado","hayamos contado","hayáis contado","hayan contado","contando","counting","contado","counted"]
["contar","to count, relate, tell","Subjuntivo","Subjunctive","Futuro perfecto","Future Perfect","I will have counted","hubiere contado","hubieres contado","hubiere contado","hubiéremos contado","hubiereis contado","hubieren contado","contando","counting","contado","counted"]
["contar","to count, relate, tell","Subjuntivo","Subjunctive","Pluscuamperfecto","Past Perfect","I had counted","hubiera contado","hubieras contado","hubiera contado","hubiéramos contado","hubierais contado","hubieran contado","contando","counting","contado","counted"]
["contestar","to answer","Imperativo Afirmativo","Imperative Affirmative","Presente","Present","Answer! Don't answer!",null,"contesta","contestad",null,"conteste","contesten","contestando","answering","contestado","answered"]
["contestar","to answer","Imperativo Negativo","Imperative Negative","Presente","Present","Answer! Don't answer!",null,"no contestes","no contestéis",null,"no conteste","no contesten","contestando","answering","contestado","answered"]
["contestar","to answer","Indicativo","Indicative","Presente","Present","I answer, am answering","contesto","contestas","contesta","contestamos","contestáis","contestan","contestando","answering","contestado","answered"]
["contestar","to answer","Indicativo","Indicative","Futuro","Future","I will answer","contestaré","contestarás","contestará","contestaremos","contestaréis","contestarán","contestando","answering","contestado","answered"]
["contestar","to answer","Indicativo","Indicative","Imperfecto","Imperfect","I was answering, used to answer, answered","contestaba","contestabas","contestaba","contestábamos","contestabais","contestaban","contestando","answering","contestado","answered"]
["contestar","to answer","Indicativo","Indicative","Pretérito","Preterite","I answered","contesté","contestaste","contestó","contestamos","contestasteis","contestaron","contestando","answering","contestado","answered"]
["contestar","to answer","Indicativo","Indicative","Condicional","Conditional","I would answer","contestaría","contestarías","contestaría","contestaríamos","contestaríais","contestarían","contestando","answering","contestado","answered"]
["contestar","to answer","Indicativo","Indicative","Presente perfecto","Present Perfect","I have answered","he contestado","has contestado","ha contestado","hemos contestado","habéis contestado","han contestado","contestando","answering","contestado","answered"]
["contestar","to answer","Indicativo","Indicative","Futuro perfecto","Future Perfect","I will have answered","habré contestado","habrás contestado","habrá contestado","habremos contestado","habréis contestado","habrán contestado","contestando","answering","contestado","answered"]
["contestar","to answer","Indicativo","Indicative","Pluscuamperfecto","Past Perfect","I had answered","había contestado","habías contestado","había contestado","habíamos contestado","habíais contestado","habían contestado","contestando","answering","contestado","answered"]
["contestar","to answer","Indicativo","Indicative","Pretérito anterior","Preterite (Archaic)","I had answered","hube contestado","hubiste contestado","hubo contestado","hubimos contestado","hubisteis contestado","hubieron contestado","contestando","answering","contestado","answered"]
["contestar","to answer","Indicativo","Indicative","Condicional perfecto","Conditional Perfect","I would have answered","habría contestado","habrías contestado","habría contestado","habríamos contestado","habríais contestado","habrían contestado","contestando","answering","contestado","answered"]
["contestar","to answer","Subjuntivo","Subjunctive","Presente","Present","I answer, am answering","conteste","contestes","conteste","contestemos","contestéis","contesten","contestando","answering","contestado","answered"]
["contestar","to answer","Subjuntivo","Subjunctive","Imperfecto","Imperfect","I answered, was answering","contestara","contestaras","contestara","contestáramos","contestarais","contestaran","contestando","answering","contestado","answered"]
["contestar","to answer","Subjuntivo","Subjunctive","Futuro","Future","I will answer","contestare","contestares","contestare","contestáremos","contestareis","contestaren","contestando","answering","contestado","answered"]
["contestar","to answer","Subjuntivo","Subjunctive","Presente perfecto","Present Perfect","I have answered, answered","haya contestado","hayas contestado","haya contestado","hayamos contestado","hayáis contestado","hayan contestado","contestando","answering","contestado","answered"]
["contestar","to answer","Subjuntivo","Subjunctive","Futuro perfecto","Future Perfect","I will have answered","hubiere contestado","hubieres contestado","hubiere contestado","hubiéremos contestado","hubiereis contestado","hubieren contestado","contestando","answering","contestado","answered"]
["contestar","to answer","Subjuntivo","Subjunctive","Pluscuamperfecto","Past Perfect","I had answered","hubiera contestado","hubieras contestado","hubiera contestado","hubiéramos contestado","hubierais contestado","hubieran contestado","contestando","answering","contestado","answered"]
["continuar","to continue","Imperativo Afirmativo","Imperative Affirmative","Presente","Present","Continue! Don't continue!",null,"continúa","continuad",null,"continúe","continúen","continuando","continuing","continuado","continued"]
["continuar","to continue","Imperativo Negativo","Imperative Negative","Presente","Present","Continue! Don't continue!",null,"no continúes","no continuéis",null,"no continúe","no continúen","continuando","continuing","continuado","continued"]
["continuar","to continue","Indicativo","Indicative","Presente","Present","I continue, am continuing","continúo","continúas","continúa","continuamos","continuáis","continúan","continuando","continuing","continuado","continued"]
["continuar","to continue","Indicativo","Indicative","Futuro","Future","I will continue","continuaré","continuarás","continuará","continuaremos","continuaréis","continuarán","continuando","continuing","continuado","continued"]
["continuar","to continue","Indicativo","Indicative","Imperfecto","Imperfect","I was continuing, used to continue, continued","continuaba","continuabas","continuaba","continuábamos","continuabais","continuaban","continuando","continuing","continuado","continued"]
["continuar","to continue","Indicativo","Indicative","Pretérito","Preterite","I continued","continué","continuaste","continuó","continuamos","continuasteis","continuaron","continuando","continuing","continuado","continued"]
["continuar","to continue","Indicativo","Indicative","Condicional","Conditional","I would continue","continuaría","continuarías","continuaría","continuaríamos","continuaríais","continuarían","continuando","continuing","continuado","continued"]
["continuar","to continue","Indicativo","Indicative","Presente perfecto","Present Perfect","I have continued","he continuado","has continuado","ha continuado","hemos continuado","habéis continuado","han continuado","continuando","continuing","continuado","continued"]
["continuar","to continue","Indicativo","Indicative","Futuro perfecto","Future Perfect","I will have continued","habré continuado","habrás continuado","habrá continuado","habremos continuado","habréis continuado","habrán continuado","continuando","continuing","continuado","continued"]
["continuar","to continue","Indicativo","Indicative","Pluscuamperfecto","Past Perfect","I had continued","había continuado","habías continuado","había continuado","habíamos continuado","habíais continuado","habían continuado","continuando","continuing","continuado","continued"]
["continuar","to continue","Indicativo","Indicative","Pretérito anterior","Preterite (Archaic)","I had continued","hube continuado","hubiste continuado","hubo continuado","hubimos continuado","hubisteis continuado","hubieron continuado","continuando","continuing","continuado","continued"]
["continuar","to continue","Indicativo","Indicative","Condicional perfecto","Conditional Perfect","I would have continued","habría continuado","habrías continuado","habría continuado","habríamos continuado","habríais continuado","habrían continuado","continuando","continuing","continuado","continued"]
["continuar","to continue","Subjuntivo","Subjunctive","Presente","Present","I continue, am continuing","continúe","continúes","continúe","continuemos","continuéis","continúen","continuando","continuing","continuado","continued"]
["continuar","to continue","Subjuntivo","Subjunctive","Imperfecto","Imperfect","I continued, was continuing","continuara","continuaras","continuara","continuáramos","continuarais","continuaran","continuando","continuing","continuado","continued"]
["continuar","to continue","Subjuntivo","Subjunctive","Futuro","Future","I will continue","continuare","continuares","continuare","continuáremos","continuareis","continuaren","continuando","continuing","continuado","continued"]
["continuar","to continue","Subjuntivo","Subjunctive","Presente perfecto","Present Perfect","I have continued, continued","haya continuado","hayas continuado","haya continuado","hayamos continuado","hayáis continuado","hayan continuado","continuando","continuing","continuado","continued"]
["continuar","to continue","Subjuntivo","Subjunctive","Futuro perfecto","Future Perfect","I will have continued","hubiere continuado","hubieres continuado","hubiere continuado","hubiéremos continuado","hubiereis continuado","hubieren continuado","continuando","continuing","continuado","continued"]
["continuar","to continue","Subjuntivo","Subjunctive","Pluscuamperfecto","Past Perfect","I had continued","hubiera continuado","hubieras continuado","hubiera continuado","hubiéramos continuado","hubierais continuado","hubieran continuado","continuando","continuing","continuado","continued"]
["convertir","to convert","Imperativo Afirmativo","Imperative Affirmative","Presente","Present","Convert! Don't convert!",null,"convierte","convertid",null,"convierta","conviertan","convirtiendo","converting","convertido","converted"]
["convertir","to convert","Imperativo Negativo","Imperative Negative","Presente","Present","Convert! Don't convert!",null,"no conviertas","no convirtáis",null,"no convierta","no conviertan","convirtiendo","converting","convertido","converted"]
["convertir","to convert","Indicativo","Indicative","Presente","Present","I convert, am converting","convierto","conviertes","convierte","convertimos","convertís","convierten","convirtiendo","converting","convertido","converted"]
["convertir","to convert","Indicativo","Indicative","Futuro","Future","I will convert","convertiré","convertirás","convertirá","convertiremos","convertiréis","convertirán","convirtiendo","converting","convertido","converted"]
["convertir","to convert","Indicativo","Indicative","Imperfecto","Imperfect","I was converting, used to convert, converted","convertía","convertías","convertía","convertíamos","convertíais","convertían","convirtiendo","converting","convertido","converted"]
["convertir","to convert","Indicativo","Indicative","Pretérito","Preterite","I converted","convertí","convertiste","convirtió","convertimos","convertisteis","convirtieron","convirtiendo","converting","convertido","converted"]
["convertir","to convert","Indicativo","Indicative","Condicional","Conditional","I would convert","convertiría","convertirías","convertiría","convertiríamos","convertiríais","convertirían","convirtiendo","converting","convertido","converted"]
["convertir","to convert","Indicativo","Indicative","Presente perfecto","Present Perfect","I have converted","he convertido","has convertido","ha convertido","hemos convertido","habéis convertido","han convertido","convirtiendo","converting","convertido","converted"]
["convertir","to convert","Indicativo","Indicative","Futuro perfecto","Future Perfect","I will have converted","habré convertido","habrás convertido","habrá convertido","habremos convertido","habréis convertido","habrán convertido","convirtiendo","converting","convertido","converted"]
["convertir","to convert","Indicativo","Indicative","Pluscuamperfecto","Past Perfect","I had converted","había convertido","habías convertido","había convertido","habíamos convertido","habíais convertido","habían convertido","convirtiendo","converting","convertido","converted"]
["convertir","to convert","Indicativo","Indicative","Pretérito anterior","Preterite (Archaic)","I had converted","hube convertido","hubiste convertido","hubo convertido","hubimos convertido","hubisteis convertido","hubieron convertido","convirtiendo","converting","convertido","converted"]
["convertir","to convert","Indicativo","Indicative","Condicional perfecto","Conditional Perfect","I would have converted","habría convertido","habrías convertido","habría convertido","habríamos convertido","habríais convertido","habrían convertido","convirtiendo","converting","convertido","converted"]
["convertir","to convert","Subjuntivo","Subjunctive","Presente","Present","I convert, am converting","convierta","conviertas","convierta","convirtamos","convirtáis","conviertan","convirtiendo","converting","convertido","converted"]
["convertir","to convert","Subjuntivo","Subjunctive","Imperfecto","Imperfect","I converted, was converting","convirtiera","convirtieras","convirtiera","convirtiéramos","convirtierais","convirtieran","convirtiendo","converting","convertido","converted"]
["convertir","to convert","Subjuntivo","Subjunctive","Futuro","Future","I will convert","convirtiere","convirtieres","convirtiere","convirtiéremos","convirtiereis","convirtieren","convirtiendo","converting","convertido","converted"]
["convertir","to convert","Subjuntivo","Subjunctive","Presente perfecto","Present Perfect","I have converted, converted","haya convertido","hayas convertido","haya convertido","hayamos convertido","hayáis convertido","hayan convertido","convirtiendo","converting","convertido","converted"]
["convertir","to convert","Subjuntivo","Subjunctive","Futuro perfecto","Future Perfect","I will have converted","hubiere convertido","hubieres convertido","hubiere convertido","hubiéremos convertido","hubiereis convertido","hubieren convertido","convirtiendo","converting","convertido","converted"]
["convertir","to convert","Subjuntivo","Subjunctive","Pluscuamperfecto","Past Perfect","I had converted","hubiera convertido","hubieras convertido","hubiera convertido","hubiéramos convertido","hubierais convertido","hubieran convertido","convirtiendo","converting","convertido","converted"]
["correr","to run","Imperativo Afirmativo","Imperative Affirmative","Presente","Present","Run! Don't run!",null,"corre","corred",null,"corra","corran","corriendo","running","corrido","run"]
["correr","to run","Imperativo Negativo","Imperative Negative","Presente","Present","Run! Don't run!",null,"no corras","no corráis",null,"no corra","no corran","corriendo","running","corrido","run"]
["correr","to run","Indicativo","Indicative","Presente","Present","I run, am running","corro","corres","corre","corremos","corréis","corren","corriendo","running","corrido","run"]
["correr","to run","Indicativo","Indicative","Futuro","Future","I will run","correré","correrás","correrá","correremos","correréis","correrán","corriendo","running","corrido","run"]
["correr","to run","Indicativo","Indicative","Imperfecto","Imperfect","I was running, used to run, ran","corría","corrías","corría","corríamos","corríais","corrían","corriendo","running","corrido","run"]
["correr","to run","Indicativo","Indicative","Pretérito","Preterite","I ran","corrí","corriste","corrió","corrimos","corristeis","corrieron","corriendo","running","corrido","run"]
["correr","to run","Indicativo","Indicative","Condicional","Conditional","I would run","correría","correrías","correría","correríamos","correríais","correrían","corriendo","running","corrido","run"]
["correr","to run","Indicativo","Indicative","Presente perfecto","Present Perfect","I have run","he corrido","has corrido","ha corrido","hemos corrido","habéis corrido","han corrido","corriendo","running","corrido","run"]
["correr","to run","Indicativo","Indicative","Futuro perfecto","Future Perfect","I will have run","habré corrido","habrás corrido","habrá corrido","habremos corrido","habréis corrido","habrán corrido","corriendo","running","corrido","run"]
["correr","to run","Indicativo","Indicative","Pluscuamperfecto","Past Perfect","I had run","había corrido","habías corrido","había corrido","habíamos corrido","habíais corrido","habían corrido","corriendo","running","corrido","run"]
["correr","to run","Indicativo","Indicative","Pretérito anterior","Preterite (Archaic)","I had run","hube corrido","hubiste corrido","hubo corrido","hubimos corrido","hubisteis corrido","hubieron corrido","corriendo","running","corrido","run"]
["correr","to run","Indicativo","Indicative","Condicional perfecto","Conditional Perfect","I would have run","habría corrido","habrías corrido","habría corrido","habríamos corrido","habríais corrido","habrían corrido","corriendo","running","corrido","run"]
["correr","to run","Subjuntivo","Subjunctive","Presente","Present","I run, am running","corra","corras","corra","corramos","corráis","corran","corriendo","running","corrido","run"]
["correr","to run","Subjuntivo","Subjunctive","Imperfecto","Imperfect","I ran, was running","corriera","corrieras","corriera","corriéramos","corrierais","corrieran","corriendo","running","corrido","run"]
["correr","to run","Subjuntivo","Subjunctive","Futuro","Future","I will run","corriere","corrieres","corriere","corriéremos","corriereis","corrieren","corriendo","running","corrido","run"]
["correr","to run","Subjuntivo","Subjunctive","Presente perfecto","Present Perfect","I have run, ran","haya corrido","hayas corrido","haya corrido","hayamos corrido","hayáis corrido","hayan corrido","corriendo","running","corrido","run"]
["correr","to run","Subjuntivo","Subjunctive","Futuro perfecto","Future Perfect","I will have run","hubiere corrido","hubieres corrido","hubiere corrido","hubiéremos corrido","hubiereis corrido","hubieren corrido","corriendo","running","corrido","run"]
["correr","to run","Subjuntivo","Subjunctive","Pluscuamperfecto","Past Perfect","I had run","hubiera corrido","hubieras corrido","hubiera corrido","hubiéramos corrido","hubierais corrido","hubieran corrido","corriendo","running","corrido","run"]
["cortar","to cut","Imperativo Afirmativo","Imperative Affirmative","Presente","Present","Cut! Don't cut!",null,"corta","cortad",null,"corte","corten","cortando","cutting","cortado","cut"]
["cortar","to cut","Imperativo Negativo","Imperative Negative","Presente","Present","Cut! Don't cut!",null,"no cortes","no cortéis",null,"no corte","no corten","cortando","cutting","cortado","cut"]
["cortar","to cut","Indicativo","Indicative","Presente","Present","I cut, am cutting","corto","cortas","corta","cortamos","cortáis","cortan","cortando","cutting","cortado","cut"]
["cortar","to cut","Indicativo","Indicative","Futuro","Future","I will cut","cortaré","cortarás","cortará","cortaremos","cortaréis","cortarán","cortando","cutting","cortado","cut"]
["cortar","to cut","Indicativo","Indicative","Imperfecto","Imperfect","I was cutting, used to cut, cut","cortaba","cortabas","cortaba","cortábamos","cortabais","cortaban","cortando","cutting","cortado","cut"]
["cortar","to cut","Indicativo","Indicative","Pretérito","Preterite","I cut","corté","cortaste","cortó","cortamos","cortasteis","cortaron","cortando","cutting","cortado","cut"]
["cortar","to cut","Indicativo","Indicative","Condicional","Conditional","I would cut","cortaría","cortarías","cortaría","cortaríamos","cortaríais","cortarían","cortando","cutting","cortado","cut"]
["cortar","to cut","Indicativo","Indicative","Presente perfecto","Present Perfect","I have cut","he cortado","has cortado","ha cortado","hemos cortado","habéis cortado","han cortado","cortando","cutting","cortado","cut"]
["cortar","to cut","Indicativo","Indicative","Futuro perfecto","Future Perfect","I will have cut","habré cortado","habrás cortado","habrá cortado","habremos cortado","habréis cortado","habrán cortado","cortando","cutting","cortado","cut"]
["cortar","to cut","Indicativo","Indicative","Pluscuamperfecto","Past Perfect","I had cut","había cortado","habías cortado","había cortado","habíamos cortado","habíais cortado","habían cortado","cortando","cutting","cortado","cut"]
["cortar","to cut","Indicativo","Indicative","Pretérito anterior","Preterite (Archaic)","I had cut","hube cortado","hubiste cortado","hubo cortado","hubimos cortado","hubisteis cortado","hubieron cortado","cortando","cutting","cortado","cut"]
["cortar","to cut","Indicativo","Indicative","Condicional perfecto","Conditional Perfect","I would have cut","habría cortado","habrías cortado","habría cortado","habríamos cortado","habríais cortado","habrían cortado","cortando","cutting","cortado","cut"]
["cortar","to cut","Subjuntivo","Subjunctive","Futuro","Future","I will cut","cortare","cortares","cortare","cortáremos","cortareis","cortaren","cortando","cutting","cortado","cut"]
["cortar","to cut","Subjuntivo","Subjunctive","Presente","Present","I cut, am cutting","corte","cortes","corte","cortemos","cortéis","corten","cortando","cutting","cortado","cut"]
["cortar","to cut","Subjuntivo","Subjunctive","Imperfecto","Imperfect","I cut, was cutting","cortara","cortaras","cortara","cortáramos","cortarais","cortaran","cortando","cutting","cortado","cut"]
["cortar","to cut","Subjuntivo","Subjunctive","Presente perfecto","Present Perfect","I have cut, cut","haya cortado","hayas cortado","haya cortado","hayamos cortado","hayáis cortado","hayan cortado","cortando","cutting","cortado","cut"]
["cortar","to cut","Subjuntivo","Subjunctive","Futuro perfecto","Future Perfect","I will have cut","hubiere cortado","hubieres cortado","hubiere cortado","hubiéremos cortado","hubiereis cortado","hubieren cortado","cortando","cutting","cortado","cut"]
["cortar","to cut","Subjuntivo","Subjunctive","Pluscuamperfecto","Past Perfect","I had cut","hubiera cortado","hubieras cortado","hubiera cortado","hubiéramos cortado","hubierais cortado","hubieran cortado","cortando","cutting","cortado","cut"]
["costar","to cost","Imperativo Afirmativo","Imperative Affirmative","Presente","Present","Cost! Don't cost!",null,"cuesta","costad",null,"cueste","cuesten","costando","costing","costado","cost"]
["costar","to cost","Imperativo Negativo","Imperative Negative","Presente","Present","Cost! Don't cost!",null,"no cuestes","no costéis",null,"no cueste","no cuesten","costando","costing","costado","cost"]
["costar","to cost","Indicativo","Indicative","Presente","Present","I cost, am costing","cuesto","cuestas","cuesta","costamos","costáis","cuestan","costando","costing","costado","cost"]
["costar","to cost","Indicativo","Indicative","Futuro","Future","I will cost","costaré","costarás","costará","costaremos","costaréis","costarán","costando","costing","costado","cost"]
["costar","to cost","Indicativo","Indicative","Imperfecto","Imperfect","I was costing, used to cost, cost","costaba","costabas","costaba","costábamos","costabais","costaban","costando","costing","costado","cost"]
["costar","to cost","Indicativo","Indicative","Pretérito","Preterite","I cost","costé","costaste","costó","costamos","costasteis","costaron","costando","costing","costado","cost"]
["costar","to cost","Indicativo","Indicative","Condicional","Conditional","I would cost","costaría","costarías","costaría","costaríamos","costaríais","costarían","costando","costing","costado","cost"]
["costar","to cost","Indicativo","Indicative","Presente perfecto","Present Perfect","I have cost","he costado","has costado","ha costado","hemos costado","habéis costado","han costado","costando","costing","costado","cost"]
["costar","to cost","Indicativo","Indicative","Futuro perfecto","Future Perfect","I will have cost","habré costado","habrás costado","habrá costado","habremos costado","habréis costado","habrán costado","costando","costing","costado","cost"]
["costar","to cost","Indicativo","Indicative","Pluscuamperfecto","Past Perfect","I had cost","había costado","habías costado","había costado","habíamos costado","habíais costado","habían costado","costando","costing","costado","cost"]
["costar","to cost","Indicativo","Indicative","Pretérito anterior","Preterite (Archaic)","I had cost","hube costado","hubiste costado","hubo costado","hubimos costado","hubisteis costado","hubieron costado","costando","costing","costado","cost"]
["costar","to cost","Indicativo","Indicative","Condicional perfecto","Conditional Perfect","I would have cost","habría costado","habrías costado","habría costado","habríamos costado","habríais costado","habrían costado","costando","costing","costado","cost"]
["costar","to cost","Subjuntivo","Subjunctive","Presente","Present","I cost, am costing","cueste","cuestes","cueste","costemos","costéis","cuesten","costando","costing","costado","cost"]
["costar","to cost","Subjuntivo","Subjunctive","Imperfecto","Imperfect","I cost, was costing","costara","costaras","costara","costáramos","costarais","costaran","costando","costing","costado","cost"]
["costar","to cost","Subjuntivo","Subjunctive","Futuro","Future","I will cost","costare","costares","costare","costáremos","costareis","costaren","costando","costing","costado","cost"]
["costar","to cost","Subjuntivo","Subjunctive","Presente perfecto","Present Perfect","I have cost, cost","haya costado","hayas costado","haya costado","hayamos costado","hayáis costado","hayan costado","costando","costing","costado","cost"]
["costar","to cost","Subjuntivo","Subjunctive","Futuro perfecto","Future Perfect","I will have cost","hubiere costado","hubieres costado","hubiere costado","hubiéremos costado","hubiereis costado","hubieren costado","costando","costing","costado","cost"]
["costar","to cost","Subjuntivo","Subjunctive","Pluscuamperfecto","Past Perfect","I had cost","hubiera costado","hubieras costado","hubiera costado","hubiéramos costado","hubierais costado","hubieran costado","costando","costing","costado","cost"]
["crear","to create; to make","Imperativo Afirmativo","Imperative Affirmative","Presente","Present","Create! Don't create!",null,"crea","cread",null,"cree","creen","creando","creating","creado","created"]
["crear","to create; to make","Imperativo Negativo","Imperative Negative","Presente","Present","Create! Don't create!",null,"no crees","no creéis",null,"no cree","no creen","creando","creating","creado","created"]
["crear","to create; to make","Indicativo","Indicative","Presente","Present","I create, am creating","creo","creas","crea","creamos","creáis","crean","creando","creating","creado","created"]
["crear","to create; to make","Indicativo","Indicative","Futuro","Future","I will create","crearé","crearás","creará","crearemos","crearéis","crearán","creando","creating","creado","created"]
["crear","to create; to make","Indicativo","Indicative","Imperfecto","Imperfect","I was creating, used to create, created","creaba","creabas","creaba","creábamos","creabais","creaban","creando","creating","creado","created"]
["crear","to create; to make","Indicativo","Indicative","Pretérito","Preterite","I created","creé","creaste","creó","creamos","creasteis","crearon","creando","creating","creado","created"]
["crear","to create; to make","Indicativo","Indicative","Condicional","Conditional","I would create","crearía","crearías","crearía","crearíamos","crearíais","crearían","creando","creating","creado","created"]
["crear","to create; to make","Indicativo","Indicative","Presente perfecto","Present Perfect","I have created","he creado","has creado","ha creado","hemos creado","habéis creado","han creado","creando","creating","creado","created"]
["crear","to create; to make","Indicativo","Indicative","Futuro perfecto","Future Perfect","I will have created","habré creado","habrás creado","habrá creado","habremos creado","habréis creado","habrán creado","creando","creating","creado","created"]
["crear","to create; to make","Indicativo","Indicative","Pluscuamperfecto","Past Perfect","I had created","había creado","habías creado","había creado","habíamos creado","habíais creado","habían creado","creando","creating","creado","created"]
["crear","to create; to make","Indicativo","Indicative","Pretérito anterior","Preterite (Archaic)","I had created","hube creado","hubiste creado","hubo creado","hubimos creado","hubisteis creado","hubieron creado","creando","creating","creado","created"]
["crear","to create; to make","Indicativo","Indicative","Condicional perfecto","Conditional Perfect","I would have created","habría creado","habrías creado","habría creado","habríamos creado","habríais creado","habrían creado","creando","creating","creado","created"]
["crear","to create; to make","Subjuntivo","Subjunctive","Presente","Present","I create, am creating","cree","crees","cree","creemos","creéis","creen","creando","creating","creado","created"]
["crear","to create; to make","Subjuntivo","Subjunctive","Imperfecto","Imperfect","I created, was creating","creara","crearas","creara","creáramos","crearais","crearan","creando","creating","creado","created"]
["crear","to create; to make","Subjuntivo","Subjunctive","Futuro","Future","I will create","creare","creares","creare","creáremos","creareis","crearen","creando","creating","creado","created"]
["crear","to create; to make","Subjuntivo","Subjunctive","Presente perfecto","Present Perfect","I have created, created","haya creado","hayas creado","haya creado","hayamos creado","hayáis creado","hayan creado","creando","creating","creado","created"]
["crear","to create; to make","Subjuntivo","Subjunctive","Futuro perfecto","Future Perfect","I will have created","hubiere creado","hubieres creado","hubiere creado","hubiéremos creado","hubiereis creado","hubieren creado","creando","creating","creado","created"]
["crear","to create; to make","Subjuntivo","Subjunctive","Pluscuamperfecto","Past Perfect","I had created","hubiera creado","hubieras creado","hubiera creado","hubiéramos creado","hubierais creado","hubieran creado","creando","creating","creado","created"]
["crecer","to grow [up]","Imperativo Afirmativo","Imperative Affirmative","Presente","Present","Grow! Don't grow!",null,"crece","creced",null,"crezca","crezcan","creciendo","growing","crecido","grown"]
["crecer","to grow [up]","Imperativo Negativo","Imperative Negative","Presente","Present","Grow! Don't grow!",null,"no crezcas","no crezcáis",null,"no crezca","no crezcan","creciendo","growing","crecido","grown"]
["crecer","to grow [up]","Indicativo","Indicative","Presente","Present","I grow, am growing","crezco","creces","crece","crecemos","crecéis","crecen","creciendo","growing","crecido","grown"]
["crecer","to grow [up]","Indicativo","Indicative","Futuro","Future","I will grow","creceré","crecerás","crecerá","creceremos","creceréis","crecerán","creciendo","growing","crecido","grown"]
["crecer","to grow [up]","Indicativo","Indicative","Imperfecto","Imperfect","I was growing, used to grow, grew","crecía","crecías","crecía","crecíamos","crecíais","crecían","creciendo","growing","crecido","grown"]
["crecer","to grow [up]","Indicativo","Indicative","Pretérito","Preterite","I grew","crecí","creciste","creció","crecimos","crecisteis","crecieron","creciendo","growing","crecido","grown"]
["crecer","to grow [up]","Indicativo","Indicative","Condicional","Conditional","I would grow","crecería","crecerías","crecería","creceríamos","creceríais","crecerían","creciendo","growing","crecido","grown"]
["crecer","to grow [up]","Indicativo","Indicative","Presente perfecto","Present Perfect","I have grown","he crecido","has crecido","ha crecido","hemos crecido","habéis crecido","han crecido","creciendo","growing","crecido","grown"]
["crecer","to grow [up]","Indicativo","Indicative","Futuro perfecto","Future Perfect","I will have grown","habré crecido","habrás crecido","habrá crecido","habremos crecido","habréis crecido","habrán crecido","creciendo","growing","crecido","grown"]
["crecer","to grow [up]","Indicativo","Indicative","Pluscuamperfecto","Past Perfect","I had grown","había crecido","habías crecido","había crecido","habíamos crecido","habíais crecido","habían crecido","creciendo","growing","crecido","grown"]
["crecer","to grow [up]","Indicativo","Indicative","Pretérito anterior","Preterite (Archaic)","I had grown","hube crecido","hubiste crecido","hubo crecido","hubimos crecido","hubisteis crecido","hubieron crecido","creciendo","growing","crecido","grown"]
["crecer","to grow [up]","Indicativo","Indicative","Condicional perfecto","Conditional Perfect","I would have grown","habría crecido","habrías crecido","habría crecido","habríamos crecido","habríais crecido","habrían crecido","creciendo","growing","crecido","grown"]
["crecer","to grow [up]","Subjuntivo","Subjunctive","Presente","Present","I grow, am growing","crezca","crezcas","crezca","crezcamos","crezcáis","crezcan","creciendo","growing","crecido","grown"]
["crecer","to grow [up]","Subjuntivo","Subjunctive","Imperfecto","Imperfect","I grew, was growing","creciera","crecieras","creciera","creciéramos","crecierais","crecieran","creciendo","growing","crecido","grown"]
["crecer","to grow [up]","Subjuntivo","Subjunctive","Futuro","Future","I will grow","creciere","crecieres","creciere","creciéremos","creciereis","crecieren","creciendo","growing","crecido","grown"]
["crecer","to grow [up]","Subjuntivo","Subjunctive","Presente perfecto","Present Perfect","I have grown, grew","haya crecido","hayas crecido","haya crecido","hayamos crecido","hayáis crecido","hayan crecido","creciendo","growing","crecido","grown"]
["crecer","to grow [up]","Subjuntivo","Subjunctive","Futuro perfecto","Future Perfect","I will have grown","hubiere crecido","hubieres crecido","hubiere crecido","hubiéremos crecido","hubiereis crecido","hubieren crecido","creciendo","growing","crecido","grown"]
["crecer","to grow [up]","Subjuntivo","Subjunctive","Pluscuamperfecto","Past Perfect","I had grown","hubiera crecido","hubieras crecido","hubiera crecido","hubiéramos crecido","hubierais crecido","hubieran crecido","creciendo","growing","crecido","grown"]
["creer","to believe","Imperativo Afirmativo","Imperative Affirmative","Presente","Present","Believe! Don't believe!",null,"cree","creed",null,"crea","crean","creyendo","believing","creído","believed"]
["creer","to believe","Imperativo Negativo","Imperative Negative","Presente","Present","Believe! Don't believe!",null,"no creas","no creáis",null,"no crea","no crean","creyendo","believing","creído","believed"]
["creer","to believe","Indicativo","Indicative","Presente","Present","I believe, am believing","creo","crees","cree","creemos","creéis","creen","creyendo","believing","creído","believed"]
["creer","to believe","Indicativo","Indicative","Futuro","Future","I will believe","creeré","creerás","creerá","creeremos","creeréis","creerán","creyendo","believing","creído","believed"]
["creer","to believe","Indicativo","Indicative","Imperfecto","Imperfect","I was believing, used to believe, believed","creía","creías","creía","creíamos","creíais","creían","creyendo","believing","creído","believed"]
["creer","to believe","Indicativo","Indicative","Pretérito","Preterite","I believed","creí","creíste","creyó","creímos","creísteis","creyeron","creyendo","believing","creído","believed"]
["creer","to believe","Indicativo","Indicative","Condicional","Conditional","I would believe","creería","creerías","creería","creeríamos","creeríais","creerían","creyendo","believing","creído","believed"]
["creer","to believe","Indicativo","Indicative","Presente perfecto","Present Perfect","I have believed","he creído","has creído","ha creído","hemos creído","habéis creído","han creído","creyendo","believing","creído","believed"]
["creer","to believe","Indicativo","Indicative","Futuro perfecto","Future Perfect","I will have believed","habré creído","habrás creído","habrá creído","habremos creído","habréis creído","habrán creído","creyendo","believing","creído","believed"]
["creer","to believe","Indicativo","Indicative","Pluscuamperfecto","Past Perfect","I had believed","había creído","habías creído","había creído","habíamos creído","habíais creído","habían creído","creyendo","believing","creído","believed"]
["creer","to believe","Indicativo","Indicative","Pretérito anterior","Preterite (Archaic)","I had believed","hube creído","hubiste creído","hubo creído","hubimos creído","hubisteis creído","hubieron creído","creyendo","believing","creído","believed"]
["creer","to believe","Indicativo","Indicative","Condicional perfecto","Conditional Perfect","I would have believed","habría creído","habrías creído","habría creído","habríamos creído","habríais creído","habrían creído","creyendo","believing","creído","believed"]
["creer","to believe","Subjuntivo","Subjunctive","Presente","Present","I believe, am believing","crea","creas","crea","creamos","creáis","crean","creyendo","believing","creído","believed"]
["creer","to believe","Subjuntivo","Subjunctive","Imperfecto","Imperfect","I believed, was believing","creyera","creyeras","creyera","creyéramos","creyerais","creyeran","creyendo","believing","creído","believed"]
["creer","to believe","Subjuntivo","Subjunctive","Futuro","Future","I will believe","creyere","creyeres","creyere","creyéremos","creyereis","creyeren","creyendo","believing","creído","believed"]
["creer","to believe","Subjuntivo","Subjunctive","Presente perfecto","Present Perfect","I have believed, believed","haya creído","hayas creído","haya creído","hayamos creído","hayáis creído","hayan creído","creyendo","believing","creído","believed"]
["creer","to believe","Subjuntivo","Subjunctive","Futuro perfecto","Future Perfect","I will have believed","hubiere creído","hubieres creído","hubiere creído","hubiéremos creído","hubiereis creído","hubieren creído","creyendo","believing","creído","believed"]
["creer","to believe","Subjuntivo","Subjunctive","Pluscuamperfecto","Past Perfect","I had believed","hubiera creído","hubieras creído","hubiera creído","hubiéramos creído","hubierais creído","hubieran creído","creyendo","believing","creído","believed"]
["cubrir","to cover","Imperativo Afirmativo","Imperative Affirmative","Presente","Present","Cover! Don't cover!",null,"cubre","cubrid",null,"cubra","cubran","cubriendo","covering","cubierto","covered"]
["cubrir","to cover","Imperativo Negativo","Imperative Negative","Presente","Present","Cover! Don't cover!",null,"no cubras","no cubráis",null,"no cubra","no cubran","cubriendo","covering","cubierto","covered"]
["cubrir","to cover","Indicativo","Indicative","Presente","Present","I cover, am covering","cubro","cubres","cubre","cubrimos","cubrís","cubren","cubriendo","covering","cubierto","covered"]
["cubrir","to cover","Indicativo","Indicative","Futuro","Future","I will cover","cubriré","cubrirás","cubrirá","cubriremos","cubriréis","cubrirán","cubriendo","covering","cubierto","covered"]
["cubrir","to cover","Indicativo","Indicative","Imperfecto","Imperfect","I was covering, used to cover, covered","cubría","cubrías","cubría","cubríamos","cubríais","cubrían","cubriendo","covering","cubierto","covered"]
["cubrir","to cover","Indicativo","Indicative","Pretérito","Preterite","I covered","cubrí","cubriste","cubrió","cubrimos","cubristeis","cubrieron","cubriendo","covering","cubierto","covered"]
["cubrir","to cover","Indicativo","Indicative","Condicional","Conditional","I would cover","cubriría","cubrirías","cubriría","cubriríamos","cubriríais","cubrirían","cubriendo","covering","cubierto","covered"]
["cubrir","to cover","Indicativo","Indicative","Presente perfecto","Present Perfect","I have covered","he cubierto","has cubierto","ha cubierto","hemos cubierto","habéis cubierto","han cubierto","cubriendo","covering","cubierto","covered"]
["cubrir","to cover","Indicativo","Indicative","Futuro perfecto","Future Perfect","I will have covered","habré cubierto","habrás cubierto","habrá cubierto","habremos cubierto","habréis cubierto","habrán cubierto","cubriendo","covering","cubierto","covered"]
["cubrir","to cover","Indicativo","Indicative","Pluscuamperfecto","Past Perfect","I had covered","había cubierto","habías cubierto","había cubierto","habíamos cubierto","habíais cubierto","habían cubierto","cubriendo","covering","cubierto","covered"]
["cubrir","to cover","Indicativo","Indicative","Pretérito anterior","Preterite (Archaic)","I had covered","hube cubierto","hubiste cubierto","hubo cubierto","hubimos cubierto","hubisteis cubierto","hubieron cubierto","cubriendo","covering","cubierto","covered"]
["cubrir","to cover","Indicativo","Indicative","Condicional perfecto","Conditional Perfect","I would have covered","habría cubierto","habrías cubierto","habría cubierto","habríamos cubierto","habríais cubierto","habrían cubierto","cubriendo","covering","cubierto","covered"]
["cubrir","to cover","Subjuntivo","Subjunctive","Presente","Present","I cover, am covering","cubra","cubras","cubra","cubramos","cubráis","cubran","cubriendo","covering","cubierto","covered"]
["cubrir","to cover","Subjuntivo","Subjunctive","Imperfecto","Imperfect","I covered, was covering","cubriera","cubrieras","cubriera","cubriéramos","cubrierais","cubrieran","cubriendo","covering","cubierto","covered"]
["cubrir","to cover","Subjuntivo","Subjunctive","Futuro","Future","I will cover","cubriere","cubrieres","cubriere","cubriéremos","cubriereis","cubrieren","cubriendo","covering","cubierto","covered"]
["cubrir","to cover","Subjuntivo","Subjunctive","Presente perfecto","Present Perfect","I have covered, covered","haya cubierto","hayas cubierto","haya cubierto","hayamos cubierto","hayáis cubierto","hayan cubierto","cubriendo","covering","cubierto","covered"]
["cubrir","to cover","Subjuntivo","Subjunctive","Futuro perfecto","Future Perfect","I will have covered","hubiere cubierto","hubieres cubierto","hubiere cubierto","hubiéremos cubierto","hubiereis cubierto","hubieren cubierto","cubriendo","covering","cubierto","covered"]
["cubrir","to cover","Subjuntivo","Subjunctive","Pluscuamperfecto","Past Perfect","I had covered","hubiera cubierto","hubieras cubierto","hubiera cubierto","hubiéramos cubierto","hubierais cubierto","hubieran cubierto","cubriendo","covering","cubierto","covered"]
["cuidar","to take care of, look after","Imperativo Afirmativo","Imperative Affirmative","Presente","Present","Take care of! Don't take care of!",null,"cuida","cuidad",null,"cuide","cuiden","cuidando","taking care of","cuidado","taken care of"]
["cuidar","to take care of, look after","Imperativo Negativo","Imperative Negative","Presente","Present","Take care of! Don't take care of!",null,"no cuides","no cuidéis",null,"no cuide","no cuiden","cuidando","taking care of","cuidado","taken care of"]
["cuidar","to take care of, look after","Indicativo","Indicative","Pretérito","Preterite","I took care of","cuidé","cuidaste","cuidó","cuidamos","cuidasteis","cuidaron","cuidando","taking care of","cuidado","taken care of"]
["cuidar","to take care of, look after","Indicativo","Indicative","Presente","Present","I take care of, am taking care of","cuido","cuidas","cuida","cuidamos","cuidáis","cuidan","cuidando","taking care of","cuidado","taken care of"]
["cuidar","to take care of, look after","Indicativo","Indicative","Futuro","Future","I will take care of","cuidaré","cuidarás","cuidará","cuidaremos","cuidaréis","cuidarán","cuidando","taking care of","cuidado","taken care of"]
["cuidar","to take care of, look after","Indicativo","Indicative","Imperfecto","Imperfect","I was taking care of, used to take care of, took care of","cuidaba","cuidabas","cuidaba","cuidábamos","cuidabais","cuidaban","cuidando","taking care of","cuidado","taken care of"]
["cuidar","to take care of, look after","Indicativo","Indicative","Condicional","Conditional","I would take care of","cuidaría","cuidarías","cuidaría","cuidaríamos","cuidaríais","cuidarían","cuidando","taking care of","cuidado","taken care of"]
["cuidar","to take care of, look after","Indicativo","Indicative","Presente perfecto","Present Perfect","I have taken care of","he cuidado","has cuidado","ha cuidado","hemos cuidado","habéis cuidado","han cuidado","cuidando","taking care of","cuidado","taken care of"]
["cuidar","to take care of, look after","Indicativo","Indicative","Futuro perfecto","Future Perfect","I will have taken care of","habré cuidado","habrás cuidado","habrá cuidado","habremos cuidado","habréis cuidado","habrán cuidado","cuidando","taking care of","cuidado","taken care of"]
["cuidar","to take care of, look after","Indicativo","Indicative","Pluscuamperfecto","Past Perfect","I had taken care of","había cuidado","habías cuidado","había cuidado","habíamos cuidado","habíais cuidado","habían cuidado","cuidando","taking care of","cuidado","taken care of"]
["cuidar","to take care of, look after","Indicativo","Indicative","Pretérito anterior","Preterite (Archaic)","I had taken care of","hube cuidado","hubiste cuidado","hubo cuidado","hubimos cuidado","hubisteis cuidado","hubieron cuidado","cuidando","taking care of","cuidado","taken care of"]
["cuidar","to take care of, look after","Indicativo","Indicative","Condicional perfecto","Conditional Perfect","I would have taken care of","habría cuidado","habrías cuidado","habría cuidado","habríamos cuidado","habríais cuidado","habrían cuidado","cuidando","taking care of","cuidado","taken care of"]
["cuidar","to take care of, look after","Subjuntivo","Subjunctive","Presente","Present","I take care of, am taking care of","cuide","cuides","cuide","cuidemos","cuidéis","cuiden","cuidando","taking care of","cuidado","taken care of"]
["cuidar","to take care of, look after","Subjuntivo","Subjunctive","Imperfecto","Imperfect","I took care of, was taking care of","cuidara","cuidaras","cuidara","cuidáramos","cuidarais","cuidaran","cuidando","taking care of","cuidado","taken care of"]
["cuidar","to take care of, look after","Subjuntivo","Subjunctive","Futuro","Future","I will take care of","cuidare","cuidares","cuidare","cuidáremos","cuidareis","cuidaren","cuidando","taking care of","cuidado","taken care of"]
["cuidar","to take care of, look after","Subjuntivo","Subjunctive","Presente perfecto","Present Perfect","I have taken care of, took care of","haya cuidado","hayas cuidado","haya cuidado","hayamos cuidado","hayáis cuidado","hayan cuidado","cuidando","taking care of","cuidado","taken care of"]
["cuidar","to take care of, look after","Subjuntivo","Subjunctive","Futuro perfecto","Future Perfect","I will have taken care of","hubiere cuidado","hubieres cuidado","hubiere cuidado","hubiéremos cuidado","hubiereis cuidado","hubieren cuidado","cuidando","taking care of","cuidado","taken care of"]
["cuidar","to take care of, look after","Subjuntivo","Subjunctive","Pluscuamperfecto","Past Perfect","I had taken care of","hubiera cuidado","hubieras cuidado","hubiera cuidado","hubiéramos cuidado","hubierais cuidado","hubieran cuidado","cuidando","taking care of","cuidado","taken care of"]
["cumplir","to fulfill/carry out/reach","Imperativo Afirmativo","Imperative Affirmative","Presente","Present","Fulfil! Don't fulfil!",null,"cumple","cumplid",null,"cumpla","cumplan","cumpliendo","fulfilling","cumplido","fulfilled"]
["cumplir","to fulfill/carry out/reach","Imperativo Negativo","Imperative Negative","Presente","Present","Fulfil! Don't fulfil!",null,"no cumplas","no cumpláis",null,"no cumpla","no cumplan","cumpliendo","fulfilling","cumplido","fulfilled"]
["cumplir","to fulfill/carry out/reach","Indicativo","Indicative","Presente","Present","I fulfil, am fulfilling","cumplo","cumples","cumple","cumplimos","cumplís","cumplen","cumpliendo","fulfilling","cumplido","fulfilled"]
["cumplir","to fulfill/carry out/reach","Indicativo","Indicative","Futuro","Future","I will fulfil","cumpliré","cumplirás","cumplirá","cumpliremos","cumpliréis","cumplirán","cumpliendo","fulfilling","cumplido","fulfilled"]
["cumplir","to fulfill/carry out/reach","Indicativo","Indicative","Imperfecto","Imperfect","I was fulfilling, used to fulfil, fulfilled","cumplía","cumplías","cumplía","cumplíamos","cumplíais","cumplían","cumpliendo","fulfilling","cumplido","fulfilled"]
["cumplir","to fulfill/carry out/reach","Indicativo","Indicative","Pretérito","Preterite","I fulfilled","cumplí","cumpliste","cumplió","cumplimos","cumplisteis","cumplieron","cumpliendo","fulfilling","cumplido","fulfilled"]
["cumplir","to fulfill/carry out/reach","Indicativo","Indicative","Condicional","Conditional","I would fulfil","cumpliría","cumplirías","cumpliría","cumpliríamos","cumpliríais","cumplirían","cumpliendo","fulfilling","cumplido","fulfilled"]
["cumplir","to fulfill/carry out/reach","Indicativo","Indicative","Presente perfecto","Present Perfect","I have fulfilled","he cumplido","has cumplido","ha cumplido","hemos cumplido","habéis cumplido","han cumplido","cumpliendo","fulfilling","cumplido","fulfilled"]
["cumplir","to fulfill/carry out/reach","Indicativo","Indicative","Futuro perfecto","Future Perfect","I will have fulfilled","habré cumplido","habrás cumplido","habrá cumplido","habremos cumplido","habréis cumplido","habrán cumplido","cumpliendo","fulfilling","cumplido","fulfilled"]
["cumplir","to fulfill/carry out/reach","Indicativo","Indicative","Pluscuamperfecto","Past Perfect","I had fulfilled","había cumplido","habías cumplido","había cumplido","habíamos cumplido","habíais cumplido","habían cumplido","cumpliendo","fulfilling","cumplido","fulfilled"]
["cumplir","to fulfill/carry out/reach","Indicativo","Indicative","Pretérito anterior","Preterite (Archaic)","I had fulfilled","hube cumplido","hubiste cumplido","hubo cumplido","hubimos cumplido","hubisteis cumplido","hubieron cumplido","cumpliendo","fulfilling","cumplido","fulfilled"]
["cumplir","to fulfill/carry out/reach","Indicativo","Indicative","Condicional perfecto","Conditional Perfect","I would have fulfilled","habría cumplido","habrías cumplido","habría cumplido","habríamos cumplido","habríais cumplido","habrían cumplido","cumpliendo","fulfilling","cumplido","fulfilled"]
["cumplir","to fulfill/carry out/reach","Subjuntivo","Subjunctive","Presente","Present","I fulfil, am fulfilling","cumpla","cumplas","cumpla","cumplamos","cumpláis","cumplan","cumpliendo","fulfilling","cumplido","fulfilled"]
["cumplir","to fulfill/carry out/reach","Subjuntivo","Subjunctive","Imperfecto","Imperfect","I fulfilled, was fulfilling","cumpliera","cumplieras","cumpliera","cumpliéramos","cumplierais","cumplieran","cumpliendo","fulfilling","cumplido","fulfilled"]
["cumplir","to fulfill/carry out/reach","Subjuntivo","Subjunctive","Futuro","Future","I will fulfil","cumpliere","cumplieres","cumpliere","cumpliéremos","cumpliereis","cumplieren","cumpliendo","fulfilling","cumplido","fulfilled"]
["cumplir","to fulfill/carry out/reach","Subjuntivo","Subjunctive","Presente perfecto","Present Perfect","I have fulfilled, fulfilled","haya cumplido","hayas cumplido","haya cumplido","hayamos cumplido","hayáis cumplido","hayan cumplido","cumpliendo","fulfilling","cumplido","fulfilled"]
["cumplir","to fulfill/carry out/reach","Subjuntivo","Subjunctive","Futuro perfecto","Future Perfect","I will have fulfilled","hubiere cumplido","hubieres cumplido","hubiere cumplido","hubiéremos cumplido","hubiereis cumplido","hubieren cumplido","cumpliendo","fulfilling","cumplido","fulfilled"]
["cumplir","to fulfill/carry out/reach","Subjuntivo","Subjunctive","Pluscuamperfecto","Past Perfect","I had fulfilled","hubiera cumplido","hubieras cumplido","hubiera cumplido","hubiéramos cumplido","hubierais cumplido","hubieran cumplido","cumpliendo","fulfilling","cumplido","fulfilled"]
["dar","to give","Imperativo Afirmativo","Imperative Affirmative","Presente","Present","Give! Don't give!",null,"da","dad",null,"dé","den","dando","giving","dado","given"]
["dar","to give","Imperativo Negativo","Imperative Negative","Presente","Present","Give! Don't give!",null,"no des","no deis",null,"no dé","no den","dando","giving","dado","given"]
["dar","to give","Indicativo","Indicative","Presente","Present","I give, am giving","doy","das","da","damos","dais","dan","dando","giving","dado","given"]
["dar","to give","Indicativo","Indicative","Futuro","Future","I will give","daré","darás","dará","daremos","daréis","darán","dando","giving","dado","given"]
["dar","to give","Indicativo","Indicative","Imperfecto","Imperfect","I was giving, used to give, gave","daba","dabas","daba","dábamos","dabais","daban","dando","giving","dado","given"]
["dar","to give","Indicativo","Indicative","Pretérito","Preterite","I gave","di","diste","dio","dimos","disteis","dieron","dando","giving","dado","given"]
["dar","to give","Indicativo","Indicative","Condicional","Conditional","I would give","daría","darías","daría","daríamos","daríais","darían","dando","giving","dado","given"]
["dar","to give","Indicativo","Indicative","Presente perfecto","Present Perfect","I have given","he dado","has dado","ha dado","hemos dado","habéis dado","han dado","dando","giving","dado","given"]
["dar","to give","Indicativo","Indicative","Futuro perfecto","Future Perfect","I will have given","habré dado","habrás dado","habrá dado","habremos dado","habréis dado","habrán dado","dando","giving","dado","given"]
["dar","to give","Indicativo","Indicative","Pluscuamperfecto","Past Perfect","I had given","había dado","habías dado","había dado","habíamos dado","habíais dado","habían dado","dando","giving","dado","given"]
["dar","to give","Indicativo","Indicative","Pretérito anterior","Preterite (Archaic)","I had given","hube dado","hubiste dado","hubo dado","hubimos dado","hubisteis dado","hubieron dado","dando","giving","dado","given"]
["dar","to give","Indicativo","Indicative","Condicional perfecto","Conditional Perfect","I would have given","habría dado","habrías dado","habría dado","habríamos dado","habríais dado","habrían dado","dando","giving","dado","given"]
["dar","to give","Subjuntivo","Subjunctive","Presente","Present","I give, am giving","dé","des","dé","demos","deis","den","dando","giving","dado","given"]
["dar","to give","Subjuntivo","Subjunctive","Imperfecto","Imperfect","I gave, was giving","diera","dieras","diera","diéramos","dierais","dieran","dando","giving","dado","given"]
["dar","to give","Subjuntivo","Subjunctive","Futuro","Future","I will give","diere","dieres","diere","diéremos","diereis","dieren","dando","giving","dado","given"]
["dar","to give","Subjuntivo","Subjunctive","Presente perfecto","Present Perfect","I have given, gave","haya dado","hayas dado","haya dado","hayamos dado","hayáis dado","hayan dado","dando","giving","dado","given"]
["dar","to give","Subjuntivo","Subjunctive","Futuro perfecto","Future Perfect","I will have given","hubiere dado","hubieres dado","hubiere dado","hubiéremos dado","hubiereis dado","hubieren dado","dando","giving","dado","given"]
["dar","to give","Subjuntivo","Subjunctive","Pluscuamperfecto","Past Perfect","I had given","hubiera dado","hubieras dado","hubiera dado","hubiéramos dado","hubierais dado","hubieran dado","dando","giving","dado","given"]
["deber","to owe; must, should, ought to","Imperativo Afirmativo","Imperative Affirmative","Presente","Present","Owe! Don't owe!",null,"debe","debed",null,"deba","deban","debiendo","owing","debido","owed"]
["deber","to owe; must, should, ought to","Imperativo Negativo","Imperative Negative","Presente","Present","Owe! Don't owe!",null,"no debas","no debáis",null,"no deba","no deban","debiendo","owing","debido","owed"]
["deber","to owe; must, should, ought to","Indicativo","Indicative","Presente","Present","I owe, am owing","debo","debes","debe","debemos","debéis","deben","debiendo","owing","debido","owed"]
["deber","to owe; must, should, ought to","Indicativo","Indicative","Futuro","Future","I will owe","deberé","deberás","deberá","deberemos","deberéis","deberán","debiendo","owing","debido","owed"]
["deber","to owe; must, should, ought to","Indicativo","Indicative","Imperfecto","Imperfect","I was owing, used to owe, owed","debía","debías","debía","debíamos","debíais","debían","debiendo","owing","debido","owed"]
["deber","to owe; must, should, ought to","Indicativo","Indicative","Pretérito","Preterite","I owed","debí","debiste","debió","debimos","debisteis","debieron","debiendo","owing","debido","owed"]
["deber","to owe; must, should, ought to","Indicativo","Indicative","Condicional","Conditional","I would owe","debería","deberías","debería","deberíamos","deberíais","deberían","debiendo","owing","debido","owed"]
["deber","to owe; must, should, ought to","Indicativo","Indicative","Presente perfecto","Present Perfect","I have owed","he debido","has debido","ha debido","hemos debido","habéis debido","han debido","debiendo","owing","debido","owed"]
["deber","to owe; must, should, ought to","Indicativo","Indicative","Futuro perfecto","Future Perfect","I will have owed","habré debido","habrás debido","habrá debido","habremos debido","habréis debido","habrán debido","debiendo","owing","debido","owed"]
["deber","to owe; must, should, ought to","Indicativo","Indicative","Pluscuamperfecto","Past Perfect","I had owed","había debido","habías debido","había debido","habíamos debido","habíais debido","habían debido","debiendo","owing","debido","owed"]
["deber","to owe; must, should, ought to","Indicativo","Indicative","Pretérito anterior","Preterite (Archaic)","I had owed","hube debido","hubiste debido","hubo debido","hubimos debido","hubisteis debido","hubieron debido","debiendo","owing","debido","owed"]
["deber","to owe; must, should, ought to","Indicativo","Indicative","Condicional perfecto","Conditional Perfect","I would have owed","habría debido","habrías debido","habría debido","habríamos debido","habríais debido","habrían debido","debiendo","owing","debido","owed"]
["deber","to owe; must, should, ought to","Subjuntivo","Subjunctive","Presente","Present","I owe, am owing","deba","debas","deba","debamos","debáis","deban","debiendo","owing","debido","owed"]
["deber","to owe; must, should, ought to","Subjuntivo","Subjunctive","Imperfecto","Imperfect","I owed, was owing","debiera","debieras","debiera","debiéramos","debierais","debieran","debiendo","owing","debido","owed"]
["deber","to owe; must, should, ought to","Subjuntivo","Subjunctive","Futuro","Future","I will owe","debiere","debieres","debiere","debiéremos","debiereis","debieren","debiendo","owing","debido","owed"]
["deber","to owe; must, should, ought to","Subjuntivo","Subjunctive","Presente perfecto","Present Perfect","I have owed, owed","haya debido","hayas debido","haya debido","hayamos debido","hayáis debido","hayan debido","debiendo","owing","debido","owed"]
["deber","to owe; must, should, ought to","Subjuntivo","Subjunctive","Futuro perfecto","Future Perfect","I will have owed","hubiere debido","hubieres debido","hubiere debido","hubiéremos debido","hubiereis debido","hubieren debido","debiendo","owing","debido","owed"]
["deber","to owe; must, should, ought to","Subjuntivo","Subjunctive","Pluscuamperfecto","Past Perfect","I had owed","hubiera debido","hubieras debido","hubiera debido","hubiéramos debido","hubierais debido","hubieran debido","debiendo","owing","debido","owed"]
["decidir","to decide, settle, resolve","Imperativo Afirmativo","Imperative Affirmative","Presente","Present","Decide! Don't decide!",null,"decide","decidid",null,"decida","decidan","decidiendo","deciding","decidido","decided"]
["decidir","to decide, settle, resolve","Imperativo Negativo","Imperative Negative","Presente","Present","Decide! Don't decide!",null,"no decidas","no decidáis",null,"no decida","no decidan","decidiendo","deciding","decidido","decided"]
["decidir","to decide, settle, resolve","Indicativo","Indicative","Presente","Present","I decide, am deciding","decido","decides","decide","decidimos","decidís","deciden","decidiendo","deciding","decidido","decided"]
["decidir","to decide, settle, resolve","Indicativo","Indicative","Futuro","Future","I will decide","decidiré","decidirás","decidirá","decidiremos","decidiréis","decidirán","decidiendo","deciding","decidido","decided"]
["decidir","to decide, settle, resolve","Indicativo","Indicative","Imperfecto","Imperfect","I was deciding, used to decide, decided","decidía","decidías","decidía","decidíamos","decidíais","decidían","decidiendo","deciding","decidido","decided"]
["decidir","to decide, settle, resolve","Indicativo","Indicative","Pretérito","Preterite","I decided","decidí","decidiste","decidió","decidimos","decidisteis","decidieron","decidiendo","deciding","decidido","decided"]
["decidir","to decide, settle, resolve","Indicativo","Indicative","Condicional","Conditional","I would decide","decidiría","decidirías","decidiría","decidiríamos","decidiríais","decidirían","decidiendo","deciding","decidido","decided"]
["decidir","to decide, settle, resolve","Indicativo","Indicative","Presente perfecto","Present Perfect","I have decided","he decidido","has decidido","ha decidido","hemos decidido","habéis decidido","han decidido","decidiendo","deciding","decidido","decided"]
["decidir","to decide, settle, resolve","Indicativo","Indicative","Futuro perfecto","Future Perfect","I will have decided","habré decidido","habrás decidido","habrá decidido","habremos decidido","habréis decidido","habrán decidido","decidiendo","deciding","decidido","decided"]
["decidir","to decide, settle, resolve","Indicativo","Indicative","Pluscuamperfecto","Past Perfect","I had decided","había decidido","habías decidido","había decidido","habíamos decidido","habíais decidido","habían decidido","decidiendo","deciding","decidido","decided"]
["decidir","to decide, settle, resolve","Indicativo","Indicative","Pretérito anterior","Preterite (Archaic)","I had decided","hube decidido","hubiste decidido","hubo decidido","hubimos decidido","hubisteis decidido","hubieron decidido","decidiendo","deciding","decidido","decided"]
["decidir","to decide, settle, resolve","Indicativo","Indicative","Condicional perfecto","Conditional Perfect","I would have decided","habría decidido","habrías decidido","habría decidido","habríamos decidido","habríais decidido","habrían decidido","decidiendo","deciding","decidido","decided"]
["decidir","to decide, settle, resolve","Subjuntivo","Subjunctive","Presente","Present","I decide, am deciding","decida","decidas","decida","decidamos","decidáis","decidan","decidiendo","deciding","decidido","decided"]
["decidir","to decide, settle, resolve","Subjuntivo","Subjunctive","Imperfecto","Imperfect","I decided, was deciding","decidiera","decidieras","decidiera","decidiéramos","decidierais","decidieran","decidiendo","deciding","decidido","decided"]
["decidir","to decide, settle, resolve","Subjuntivo","Subjunctive","Futuro","Future","I will decide","decidiere","decidieres","decidiere","decidiéremos","decidiereis","decidieren","decidiendo","deciding","decidido","decided"]
["decidir","to decide, settle, resolve","Subjuntivo","Subjunctive","Presente perfecto","Present Perfect","I have decided, decided","haya decidido","hayas decidido","haya decidido","hayamos decidido","hayáis decidido","hayan decidido","decidiendo","deciding","decidido","decided"]
["decidir","to decide, settle, resolve","Subjuntivo","Subjunctive","Futuro perfecto","Future Perfect","I will have decided","hubiere decidido","hubieres decidido","hubiere decidido","hubiéremos decidido","hubiereis decidido","hubieren decidido","decidiendo","deciding","decidido","decided"]
["decidir","to decide, settle, resolve","Subjuntivo","Subjunctive","Pluscuamperfecto","Past Perfect","I had decided","hubiera decidido","hubieras decidido","hubiera decidido","hubiéramos decidido","hubierais decidido","hubieran decidido","decidiendo","deciding","decidido","decided"]
["decir","to say, tell","Imperativo Afirmativo","Imperative Affirmative","Presente","Present","Say! Don't say!",null,"di","decid",null,"diga","digan","diciendo","saying","dicho","said"]
["decir","to say, tell","Imperativo Negativo","Imperative Negative","Presente","Present","Say! Don't say!",null,"no digas","no digáis",null,"no diga","no digan","diciendo","saying","dicho","said"]
["decir","to say, tell","Indicativo","Indicative","Presente","Present","I say, am saying","digo","dices","dice","decimos","decís","dicen","diciendo","saying","dicho","said"]
["decir","to say, tell","Indicativo","Indicative","Futuro","Future","I will say","diré","dirás","dirá","diremos","diréis","dirán","diciendo","saying","dicho","said"]
["decir","to say, tell","Indicativo","Indicative","Imperfecto","Imperfect","I was saying, used to say, said","decía","decías","decía","decíamos","decíais","decían","diciendo","saying","dicho","said"]
["decir","to say, tell","Indicativo","Indicative","Pretérito","Preterite","I said","dije","dijiste","dijo","dijimos","dijisteis","dijeron","diciendo","saying","dicho","said"]
["decir","to say, tell","Indicativo","Indicative","Condicional","Conditional","I would say","diría","dirías","diría","diríamos","diríais","dirían","diciendo","saying","dicho","said"]
["decir","to say, tell","Indicativo","Indicative","Presente perfecto","Present Perfect","I have said","he dicho","has dicho","ha dicho","hemos dicho","habéis dicho","han dicho","diciendo","saying","dicho","said"]
["decir","to say, tell","Indicativo","Indicative","Futuro perfecto","Future Perfect","I will have said","habré dicho","habrás dicho","habrá dicho","habremos dicho","habréis dicho","habrán dicho","diciendo","saying","dicho","said"]
["decir","to say, tell","Indicativo","Indicative","Pluscuamperfecto","Past Perfect","I had said","había dicho","habías dicho","había dicho","habíamos dicho","habíais dicho","habían dicho","diciendo","saying","dicho","said"]
["decir","to say, tell","Indicativo","Indicative","Pretérito anterior","Preterite (Archaic)","I had said","hube dicho","hubiste dicho","hubo dicho","hubimos dicho","hubisteis dicho","hubieron dicho","diciendo","saying","dicho","said"]
["decir","to say, tell","Indicativo","Indicative","Condicional perfecto","Conditional Perfect","I would have said","habría dicho","habrías dicho","habría dicho","habríamos dicho","habríais dicho","habrían dicho","diciendo","saying","dicho","said"]
["decir","to say, tell","Subjuntivo","Subjunctive","Presente","Present","I say, am saying","diga","digas","diga","digamos","digáis","digan","diciendo","saying","dicho","said"]
["decir","to say, tell","Subjuntivo","Subjunctive","Imperfecto","Imperfect","I said, was saying","dijera","dijeras","dijera","dijéramos","dijerais","dijeran","diciendo","saying","dicho","said"]
["decir","to say, tell","Subjuntivo","Subjunctive","Futuro","Future","I will say","dijere","dijeres","dijere","dijéremos","dijereis","dijeren","diciendo","saying","dicho","said"]
["decir","to say, tell","Subjuntivo","Subjunctive","Presente perfecto","Present Perfect","I have said, said","haya dicho","hayas dicho","haya dicho","hayamos dicho","hayáis dicho","hayan dicho","diciendo","saying","dicho","said"]
["decir","to say, tell","Subjuntivo","Subjunctive","Futuro perfecto","Future Perfect","I will have said","hubiere dicho","hubieres dicho","hubiere dicho","hubiéremos dicho","hubiereis dicho","hubieren dicho","diciendo","saying","dicho","said"]
["decir","to say, tell","Subjuntivo","Subjunctive","Pluscuamperfecto","Past Perfect","I had said","hubiera dicho","hubieras dicho","hubiera dicho","hubiéramos dicho","hubierais dicho","hubieran dicho","diciendo","saying","dicho","said"]
["dedicar","to dedicate","Imperativo Afirmativo","Imperative Affirmative","Presente","Present","Dedicate! Don't dedicate!",null,"dedica","dedicad",null,"dedique","dediquen","dedicando","dedicating","dedicado","dedicated"]
["dedicar","to dedicate","Imperativo Negativo","Imperative Negative","Presente","Present","Dedicate! Don't dedicate!",null,"no dediques","no dediquéis",null,"no dedique","no dediquen","dedicando","dedicating","dedicado","dedicated"]
["dedicar","to dedicate","Indicativo","Indicative","Presente","Present","I dedicate, am dedicating","dedico","dedicas","dedica","dedicamos","dedicáis","dedican","dedicando","dedicating","dedicado","dedicated"]
["dedicar","to dedicate","Indicativo","Indicative","Futuro","Future","I will dedicate","dedicaré","dedicarás","dedicará","dedicaremos","dedicaréis","dedicarán","dedicando","dedicating","dedicado","dedicated"]
["dedicar","to dedicate","Indicativo","Indicative","Imperfecto","Imperfect","I was dedicating, used to dedicate, dedicated","dedicaba","dedicabas","dedicaba","dedicábamos","dedicabais","dedicaban","dedicando","dedicating","dedicado","dedicated"]
["dedicar","to dedicate","Indicativo","Indicative","Pretérito","Preterite","I dedicated","dediqué","dedicaste","dedicó","dedicamos","dedicasteis","dedicaron","dedicando","dedicating","dedicado","dedicated"]
["dedicar","to dedicate","Indicativo","Indicative","Condicional","Conditional","I would dedicate","dedicaría","dedicarías","dedicaría","dedicaríamos","dedicaríais","dedicarían","dedicando","dedicating","dedicado","dedicated"]
["dedicar","to dedicate","Indicativo","Indicative","Presente perfecto","Present Perfect","I have dedicated","he dedicado","has dedicado","ha dedicado","hemos dedicado","habéis dedicado","han dedicado","dedicando","dedicating","dedicado","dedicated"]
["dedicar","to dedicate","Indicativo","Indicative","Futuro perfecto","Future Perfect","I will have dedicated","habré dedicado","habrás dedicado","habrá dedicado","habremos dedicado","habréis dedicado","habrán dedicado","dedicando","dedicating","dedicado","dedicated"]
["dedicar","to dedicate","Indicativo","Indicative","Pluscuamperfecto","Past Perfect","I had dedicated","había dedicado","habías dedicado","había dedicado","habíamos dedicado","habíais dedicado","habían dedicado","dedicando","dedicating","dedicado","dedicated"]
["dedicar","to dedicate","Indicativo","Indicative","Pretérito anterior","Preterite (Archaic)","I had dedicated","hube dedicado","hubiste dedicado","hubo dedicado","hubimos dedicado","hubisteis dedicado","hubieron dedicado","dedicando","dedicating","dedicado","dedicated"]
["dedicar","to dedicate","Indicativo","Indicative","Condicional perfecto","Conditional Perfect","I would have dedicated","habría dedicado","habrías dedicado","habría dedicado","habríamos dedicado","habríais dedicado","habrían dedicado","dedicando","dedicating","dedicado","dedicated"]
["dedicar","to dedicate","Subjuntivo","Subjunctive","Presente","Present","I dedicate, am dedicating","dedique","dediques","dedique","dediquemos","dediquéis","dediquen","dedicando","dedicating","dedicado","dedicated"]
["dedicar","to dedicate","Subjuntivo","Subjunctive","Imperfecto","Imperfect","I dedicated, was dedicating","dedicara","dedicaras","dedicara","dedicáramos","dedicarais","dedicaran","dedicando","dedicating","dedicado","dedicated"]
["dedicar","to dedicate","Subjuntivo","Subjunctive","Futuro","Future","I will dedicate","dedicare","dedicares","dedicare","dedicáremos","dedicareis","dedicaren","dedicando","dedicating","dedicado","dedicated"]
["dedicar","to dedicate","Subjuntivo","Subjunctive","Presente perfecto","Present Perfect","I have dedicated, dedicated","haya dedicado","hayas dedicado","haya dedicado","hayamos dedicado","hayáis dedicado","hayan dedicado","dedicando","dedicating","dedicado","dedicated"]
["dedicar","to dedicate","Subjuntivo","Subjunctive","Futuro perfecto","Future Perfect","I will have dedicated","hubiere dedicado","hubieres dedicado","hubiere dedicado","hubiéremos dedicado","hubiereis dedicado","hubieren dedicado","dedicando","dedicating","dedicado","dedicated"]
["dedicar","to dedicate","Subjuntivo","Subjunctive","Pluscuamperfecto","Past Perfect","I had dedicated","hubiera dedicado","hubieras dedicado","hubiera dedicado","hubiéramos dedicado","hubierais dedicado","hubieran dedicado","dedicando","dedicating","dedicado","dedicated"]
["defender","to defend","Imperativo Afirmativo","Imperative Affirmative","Presente","Present","Defend! Don't defend!",null,"defiende","defended",null,"defienda","defiendan","defendiendo","defending","defendido","defended"]
["defender","to defend","Imperativo Negativo","Imperative Negative","Presente","Present","Defend! Don't defend!",null,"no defiendas","no defendáis",null,"no defienda","no defiendan","defendiendo","defending","defendido","defended"]
["defender","to defend","Indicativo","Indicative","Presente","Present","I defend, am defending","defiendo","defiendes","defiende","defendemos","defendéis","defienden","defendiendo","defending","defendido","defended"]
["defender","to defend","Indicativo","Indicative","Futuro","Future","I will defend","defenderé","defenderás","defenderá","defenderemos","defenderéis","defenderán","defendiendo","defending","defendido","defended"]
["defender","to defend","Indicativo","Indicative","Imperfecto","Imperfect","I was defending, used to defend, defended","defendía","defendías","defendía","defendíamos","defendíais","defendían","defendiendo","defending","defendido","defended"]
["defender","to defend","Indicativo","Indicative","Pretérito","Preterite","I defended","defendí","defendiste","defendió","defendimos","defendisteis","defendieron","defendiendo","defending","defendido","defended"]
["defender","to defend","Indicativo","Indicative","Condicional","Conditional","I would defend","defendería","defenderías","defendería","defenderíamos","defenderíais","defenderían","defendiendo","defending","defendido","defended"]
["defender","to defend","Indicativo","Indicative","Presente perfecto","Present Perfect","I have defended","he defendido","has defendido","ha defendido","hemos defendido","habéis defendido","han defendido","defendiendo","defending","defendido","defended"]
["defender","to defend","Indicativo","Indicative","Futuro perfecto","Future Perfect","I will have defended","habré defendido","habrás defendido","habrá defendido","habremos defendido","habréis defendido","habrán defendido","defendiendo","defending","defendido","defended"]
["defender","to defend","Indicativo","Indicative","Pluscuamperfecto","Past Perfect","I had defended","había defendido","habías defendido","había defendido","habíamos defendido","habíais defendido","habían defendido","defendiendo","defending","defendido","defended"]
["defender","to defend","Indicativo","Indicative","Pretérito anterior","Preterite (Archaic)","I had defended","hube defendido","hubiste defendido","hubo defendido","hubimos defendido","hubisteis defendido","hubieron defendido","defendiendo","defending","defendido","defended"]
["defender","to defend","Indicativo","Indicative","Condicional perfecto","Conditional Perfect","I would have defended","habría defendido","habrías defendido","habría defendido","habríamos defendido","habríais defendido","habrían defendido","defendiendo","defending","defendido","defended"]
["defender","to defend","Subjuntivo","Subjunctive","Presente","Present","I defend, am defending","defienda","defiendas","defienda","defendamos","defendáis","defiendan","defendiendo","defending","defendido","defended"]
["defender","to defend","Subjuntivo","Subjunctive","Imperfecto","Imperfect","I defended, was defending","defendiera","defendieras","defendiera","defendiéramos","defendierais","defendieran","defendiendo","defending","defendido","defended"]
["defender","to defend","Subjuntivo","Subjunctive","Futuro","Future","I will defend","defendiere","defendieres","defendiere","defendiéremos","defendiereis","defendieren","defendiendo","defending","defendido","defended"]
["defender","to defend","Subjuntivo","Subjunctive","Presente perfecto","Present Perfect","I have defended, defended","haya defendido","hayas defendido","haya defendido","hayamos defendido","hayáis defendido","hayan defendido","defendiendo","defending","defendido","defended"]
["defender","to defend","Subjuntivo","Subjunctive","Futuro perfecto","Future Perfect","I will have defended","hubiere defendido","hubieres defendido","hubiere defendido","hubiéremos defendido","hubiereis defendido","hubieren defendido","defendiendo","defending","defendido","defended"]
["defender","to defend","Subjuntivo","Subjunctive","Pluscuamperfecto","Past Perfect","I had defended","hubiera defendido","hubieras defendido","hubiera defendido","hubiéramos defendido","hubierais defendido","hubieran defendido","defendiendo","defending","defendido","defended"]
["dejar","to leave, abandon, quit; to let, allow","Imperativo Afirmativo","Imperative Affirmative","Presente","Present","Leave! Don't leave!",null,"deja","dejad",null,"deje","dejen","dejando","leaving","dejado","left"]
["dejar","to leave, abandon, quit; to let, allow","Imperativo Negativo","Imperative Negative","Presente","Present","Leave! Don't leave!",null,"no dejes","no dejéis",null,"no deje","no dejen","dejando","leaving","dejado","left"]
["dejar","to leave, abandon, quit; to let, allow","Indicativo","Indicative","Presente","Present","I leave, am leaving","dejo","dejas","deja","dejamos","dejáis","dejan","dejando","leaving","dejado","left"]
["dejar","to leave, abandon, quit; to let, allow","Indicativo","Indicative","Futuro","Future","I will leave","dejaré","dejarás","dejará","dejaremos","dejaréis","dejarán","dejando","leaving","dejado","left"]
["dejar","to leave, abandon, quit; to let, allow","Indicativo","Indicative","Imperfecto","Imperfect","I was leaving, used to leave, left","dejaba","dejabas","dejaba","dejábamos","dejabais","dejaban","dejando","leaving","dejado","left"]
["dejar","to leave, abandon, quit; to let, allow","Indicativo","Indicative","Pretérito","Preterite","I left","dejé","dejaste","dejó","dejamos","dejasteis","dejaron","dejando","leaving","dejado","left"]
["dejar","to leave, abandon, quit; to let, allow","Indicativo","Indicative","Condicional","Conditional","I would leave","dejaría","dejarías","dejaría","dejaríamos","dejaríais","dejarían","dejando","leaving","dejado","left"]
["dejar","to leave, abandon, quit; to let, allow","Indicativo","Indicative","Presente perfecto","Present Perfect","I have left","he dejado","has dejado","ha dejado","hemos dejado","habéis dejado","han dejado","dejando","leaving","dejado","left"]
["dejar","to leave, abandon, quit; to let, allow","Indicativo","Indicative","Futuro perfecto","Future Perfect","I will have left","habré dejado","habrás dejado","habrá dejado","habremos dejado","habréis dejado","habrán dejado","dejando","leaving","dejado","left"]
["dejar","to leave, abandon, quit; to let, allow","Indicativo","Indicative","Pluscuamperfecto","Past Perfect","I had left","había dejado","habías dejado","había dejado","habíamos dejado","habíais dejado","habían dejado","dejando","leaving","dejado","left"]
["dejar","to leave, abandon, quit; to let, allow","Indicativo","Indicative","Pretérito anterior","Preterite (Archaic)","I had left","hube dejado","hubiste dejado","hubo dejado","hubimos dejado","hubisteis dejado","hubieron dejado","dejando","leaving","dejado","left"]
["dejar","to leave, abandon, quit; to let, allow","Indicativo","Indicative","Condicional perfecto","Conditional Perfect","I would have left","habría dejado","habrías dejado","habría dejado","habríamos dejado","habríais dejado","habrían dejado","dejando","leaving","dejado","left"]
["dejar","to leave, abandon, quit; to let, allow","Subjuntivo","Subjunctive","Presente","Present","I leave, am leaving","deje","dejes","deje","dejemos","dejéis","dejen","dejando","leaving","dejado","left"]
["dejar","to leave, abandon, quit; to let, allow","Subjuntivo","Subjunctive","Imperfecto","Imperfect","I left, was leaving","dejara","dejaras","dejara","dejáramos","dejarais","dejaran","dejando","leaving","dejado","left"]
["dejar","to leave, abandon, quit; to let, allow","Subjuntivo","Subjunctive","Futuro","Future","I will leave","dejare","dejares","dejare","dejáremos","dejareis","dejaren","dejando","leaving","dejado","left"]
["dejar","to leave, abandon, quit; to let, allow","Subjuntivo","Subjunctive","Presente perfecto","Present Perfect","I have left, left","haya dejado","hayas dejado","haya dejado","hayamos dejado","hayáis dejado","hayan dejado","dejando","leaving","dejado","left"]
["dejar","to leave, abandon, quit; to let, allow","Subjuntivo","Subjunctive","Futuro perfecto","Future Perfect","I will have left","hubiere dejado","hubieres dejado","hubiere dejado","hubiéremos dejado","hubiereis dejado","hubieren dejado","dejando","leaving","dejado","left"]
["dejar","to leave, abandon, quit; to let, allow","Subjuntivo","Subjunctive","Pluscuamperfecto","Past Perfect","I had left","hubiera dejado","hubieras dejado","hubiera dejado","hubiéramos dejado","hubierais dejado","hubieran dejado","dejando","leaving","dejado","left"]
["demostrar","to demonstrate, show","Imperativo Afirmativo","Imperative Affirmative","Presente","Present","Demonstrate! Don't demonstrate!",null,"demuestra","demostrad",null,"demuestre","demuestren","demostrando","demonstrating","demostrado","demonstrated"]
["demostrar","to demonstrate, show","Imperativo Negativo","Imperative Negative","Presente","Present","Demonstrate! Don't demonstrate!",null,"no demuestres","no demostréis",null,"no demuestre","no demuestren","demostrando","demonstrating","demostrado","demonstrated"]
["demostrar","to demonstrate, show","Indicativo","Indicative","Presente","Present","I demonstrate, am demonstrating","demuestro","demuestras","demuestra","demostramos","demostráis","demuestran","demostrando","demonstrating","demostrado","demonstrated"]
["demostrar","to demonstrate, show","Indicativo","Indicative","Futuro","Future","I will demonstrate","demostraré","demostrarás","demostrará","demostraremos","demostraréis","demostrarán","demostrando","demonstrating","demostrado","demonstrated"]
["demostrar","to demonstrate, show","Indicativo","Indicative","Imperfecto","Imperfect","I was demonstrating, used to demonstrate, demonstrated","demostraba","demostrabas","demostraba","demostrábamos","demostrabais","demostraban","demostrando","demonstrating","demostrado","demonstrated"]
["demostrar","to demonstrate, show","Indicativo","Indicative","Pretérito","Preterite","I demonstrated","demostré","demostraste","demostró","demostramos","demostrasteis","demostraron","demostrando","demonstrating","demostrado","demonstrated"]
["demostrar","to demonstrate, show","Indicativo","Indicative","Condicional","Conditional","I would demonstrate","demostraría","demostrarías","demostraría","demostraríamos","demostraríais","demostrarían","demostrando","demonstrating","demostrado","demonstrated"]
["demostrar","to demonstrate, show","Indicativo","Indicative","Presente perfecto","Present Perfect","I have demonstrated","he demostrado","has demostrado","ha demostrado","hemos demostrado","habéis demostrado","han demostrado","demostrando","demonstrating","demostrado","demonstrated"]
["demostrar","to demonstrate, show","Indicativo","Indicative","Futuro perfecto","Future Perfect","I will have demonstrated","habré demostrado","habrás demostrado","habrá demostrado","habremos demostrado","habréis demostrado","habrán demostrado","demostrando","demonstrating","demostrado","demonstrated"]
["demostrar","to demonstrate, show","Indicativo","Indicative","Pluscuamperfecto","Past Perfect","I had demonstrated","había demostrado","habías demostrado","había demostrado","habíamos demostrado","habíais demostrado","habían demostrado","demostrando","demonstrating","demostrado","demonstrated"]
["demostrar","to demonstrate, show","Indicativo","Indicative","Pretérito anterior","Preterite (Archaic)","I had demonstrated","hube demostrado","hubiste demostrado","hubo demostrado","hubimos demostrado","hubisteis demostrado","hubieron demostrado","demostrando","demonstrating","demostrado","demonstrated"]
["demostrar","to demonstrate, show","Indicativo","Indicative","Condicional perfecto","Conditional Perfect","I would have demonstrated","habría demostrado","habrías demostrado","habría demostrado","habríamos demostrado","habríais demostrado","habrían demostrado","demostrando","demonstrating","demostrado","demonstrated"]
["demostrar","to demonstrate, show","Subjuntivo","Subjunctive","Presente","Present","I demonstrate, am demonstrating","demuestre","demuestres","demuestre","demostremos","demostréis","demuestren","demostrando","demonstrating","demostrado","demonstrated"]
["demostrar","to demonstrate, show","Subjuntivo","Subjunctive","Imperfecto","Imperfect","I demonstrated, was demonstrating","demostrara","demostraras","demostrara","demostráramos","demostrarais","demostraran","demostrando","demonstrating","demostrado","demonstrated"]
["demostrar","to demonstrate, show","Subjuntivo","Subjunctive","Futuro","Future","I will demonstrate","demostrare","demostrares","demostrare","demostráremos","demostrareis","demostraren","demostrando","demonstrating","demostrado","demonstrated"]
["demostrar","to demonstrate, show","Subjuntivo","Subjunctive","Presente perfecto","Present Perfect","I have demonstrated, demonstrated","haya demostrado","hayas demostrado","haya demostrado","hayamos demostrado","hayáis demostrado","hayan demostrado","demostrando","demonstrating","demostrado","demonstrated"]
["demostrar","to demonstrate, show","Subjuntivo","Subjunctive","Futuro perfecto","Future Perfect","I will have demonstrated","hubiere demostrado","hubieres demostrado","hubiere demostrado","hubiéremos demostrado","hubiereis demostrado","hubieren demostrado","demostrando","demonstrating","demostrado","demonstrated"]
["demostrar","to demonstrate, show","Subjuntivo","Subjunctive","Pluscuamperfecto","Past Perfect","I had demonstrated","hubiera demostrado","hubieras demostrado","hubiera demostrado","hubiéramos demostrado","hubierais demostrado","hubieran demostrado","demostrando","demonstrating","demostrado","demonstrated"]
["depender","to depend","Imperativo Afirmativo","Imperative Affirmative","Presente","Present","Depend! Don't depend!",null,"depende","depended",null,"dependa","dependan","dependiendo","depending","dependido","depended"]
["depender","to depend","Imperativo Negativo","Imperative Negative","Presente","Present","Depend! Don't depend!",null,"no dependas","no dependáis",null,"no dependa","no dependan","dependiendo","depending","dependido","depended"]
["depender","to depend","Indicativo","Indicative","Presente","Present","I depend, am depending","dependo","dependes","depende","dependemos","dependéis","dependen","dependiendo","depending","dependido","depended"]
["depender","to depend","Indicativo","Indicative","Futuro","Future","I will depend","dependeré","dependerás","dependerá","dependeremos","dependeréis","dependerán","dependiendo","depending","dependido","depended"]
["depender","to depend","Indicativo","Indicative","Imperfecto","Imperfect","I was depending, used to depend, depend","dependía","dependías","dependía","dependíamos","dependíais","dependían","dependiendo","depending","dependido","depended"]
["depender","to depend","Indicativo","Indicative","Pretérito","Preterite","I depend","dependí","dependiste","dependió","dependimos","dependisteis","dependieron","dependiendo","depending","dependido","depended"]
["depender","to depend","Indicativo","Indicative","Condicional","Conditional","I would depend","dependería","dependerías","dependería","dependeríamos","dependeríais","dependerían","dependiendo","depending","dependido","depended"]
["depender","to depend","Indicativo","Indicative","Presente perfecto","Present Perfect","I have depended","he dependido","has dependido","ha dependido","hemos dependido","habéis dependido","han dependido","dependiendo","depending","dependido","depended"]
["depender","to depend","Indicativo","Indicative","Futuro perfecto","Future Perfect","I will have depended","habré dependido","habrás dependido","habrá dependido","habremos dependido","habréis dependido","habrán dependido","dependiendo","depending","dependido","depended"]
["depender","to depend","Indicativo","Indicative","Pluscuamperfecto","Past Perfect","I had depended","había dependido","habías dependido","había dependido","habíamos dependido","habíais dependido","habían dependido","dependiendo","depending","dependido","depended"]
["depender","to depend","Indicativo","Indicative","Pretérito anterior","Preterite (Archaic)","I had depended","hube dependido","hubiste dependido","hubo dependido","hubimos dependido","hubisteis dependido","hubieron dependido","dependiendo","depending","dependido","depended"]
["depender","to depend","Indicativo","Indicative","Condicional perfecto","Conditional Perfect","I would have depended","habría dependido","habrías dependido","habría dependido","habríamos dependido","habríais dependido","habrían dependido","dependiendo","depending","dependido","depended"]
["depender","to depend","Subjuntivo","Subjunctive","Presente","Present","I depend, am depending","dependa","dependas","dependa","dependamos","dependáis","dependan","dependiendo","depending","dependido","depended"]
["depender","to depend","Subjuntivo","Subjunctive","Imperfecto","Imperfect","I depend, was depending","dependiera","dependieras","dependiera","dependiéramos","dependierais","dependieran","dependiendo","depending","dependido","depended"]
["depender","to depend","Subjuntivo","Subjunctive","Futuro","Future","I will depend","dependiere","dependieres","dependiere","dependiéremos","dependiereis","dependieren","dependiendo","depending","dependido","depended"]
["depender","to depend","Subjuntivo","Subjunctive","Presente perfecto","Present Perfect","I have depended, depend","haya dependido","hayas dependido","haya dependido","hayamos dependido","hayáis dependido","hayan dependido","dependiendo","depending","dependido","depended"]
["depender","to depend","Subjuntivo","Subjunctive","Futuro perfecto","Future Perfect","I will have depended","hubiere dependido","hubieres dependido","hubiere dependido","hubiéremos dependido","hubiereis dependido","hubieren dependido","dependiendo","depending","dependido","depended"]
["depender","to depend","Subjuntivo","Subjunctive","Pluscuamperfecto","Past Perfect","I had depended","hubiera dependido","hubieras dependido","hubiera dependido","hubiéramos dependido","hubierais dependido","hubieran dependido","dependiendo","depending","dependido","depended"]
["desaparecer","to disappear","Imperativo Afirmativo","Imperative Affirmative","Presente","Present","Disappear! Don't disappear!",null,"desaparece","desapareced",null,"desaparezca","desaparezcan","desapareciendo","disappearing","desaparecido","disappeared"]
["desaparecer","to disappear","Imperativo Negativo","Imperative Negative","Presente","Present","Disappear! Don't disappear!",null,"no desaparezcas","no desaparezcáis",null,"no desaparezca","no desaparezcan","desapareciendo","disappearing","desaparecido","disappeared"]
["desaparecer","to disappear","Indicativo","Indicative","Presente","Present","I disappear, am disappearing","desaparezco","desapareces","desaparece","desaparecemos","desaparecéis","desaparecen","desapareciendo","disappearing","desaparecido","disappeared"]
["desaparecer","to disappear","Indicativo","Indicative","Futuro","Future","I will disappear","desapareceré","desaparecerás","desaparecerá","desapareceremos","desapareceréis","desaparecerán","desapareciendo","disappearing","desaparecido","disappeared"]
["desaparecer","to disappear","Indicativo","Indicative","Imperfecto","Imperfect","I was disappearing, used to disappear, disappeared","desaparecía","desaparecías","desaparecía","desaparecíamos","desaparecíais","desaparecían","desapareciendo","disappearing","desaparecido","disappeared"]
["desaparecer","to disappear","Indicativo","Indicative","Pretérito","Preterite","I disappeared","desaparecí","desapareciste","desapareció","desaparecimos","desaparecisteis","desaparecieron","desapareciendo","disappearing","desaparecido","disappeared"]
["desaparecer","to disappear","Indicativo","Indicative","Condicional","Conditional","I would disappear","desaparecería","desaparecerías","desaparecería","desapareceríamos","desapareceríais","desaparecerían","desapareciendo","disappearing","desaparecido","disappeared"]
["desaparecer","to disappear","Indicativo","Indicative","Presente perfecto","Present Perfect","I have disappeared","he desaparecido","has desaparecido","ha desaparecido","hemos desaparecido","habéis desaparecido","han desaparecido","desapareciendo","disappearing","desaparecido","disappeared"]
["desaparecer","to disappear","Indicativo","Indicative","Futuro perfecto","Future Perfect","I will have disappeared","habré desaparecido","habrás desaparecido","habrá desaparecido","habremos desaparecido","habréis desaparecido","habrán desaparecido","desapareciendo","disappearing","desaparecido","disappeared"]
["desaparecer","to disappear","Indicativo","Indicative","Pluscuamperfecto","Past Perfect","I had disappeared","había desaparecido","habías desaparecido","había desaparecido","habíamos desaparecido","habíais desaparecido","habían desaparecido","desapareciendo","disappearing","desaparecido","disappeared"]
["desaparecer","to disappear","Indicativo","Indicative","Pretérito anterior","Preterite (Archaic)","I had disappeared","hube desaparecido","hubiste desaparecido","hubo desaparecido","hubimos desaparecido","hubisteis desaparecido","hubieron desaparecido","desapareciendo","disappearing","desaparecido","disappeared"]
["desaparecer","to disappear","Indicativo","Indicative","Condicional perfecto","Conditional Perfect","I would have disappeared","habría desaparecido","habrías desaparecido","habría desaparecido","habríamos desaparecido","habríais desaparecido","habrían desaparecido","desapareciendo","disappearing","desaparecido","disappeared"]
["desaparecer","to disappear","Subjuntivo","Subjunctive","Presente","Present","I disappear, am disappearing","desaparezca","desaparezcas","desaparezca","desaparezcamos","desaparezcáis","desaparezcan","desapareciendo","disappearing","desaparecido","disappeared"]
["desaparecer","to disappear","Subjuntivo","Subjunctive","Imperfecto","Imperfect","I disappeared, was disappearing","desapareciera","desaparecieras","desapareciera","desapareciéramos","desaparecierais","desaparecieran","desapareciendo","disappearing","desaparecido","disappeared"]
["desaparecer","to disappear","Subjuntivo","Subjunctive","Futuro","Future","I will disappear","desapareciere","desaparecieres","desapareciere","desapareciéremos","desapareciereis","desaparecieren","desapareciendo","disappearing","desaparecido","disappeared"]
["desaparecer","to disappear","Subjuntivo","Subjunctive","Presente perfecto","Present Perfect","I have disappeared, disappeared","haya desaparecido","hayas desaparecido","haya desaparecido","hayamos desaparecido","hayáis desaparecido","hayan desaparecido","desapareciendo","disappearing","desaparecido","disappeared"]
["desaparecer","to disappear","Subjuntivo","Subjunctive","Futuro perfecto","Future Perfect","I will have disappeared","hubiere desaparecido","hubieres desaparecido","hubiere desaparecido","hubiéremos desaparecido","hubiereis desaparecido","hubieren desaparecido","desapareciendo","disappearing","desaparecido","disappeared"]
["desaparecer","to disappear","Subjuntivo","Subjunctive","Pluscuamperfecto","Past Perfect","I had disappeared","hubiera desaparecido","hubieras desaparecido","hubiera desaparecido","hubiéramos desaparecido","hubierais desaparecido","hubieran desaparecido","desapareciendo","disappearing","desaparecido","disappeared"]
["desarrollar","to develop, expand; to unroll, unwind; to unfold","Imperativo Afirmativo","Imperative Affirmative","Presente","Present","Develop! Don't develop!",null,"desarrolla","desarrollad",null,"desarrolle","desarrollen","desarrollando","developing","desarrollado","developed"]
["desarrollar","to develop, expand; to unroll, unwind; to unfold","Imperativo Negativo","Imperative Negative","Presente","Present","Develop! Don't develop!",null,"no desarrolles","no desarrolléis",null,"no desarrolle","no desarrollen","desarrollando","developing","desarrollado","developed"]
["desarrollar","to develop, expand; to unroll, unwind; to unfold","Indicativo","Indicative","Presente","Present","I develop, am developing","desarrollo","desarrollas","desarrolla","desarrollamos","desarrolláis","desarrollan","desarrollando","developing","desarrollado","developed"]
["desarrollar","to develop, expand; to unroll, unwind; to unfold","Indicativo","Indicative","Futuro","Future","I will develop","desarrollaré","desarrollarás","desarrollará","desarrollaremos","desarrollaréis","desarrollarán","desarrollando","developing","desarrollado","developed"]
["desarrollar","to develop, expand; to unroll, unwind; to unfold","Indicativo","Indicative","Imperfecto","Imperfect","I was developing, used to develop, developed","desarrollaba","desarrollabas","desarrollaba","desarrollábamos","desarrollabais","desarrollaban","desarrollando","developing","desarrollado","developed"]
["desarrollar","to develop, expand; to unroll, unwind; to unfold","Indicativo","Indicative","Pretérito","Preterite","I developed","desarrollé","desarrollaste","desarrolló","desarrollamos","desarrollasteis","desarrollaron","desarrollando","developing","desarrollado","developed"]
["desarrollar","to develop, expand; to unroll, unwind; to unfold","Indicativo","Indicative","Condicional","Conditional","I would develop","desarrollaría","desarrollarías","desarrollaría","desarrollaríamos","desarrollaríais","desarrollarían","desarrollando","developing","desarrollado","developed"]
["desarrollar","to develop, expand; to unroll, unwind; to unfold","Indicativo","Indicative","Presente perfecto","Present Perfect","I have developed","he desarrollado","has desarrollado","ha desarrollado","hemos desarrollado","habéis desarrollado","han desarrollado","desarrollando","developing","desarrollado","developed"]
["desarrollar","to develop, expand; to unroll, unwind; to unfold","Indicativo","Indicative","Futuro perfecto","Future Perfect","I will have developed","habré desarrollado","habrás desarrollado","habrá desarrollado","habremos desarrollado","habréis desarrollado","habrán desarrollado","desarrollando","developing","desarrollado","developed"]
["desarrollar","to develop, expand; to unroll, unwind; to unfold","Indicativo","Indicative","Pluscuamperfecto","Past Perfect","I had developed","había desarrollado","habías desarrollado","había desarrollado","habíamos desarrollado","habíais desarrollado","habían desarrollado","desarrollando","developing","desarrollado","developed"]
["desarrollar","to develop, expand; to unroll, unwind; to unfold","Indicativo","Indicative","Pretérito anterior","Preterite (Archaic)","I had developed","hube desarrollado","hubiste desarrollado","hubo desarrollado","hubimos desarrollado","hubisteis desarrollado","hubieron desarrollado","desarrollando","developing","desarrollado","developed"]
["desarrollar","to develop, expand; to unroll, unwind; to unfold","Indicativo","Indicative","Condicional perfecto","Conditional Perfect","I would have developed","habría desarrollado","habrías desarrollado","habría desarrollado","habríamos desarrollado","habríais desarrollado","habrían desarrollado","desarrollando","developing","desarrollado","developed"]
["desarrollar","to develop, expand; to unroll, unwind; to unfold","Subjuntivo","Subjunctive","Presente","Present","I develop, am developing","desarrolle","desarrolles","desarrolle","desarrollemos","desarrolléis","desarrollen","desarrollando","developing","desarrollado","developed"]
["desarrollar","to develop, expand; to unroll, unwind; to unfold","Subjuntivo","Subjunctive","Imperfecto","Imperfect","I developed, was developing","desarrollara","desarrollaras","desarrollara","desarrolláramos","desarrollarais","desarrollaran","desarrollando","developing","desarrollado","developed"]
["desarrollar","to develop, expand; to unroll, unwind; to unfold","Subjuntivo","Subjunctive","Futuro","Future","I will develop","desarrollare","desarrollares","desarrollare","desarrolláremos","desarrollareis","desarrollaren","desarrollando","developing","desarrollado","developed"]
["desarrollar","to develop, expand; to unroll, unwind; to unfold","Subjuntivo","Subjunctive","Presente perfecto","Present Perfect","I have developed, developed","haya desarrollado","hayas desarrollado","haya desarrollado","hayamos desarrollado","hayáis desarrollado","hayan desarrollado","desarrollando","developing","desarrollado","developed"]
["desarrollar","to develop, expand; to unroll, unwind; to unfold","Subjuntivo","Subjunctive","Futuro perfecto","Future Perfect","I will have developed","hubiere desarrollado","hubieres desarrollado","hubiere desarrollado","hubiéremos desarrollado","hubiereis desarrollado","hubieren desarrollado","desarrollando","developing","desarrollado","developed"]
["desarrollar","to develop, expand; to unroll, unwind; to unfold","Subjuntivo","Subjunctive","Pluscuamperfecto","Past Perfect","I had developed","hubiera desarrollado","hubieras desarrollado","hubiera desarrollado","hubiéramos desarrollado","hubierais desarrollado","hubieran desarrollado","desarrollando","developing","desarrollado","developed"]
["descubrir","to discover","Imperativo Afirmativo","Imperative Affirmative","Presente","Present","Discover! Don't discover!",null,"descubre","descubrid",null,"descubra","descubran","descubriendo","discovering","descubierto","discovered"]
["descubrir","to discover","Imperativo Negativo","Imperative Negative","Presente","Present","Discover! Don't discover!",null,"no descubras","no descubráis",null,"no descubra","no descubran","descubriendo","discovering","descubierto","discovered"]
["descubrir","to discover","Indicativo","Indicative","Presente","Present","I discover, am discovering","descubro","descubres","descubre","descubrimos","descubrís","descubren","descubriendo","discovering","descubierto","discovered"]
["descubrir","to discover","Indicativo","Indicative","Futuro","Future","I will discover","descubriré","descubrirás","descubrirá","descubriremos","descubriréis","descubrirán","descubriendo","discovering","descubierto","discovered"]
["descubrir","to discover","Indicativo","Indicative","Imperfecto","Imperfect","I was discovering, used to discover, discovered","descubría","descubrías","descubría","descubríamos","descubríais","descubrían","descubriendo","discovering","descubierto","discovered"]
["descubrir","to discover","Indicativo","Indicative","Pretérito","Preterite","I discovered","descubrí","descubriste","descubrió","descubrimos","descubristeis","descubrieron","descubriendo","discovering","descubierto","discovered"]
["descubrir","to discover","Indicativo","Indicative","Condicional","Conditional","I would discover","descubriría","descubrirías","descubriría","descubriríamos","descubriríais","descubrirían","descubriendo","discovering","descubierto","discovered"]
["descubrir","to discover","Indicativo","Indicative","Presente perfecto","Present Perfect","I have discovered","he descubierto","has descubierto","ha descubierto","hemos descubierto","habéis descubierto","han descubierto","descubriendo","discovering","descubierto","discovered"]
["descubrir","to discover","Indicativo","Indicative","Futuro perfecto","Future Perfect","I will have discovered","habré descubierto","habrás descubierto","habrá descubierto","habremos descubierto","habréis descubierto","habrán descubierto","descubriendo","discovering","descubierto","discovered"]
["descubrir","to discover","Indicativo","Indicative","Pluscuamperfecto","Past Perfect","I had discovered","había descubierto","habías descubierto","había descubierto","habíamos descubierto","habíais descubierto","habían descubierto","descubriendo","discovering","descubierto","discovered"]
["descubrir","to discover","Indicativo","Indicative","Pretérito anterior","Preterite (Archaic)","I had discovered","hube descubierto","hubiste descubierto","hubo descubierto","hubimos descubierto","hubisteis descubierto","hubieron descubierto","descubriendo","discovering","descubierto","discovered"]
["descubrir","to discover","Indicativo","Indicative","Condicional perfecto","Conditional Perfect","I would have discovered","habría descubierto","habrías descubierto","habría descubierto","habríamos descubierto","habríais descubierto","habrían descubierto","descubriendo","discovering","descubierto","discovered"]
["descubrir","to discover","Subjuntivo","Subjunctive","Presente","Present","I discover, am discovering","descubra","descubras","descubra","descubramos","descubráis","descubran","descubriendo","discovering","descubierto","discovered"]
["descubrir","to discover","Subjuntivo","Subjunctive","Imperfecto","Imperfect","I discovered, was discovering","descubriera","descubrieras","descubriera","descubriéramos","descubrierais","descubrieran","descubriendo","discovering","descubierto","discovered"]
["descubrir","to discover","Subjuntivo","Subjunctive","Futuro","Future","I will discover","descubriere","descubrieres","descubriere","descubriéremos","descubriereis","descubrieren","descubriendo","discovering","descubierto","discovered"]
["descubrir","to discover","Subjuntivo","Subjunctive","Presente perfecto","Present Perfect","I have discovered, discovered","haya descubierto","hayas descubierto","haya descubierto","hayamos descubierto","hayáis descubierto","hayan descubierto","descubriendo","discovering","descubierto","discovered"]
["descubrir","to discover","Subjuntivo","Subjunctive","Futuro perfecto","Future Perfect","I will have discovered","hubiere descubierto","hubieres descubierto","hubiere descubierto","hubiéremos descubierto","hubiereis descubierto","hubieren descubierto","descubriendo","discovering","descubierto","discovered"]
["descubrir","to discover","Subjuntivo","Subjunctive","Pluscuamperfecto","Past Perfect","I had discovered","hubiera descubierto","hubieras descubierto","hubiera descubierto","hubiéramos descubierto","hubierais descubierto","hubieran descubierto","descubriendo","discovering","descubierto","discovered"]
["desear","to desire, want, wish","Imperativo Afirmativo","Imperative Affirmative","Presente","Present","Desire! Don't desire!",null,"desea","desead",null,"desee","deseen","deseando","desiring","deseado","desired"]
["desear","to desire, want, wish","Imperativo Negativo","Imperative Negative","Presente","Present","Desire! Don't desire!",null,"no desees","no deseéis",null,"no desee","no deseen","deseando","desiring","deseado","desired"]
["desear","to desire, want, wish","Indicativo","Indicative","Presente","Present","I desire, am desiring","deseo","deseas","desea","deseamos","deseáis","desean","deseando","desiring","deseado","desired"]
["desear","to desire, want, wish","Indicativo","Indicative","Futuro","Future","I will desire","desearé","desearás","deseará","desearemos","desearéis","desearán","deseando","desiring","deseado","desired"]
["desear","to desire, want, wish","Indicativo","Indicative","Imperfecto","Imperfect","I was desiring, used to desire, desired","deseaba","deseabas","deseaba","deseábamos","deseabais","deseaban","deseando","desiring","deseado","desired"]
["desear","to desire, want, wish","Indicativo","Indicative","Pretérito","Preterite","I desired","deseé","deseaste","deseó","deseamos","deseasteis","desearon","deseando","desiring","deseado","desired"]
["desear","to desire, want, wish","Indicativo","Indicative","Condicional","Conditional","I would desire","desearía","desearías","desearía","desearíamos","desearíais","desearían","deseando","desiring","deseado","desired"]
["desear","to desire, want, wish","Indicativo","Indicative","Presente perfecto","Present Perfect","I have desired","he deseado","has deseado","ha deseado","hemos deseado","habéis deseado","han deseado","deseando","desiring","deseado","desired"]
["desear","to desire, want, wish","Indicativo","Indicative","Futuro perfecto","Future Perfect","I will have desired","habré deseado","habrás deseado","habrá deseado","habremos deseado","habréis deseado","habrán deseado","deseando","desiring","deseado","desired"]
["desear","to desire, want, wish","Indicativo","Indicative","Pluscuamperfecto","Past Perfect","I had desired","había deseado","habías deseado","había deseado","habíamos deseado","habíais deseado","habían deseado","deseando","desiring","deseado","desired"]
["desear","to desire, want, wish","Indicativo","Indicative","Pretérito anterior","Preterite (Archaic)","I had desired","hube deseado","hubiste deseado","hubo deseado","hubimos deseado","hubisteis deseado","hubieron deseado","deseando","desiring","deseado","desired"]
["desear","to desire, want, wish","Indicativo","Indicative","Condicional perfecto","Conditional Perfect","I would have desired","habría deseado","habrías deseado","habría deseado","habríamos deseado","habríais deseado","habrían deseado","deseando","desiring","deseado","desired"]
["desear","to desire, want, wish","Subjuntivo","Subjunctive","Presente","Present","I desire, am desiring","desee","desees","desee","deseemos","deseéis","deseen","deseando","desiring","deseado","desired"]
["desear","to desire, want, wish","Subjuntivo","Subjunctive","Imperfecto","Imperfect","I desired, was desiring","deseara","desearas","deseara","deseáramos","desearais","desearan","deseando","desiring","deseado","desired"]
["desear","to desire, want, wish","Subjuntivo","Subjunctive","Futuro","Future","I will desire","deseare","deseares","deseare","deseáremos","deseareis","desearen","deseando","desiring","deseado","desired"]
["desear","to desire, want, wish","Subjuntivo","Subjunctive","Presente perfecto","Present Perfect","I have desired, desired","haya deseado","hayas deseado","haya deseado","hayamos deseado","hayáis deseado","hayan deseado","deseando","desiring","deseado","desired"]
["desear","to desire, want, wish","Subjuntivo","Subjunctive","Futuro perfecto","Future Perfect","I will have desired","hubiere deseado","hubieres deseado","hubiere deseado","hubiéremos deseado","hubiereis deseado","hubieren deseado","deseando","desiring","deseado","desired"]
["desear","to desire, want, wish","Subjuntivo","Subjunctive","Pluscuamperfecto","Past Perfect","I had desired","hubiera deseado","hubieras deseado","hubiera deseado","hubiéramos deseado","hubierais deseado","hubieran deseado","deseando","desiring","deseado","desired"]
["despertar","to awaken","Imperativo Afirmativo","Imperative Affirmative","Presente","Present","Awaken! Don't awaken!",null,"despierta","despertad",null,"despierte","despierten","despertando","awakening","despertado","awakened"]
["despertar","to awaken","Imperativo Negativo","Imperative Negative","Presente","Present","Awaken! Don't awaken!",null,"no despiertes","no despertéis",null,"no despierte","no despierten","despertando","awakening","despertado","awakened"]
["despertar","to awaken","Indicativo","Indicative","Presente","Present","I awaken, am awakening","despierto","despiertas","despierta","despertamos","despertáis","despiertan","despertando","awakening","despertado","awakened"]
["despertar","to awaken","Indicativo","Indicative","Futuro","Future","I will awaken","despertaré","despertarás","despertará","despertaremos","despertaréis","despertarán","despertando","awakening","despertado","awakened"]
["despertar","to awaken","Indicativo","Indicative","Imperfecto","Imperfect","I was awakening, used to awaken, awakened","despertaba","despertabas","despertaba","despertábamos","despertabais","despertaban","despertando","awakening","despertado","awakened"]
["despertar","to awaken","Indicativo","Indicative","Pretérito","Preterite","I awakened","desperté","despertaste","despertó","despertamos","despertasteis","despertaron","despertando","awakening","despertado","awakened"]
["despertar","to awaken","Indicativo","Indicative","Condicional","Conditional","I would awaken","despertaría","despertarías","despertaría","despertaríamos","despertaríais","despertarían","despertando","awakening","despertado","awakened"]
["despertar","to awaken","Indicativo","Indicative","Presente perfecto","Present Perfect","I have awakened","he despertado","has despertado","ha despertado","hemos despertado","habéis despertado","han despertado","despertando","awakening","despertado","awakened"]
["despertar","to awaken","Indicativo","Indicative","Futuro perfecto","Future Perfect","I will have awakened","habré despertado","habrás despertado","habrá despertado","habremos despertado","habréis despertado","habrán despertado","despertando","awakening","despertado","awakened"]
["despertar","to awaken","Indicativo","Indicative","Pluscuamperfecto","Past Perfect","I had awakened","había despertado","habías despertado","había despertado","habíamos despertado","habíais despertado","habían despertado","despertando","awakening","despertado","awakened"]
["despertar","to awaken","Indicativo","Indicative","Pretérito anterior","Preterite (Archaic)","I had awakened","hube despertado","hubiste despertado","hubo despertado","hubimos despertado","hubisteis despertado","hubieron despertado","despertando","awakening","despertado","awakened"]
["despertar","to awaken","Indicativo","Indicative","Condicional perfecto","Conditional Perfect","I would have awakened","habría despertado","habrías despertado","habría despertado","habríamos despertado","habríais despertado","habrían despertado","despertando","awakening","despertado","awakened"]
["despertar","to awaken","Subjuntivo","Subjunctive","Presente","Present","I awaken, am awakening","despierte","despiertes","despierte","despertemos","despertéis","despierten","despertando","awakening","despertado","awakened"]
["despertar","to awaken","Subjuntivo","Subjunctive","Imperfecto","Imperfect","I awakened, was awakening","despertara","despertaras","despertara","despertáramos","despertarais","despertaran","despertando","awakening","despertado","awakened"]
["despertar","to awaken","Subjuntivo","Subjunctive","Futuro","Future","I will awaken","despertare","despertares","despertare","despertáremos","despertareis","despertaren","despertando","awakening","despertado","awakened"]
["despertar","to awaken","Subjuntivo","Subjunctive","Presente perfecto","Present Perfect","I have awakened, awakened","haya despertado","hayas despertado","haya despertado","hayamos despertado","hayáis despertado","hayan despertado","despertando","awakening","despertado","awakened"]
["despertar","to awaken","Subjuntivo","Subjunctive","Futuro perfecto","Future Perfect","I will have awakened","hubiere despertado","hubieres despertado","hubiere despertado","hubiéremos despertado","hubiereis despertado","hubieren despertado","despertando","awakening","despertado","awakened"]
["despertar","to awaken","Subjuntivo","Subjunctive","Pluscuamperfecto","Past Perfect","I had awakened","hubiera despertado","hubieras despertado","hubiera despertado","hubiéramos despertado","hubierais despertado","hubieran despertado","despertando","awakening","despertado","awakened"]
["detener","to stop; to hold up, delay; to arrest, detain","Imperativo Afirmativo","Imperative Affirmative","Presente","Present","Stop! Don't stop!",null,"detén","detened",null,"detenga","detengan","deteniendo","stopping","detenido","stopped"]
["detener","to stop; to hold up, delay; to arrest, detain","Imperativo Negativo","Imperative Negative","Presente","Present","Stop! Don't stop!",null,"no detengas","no detengáis",null,"no detenga","no detengan","deteniendo","stopping","detenido","stopped"]
["detener","to stop; to hold up, delay; to arrest, detain","Indicativo","Indicative","Presente","Present","I stop, am stopping","detengo","detienes","detiene","detenemos","detenéis","detienen","deteniendo","stopping","detenido","stopped"]
["detener","to stop; to hold up, delay; to arrest, detain","Indicativo","Indicative","Futuro","Future","I will stop","detendré","detendrás","detendrá","detendremos","detendréis","detendrán","deteniendo","stopping","detenido","stopped"]
["detener","to stop; to hold up, delay; to arrest, detain","Indicativo","Indicative","Imperfecto","Imperfect","I was stopping, used to stop, stopped","detenía","detenías","detenía","deteníamos","deteníais","detenían","deteniendo","stopping","detenido","stopped"]
["detener","to stop; to hold up, delay; to arrest, detain","Indicativo","Indicative","Pretérito","Preterite","I stopped","detuve","detuviste","detuvo","detuvimos","detuvisteis","detuvieron","deteniendo","stopping","detenido","stopped"]
["detener","to stop; to hold up, delay; to arrest, detain","Indicativo","Indicative","Condicional","Conditional","I would stop","detendría","detendrías","detendría","detendríamos","detendríais","detendrían","deteniendo","stopping","detenido","stopped"]
["detener","to stop; to hold up, delay; to arrest, detain","Indicativo","Indicative","Presente perfecto","Present Perfect","I have stopped","he detenido","has detenido","ha detenido","hemos detenido","habéis detenido","han detenido","deteniendo","stopping","detenido","stopped"]
["detener","to stop; to hold up, delay; to arrest, detain","Indicativo","Indicative","Futuro perfecto","Future Perfect","I will have stopped","habré detenido","habrás detenido","habrá detenido","habremos detenido","habréis detenido","habrán detenido","deteniendo","stopping","detenido","stopped"]
["detener","to stop; to hold up, delay; to arrest, detain","Indicativo","Indicative","Pluscuamperfecto","Past Perfect","I had stopped","había detenido","habías detenido","había detenido","habíamos detenido","habíais detenido","habían detenido","deteniendo","stopping","detenido","stopped"]
["detener","to stop; to hold up, delay; to arrest, detain","Indicativo","Indicative","Pretérito anterior","Preterite (Archaic)","I had stopped","hube detenido","hubiste detenido","hubo detenido","hubimos detenido","hubisteis detenido","hubieron detenido","deteniendo","stopping","detenido","stopped"]
["detener","to stop; to hold up, delay; to arrest, detain","Indicativo","Indicative","Condicional perfecto","Conditional Perfect","I would have stopped","habría detenido","habrías detenido","habría detenido","habríamos detenido","habríais detenido","habrían detenido","deteniendo","stopping","detenido","stopped"]
["detener","to stop; to hold up, delay; to arrest, detain","Subjuntivo","Subjunctive","Presente","Present","I stop, am stopping","detenga","detengas","detenga","detengamos","detengáis","detengan","deteniendo","stopping","detenido","stopped"]
["detener","to stop; to hold up, delay; to arrest, detain","Subjuntivo","Subjunctive","Imperfecto","Imperfect","I stopped, was stopping","detuviera","detuvieras","detuviera","detuviéramos","detuvierais","detuvieran","deteniendo","stopping","detenido","stopped"]
["detener","to stop; to hold up, delay; to arrest, detain","Subjuntivo","Subjunctive","Futuro","Future","I will stop","detuviere","detuvieres","detuviere","detuviéremos","detuviereis","detuvieren","deteniendo","stopping","detenido","stopped"]
["detener","to stop; to hold up, delay; to arrest, detain","Subjuntivo","Subjunctive","Presente perfecto","Present Perfect","I have stopped, stopped","haya detenido","hayas detenido","haya detenido","hayamos detenido","hayáis detenido","hayan detenido","deteniendo","stopping","detenido","stopped"]
["detener","to stop; to hold up, delay; to arrest, detain","Subjuntivo","Subjunctive","Futuro perfecto","Future Perfect","I will have stopped","hubiere detenido","hubieres detenido","hubiere detenido","hubiéremos detenido","hubiereis detenido","hubieren detenido","deteniendo","stopping","detenido","stopped"]
["detener","to stop; to hold up, delay; to arrest, detain","Subjuntivo","Subjunctive","Pluscuamperfecto","Past Perfect","I had stopped","hubiera detenido","hubieras detenido","hubiera detenido","hubiéramos detenido","hubierais detenido","hubieran detenido","deteniendo","stopping","detenido","stopped"]
["dirigir","to direct","Imperativo Afirmativo","Imperative Affirmative","Presente","Present","Direct! Don't direct!",null,"dirige","dirigid",null,"dirija","dirijan","dirigiendo","directing","dirigido","directed"]
["dirigir","to direct","Imperativo Negativo","Imperative Negative","Presente","Present","Direct! Don't direct!",null,"no dirijas","no dirijáis",null,"no dirija","no dirijan","dirigiendo","directing","dirigido","directed"]
["dirigir","to direct","Indicativo","Indicative","Presente","Present","I direct, am directing","dirijo","diriges","dirige","dirigimos","dirigís","dirigen","dirigiendo","directing","dirigido","directed"]
["dirigir","to direct","Indicativo","Indicative","Futuro","Future","I will direct","dirigiré","dirigirás","dirigirá","dirigiremos","dirigiréis","dirigirán","dirigiendo","directing","dirigido","directed"]
["dirigir","to direct","Indicativo","Indicative","Imperfecto","Imperfect","I was directing, used to direct, directed","dirigía","dirigías","dirigía","dirigíamos","dirigíais","dirigían","dirigiendo","directing","dirigido","directed"]
["dirigir","to direct","Indicativo","Indicative","Pretérito","Preterite","I directed","dirigí","dirigiste","dirigió","dirigimos","dirigisteis","dirigieron","dirigiendo","directing","dirigido","directed"]
["dirigir","to direct","Indicativo","Indicative","Condicional","Conditional","I would direct","dirigiría","dirigirías","dirigiría","dirigiríamos","dirigiríais","dirigirían","dirigiendo","directing","dirigido","directed"]
["dirigir","to direct","Indicativo","Indicative","Presente perfecto","Present Perfect","I have directed","he dirigido","has dirigido","ha dirigido","hemos dirigido","habéis dirigido","han dirigido","dirigiendo","directing","dirigido","directed"]
["dirigir","to direct","Indicativo","Indicative","Futuro perfecto","Future Perfect","I will have directed","habré dirigido","habrás dirigido","habrá dirigido","habremos dirigido","habréis dirigido","habrán dirigido","dirigiendo","directing","dirigido","directed"]
["dirigir","to direct","Indicativo","Indicative","Pluscuamperfecto","Past Perfect","I had directed","había dirigido","habías dirigido","había dirigido","habíamos dirigido","habíais dirigido","habían dirigido","dirigiendo","directing","dirigido","directed"]
["dirigir","to direct","Indicativo","Indicative","Pretérito anterior","Preterite (Archaic)","I had directed","hube dirigido","hubiste dirigido","hubo dirigido","hubimos dirigido","hubisteis dirigido","hubieron dirigido","dirigiendo","directing","dirigido","directed"]
["dirigir","to direct","Indicativo","Indicative","Condicional perfecto","Conditional Perfect","I would have directed","habría dirigido","habrías dirigido","habría dirigido","habríamos dirigido","habríais dirigido","habrían dirigido","dirigiendo","directing","dirigido","directed"]
["dirigir","to direct","Subjuntivo","Subjunctive","Presente","Present","I direct, am directing","dirija","dirijas","dirija","dirijamos","dirijáis","dirijan","dirigiendo","directing","dirigido","directed"]
["dirigir","to direct","Subjuntivo","Subjunctive","Imperfecto","Imperfect","I directed, was directing","dirigiera","dirigieras","dirigiera","dirigiéramos","dirigierais","dirigieran","dirigiendo","directing","dirigido","directed"]
["dirigir","to direct","Subjuntivo","Subjunctive","Futuro","Future","I will direct","dirigiere","dirigieres","dirigiere","dirigiéremos","dirigiereis","dirigieren","dirigiendo","directing","dirigido","directed"]
["dirigir","to direct","Subjuntivo","Subjunctive","Presente perfecto","Present Perfect","I have directed, directed","haya dirigido","hayas dirigido","haya dirigido","hayamos dirigido","hayáis dirigido","hayan dirigido","dirigiendo","directing","dirigido","directed"]
["dirigir","to direct","Subjuntivo","Subjunctive","Futuro perfecto","Future Perfect","I will have directed","hubiere dirigido","hubieres dirigido","hubiere dirigido","hubiéremos dirigido","hubiereis dirigido","hubieren dirigido","dirigiendo","directing","dirigido","directed"]
["dirigir","to direct","Subjuntivo","Subjunctive","Pluscuamperfecto","Past Perfect","I had directed","hubiera dirigido","hubieras dirigido","hubiera dirigido","hubiéramos dirigido","hubierais dirigido","hubieran dirigido","dirigiendo","directing","dirigido","directed"]
["dormir","to sleep","Imperativo Afirmativo","Imperative Affirmative","Presente","Present","Sleep! Don't sleep!",null,"duerme","dormid",null,"duerma","duerman","durmiendo","sleeping","dormido","slept"]
["dormir","to sleep","Imperativo Negativo","Imperative Negative","Presente","Present","Sleep! Don't sleep!",null,"no duermas","no durmáis",null,"no duerma","no duerman","durmiendo","sleeping","dormido","slept"]
["dormir","to sleep","Indicativo","Indicative","Presente","Present","I sleep, am sleeping","duermo","duermes","duerme","dormimos","dormís","duermen","durmiendo","sleeping","dormido","slept"]
["dormir","to sleep","Indicativo","Indicative","Futuro","Future","I will sleep","dormiré","dormirás","dormirá","dormiremos","dormiréis","dormirán","durmiendo","sleeping","dormido","slept"]
["dormir","to sleep","Indicativo","Indicative","Imperfecto","Imperfect","I was sleeping, used to sleep, slept","dormía","dormías","dormía","dormíamos","dormíais","dormían","durmiendo","sleeping","dormido","slept"]
["dormir","to sleep","Indicativo","Indicative","Pretérito","Preterite","I slept","dormí","dormiste","durmió","dormimos","dormisteis","durmieron","durmiendo","sleeping","dormido","slept"]
["dormir","to sleep","Indicativo","Indicative","Condicional","Conditional","I would sleep","dormiría","dormirías","dormiría","dormiríamos","dormiríais","dormirían","durmiendo","sleeping","dormido","slept"]
["dormir","to sleep","Indicativo","Indicative","Presente perfecto","Present Perfect","I have slept","he dormido","has dormido","ha dormido","hemos dormido","habéis dormido","han dormido","durmiendo","sleeping","dormido","slept"]
["dormir","to sleep","Indicativo","Indicative","Futuro perfecto","Future Perfect","I will have slept","habré dormido","habrás dormido","habrá dormido","habremos dormido","habréis dormido","habrán dormido","durmiendo","sleeping","dormido","slept"]
["dormir","to sleep","Indicativo","Indicative","Pluscuamperfecto","Past Perfect","I had slept","había dormido","habías dormido","había dormido","habíamos dormido","habíais dormido","habían dormido","durmiendo","sleeping","dormido","slept"]
["dormir","to sleep","Indicativo","Indicative","Pretérito anterior","Preterite (Archaic)","I had slept","hube dormido","hubiste dormido","hubo dormido","hubimos dormido","hubisteis dormido","hubieron dormido","durmiendo","sleeping","dormido","slept"]
["dormir","to sleep","Indicativo","Indicative","Condicional perfecto","Conditional Perfect","I would have slept","habría dormido","habrías dormido","habría dormido","habríamos dormido","habríais dormido","habrían dormido","durmiendo","sleeping","dormido","slept"]
["dormir","to sleep","Subjuntivo","Subjunctive","Presente","Present","I sleep, am sleeping","duerma","duermas","duerma","durmamos","durmáis","duerman","durmiendo","sleeping","dormido","slept"]
["dormir","to sleep","Subjuntivo","Subjunctive","Imperfecto","Imperfect","I slept, was sleeping","durmiera","durmieras","durmiera","durmiéramos","durmierais","durmieran","durmiendo","sleeping","dormido","slept"]
["dormir","to sleep","Subjuntivo","Subjunctive","Futuro","Future","I will sleep","durmiere","durmieres","durmiere","durmiéremos","durmiereis","durmieren","durmiendo","sleeping","dormido","slept"]
["dormir","to sleep","Subjuntivo","Subjunctive","Presente perfecto","Present Perfect","I have slept, slept","haya dormido","hayas dormido","haya dormido","hayamos dormido","hayáis dormido","hayan dormido","durmiendo","sleeping","dormido","slept"]
["dormir","to sleep","Subjuntivo","Subjunctive","Futuro perfecto","Future Perfect","I will have slept","hubiere dormido","hubieres dormido","hubiere dormido","hubiéremos dormido","hubiereis dormido","hubieren dormido","durmiendo","sleeping","dormido","slept"]
["dormir","to sleep","Subjuntivo","Subjunctive","Pluscuamperfecto","Past Perfect","I had slept","hubiera dormido","hubieras dormido","hubiera dormido","hubiéramos dormido","hubierais dormido","hubieran dormido","durmiendo","sleeping","dormido","slept"]
["echar","to throw, cast, fling, hurl, pitch, toss","Imperativo Afirmativo","Imperative Affirmative","Presente","Present","Throw! Don't throw!",null,"echa","echad",null,"eche","echen","echando","throwing","echado","thrown"]
["echar","to throw, cast, fling, hurl, pitch, toss","Imperativo Negativo","Imperative Negative","Presente","Present","Throw! Don't throw!",null,"no eches","no echéis",null,"no eche","no echen","echando","throwing","echado","thrown"]
["echar","to throw, cast, fling, hurl, pitch, toss","Indicativo","Indicative","Presente","Present","I throw, am throwing","echo","echas","echa","echamos","echáis","echan","echando","throwing","echado","thrown"]
["echar","to throw, cast, fling, hurl, pitch, toss","Indicativo","Indicative","Futuro","Future","I will throw","echaré","echarás","echará","echaremos","echaréis","echarán","echando","throwing","echado","thrown"]
["echar","to throw, cast, fling, hurl, pitch, toss","Indicativo","Indicative","Imperfecto","Imperfect","I was throwing, used to throw, threw","echaba","echabas","echaba","echábamos","echabais","echaban","echando","throwing","echado","thrown"]
["echar","to throw, cast, fling, hurl, pitch, toss","Indicativo","Indicative","Pretérito","Preterite","I threw","eché","echaste","echó","echamos","echasteis","echaron","echando","throwing","echado","thrown"]
["echar","to throw, cast, fling, hurl, pitch, toss","Indicativo","Indicative","Condicional","Conditional","I would throw","echaría","echarías","echaría","echaríamos","echaríais","echarían","echando","throwing","echado","thrown"]
["echar","to throw, cast, fling, hurl, pitch, toss","Indicativo","Indicative","Presente perfecto","Present Perfect","I have thrown","he echado","has echado","ha echado","hemos echado","habéis echado","han echado","echando","throwing","echado","thrown"]
["echar","to throw, cast, fling, hurl, pitch, toss","Indicativo","Indicative","Futuro perfecto","Future Perfect","I will have thrown","habré echado","habrás echado","habrá echado","habremos echado","habréis echado","habrán echado","echando","throwing","echado","thrown"]
["echar","to throw, cast, fling, hurl, pitch, toss","Indicativo","Indicative","Pluscuamperfecto","Past Perfect","I had thrown","había echado","habías echado","había echado","habíamos echado","habíais echado","habían echado","echando","throwing","echado","thrown"]
["echar","to throw, cast, fling, hurl, pitch, toss","Indicativo","Indicative","Pretérito anterior","Preterite (Archaic)","I had thrown","hube echado","hubiste echado","hubo echado","hubimos echado","hubisteis echado","hubieron echado","echando","throwing","echado","thrown"]
["echar","to throw, cast, fling, hurl, pitch, toss","Indicativo","Indicative","Condicional perfecto","Conditional Perfect","I would have thrown","habría echado","habrías echado","habría echado","habríamos echado","habríais echado","habrían echado","echando","throwing","echado","thrown"]
["echar","to throw, cast, fling, hurl, pitch, toss","Subjuntivo","Subjunctive","Presente","Present","I throw, am throwing","eche","eches","eche","echemos","echéis","echen","echando","throwing","echado","thrown"]
["echar","to throw, cast, fling, hurl, pitch, toss","Subjuntivo","Subjunctive","Imperfecto","Imperfect","I threw, was throwing","echara","echaras","echara","echáramos","echarais","echaran","echando","throwing","echado","thrown"]
["echar","to throw, cast, fling, hurl, pitch, toss","Subjuntivo","Subjunctive","Futuro","Future","I will throw","echare","echares","echare","echáremos","echareis","echaren","echando","throwing","echado","thrown"]
["echar","to throw, cast, fling, hurl, pitch, toss","Subjuntivo","Subjunctive","Presente perfecto","Present Perfect","I have thrown, threw","haya echado","hayas echado","haya echado","hayamos echado","hayáis echado","hayan echado","echando","throwing","echado","thrown"]
["echar","to throw, cast, fling, hurl, pitch, toss","Subjuntivo","Subjunctive","Futuro perfecto","Future Perfect","I will have thrown","hubiere echado","hubieres echado","hubiere echado","hubiéremos echado","hubiereis echado","hubieren echado","echando","throwing","echado","thrown"]
["echar","to throw, cast, fling, hurl, pitch, toss","Subjuntivo","Subjunctive","Pluscuamperfecto","Past Perfect","I had thrown","hubiera echado","hubieras echado","hubiera echado","hubiéramos echado","hubierais echado","hubieran echado","echando","throwing","echado","thrown"]
["elegir","to elect, choose","Imperativo Afirmativo","Imperative Affirmative","Presente","Present","Elect! Don't elect!",null,"elige","elegid",null,"elija","elijan","eligiendo","electing","elegido","elected"]
["elegir","to elect, choose","Imperativo Negativo","Imperative Negative","Presente","Present","Elect! Don't elect!",null,"no elijas","no elijáis",null,"no elija","no elijan","eligiendo","electing","elegido","elected"]
["elegir","to elect, choose","Indicativo","Indicative","Presente","Present","I elect, am electing","elijo","eliges","elige","elegimos","elegís","eligen","eligiendo","electing","elegido","elected"]
["elegir","to elect, choose","Indicativo","Indicative","Futuro","Future","I will elect","elegiré","elegirás","elegirá","elegiremos","elegiréis","elegirán","eligiendo","electing","elegido","elected"]
["elegir","to elect, choose","Indicativo","Indicative","Imperfecto","Imperfect","I was electing, used to elect, elected","elegía","elegías","elegía","elegíamos","elegíais","elegían","eligiendo","electing","elegido","elected"]
["elegir","to elect, choose","Indicativo","Indicative","Pretérito","Preterite","I elected","elegí","elegiste","eligió","elegimos","elegisteis","eligieron","eligiendo","electing","elegido","elected"]
["elegir","to elect, choose","Indicativo","Indicative","Condicional","Conditional","I would elect","elegiría","elegirías","elegiría","elegiríamos","elegiríais","elegirían","eligiendo","electing","elegido","elected"]
["elegir","to elect, choose","Indicativo","Indicative","Presente perfecto","Present Perfect","I have elected","he elegido","has elegido","ha elegido","hemos elegido","habéis elegido","han elegido","eligiendo","electing","elegido","elected"]
["elegir","to elect, choose","Indicativo","Indicative","Futuro perfecto","Future Perfect","I will have elected","habré elegido","habrás elegido","habrá elegido","habremos elegido","habréis elegido","habrán elegido","eligiendo","electing","elegido","elected"]
["elegir","to elect, choose","Indicativo","Indicative","Pluscuamperfecto","Past Perfect","I had elected","había elegido","habías elegido","había elegido","habíamos elegido","habíais elegido","habían elegido","eligiendo","electing","elegido","elected"]
["elegir","to elect, choose","Indicativo","Indicative","Pretérito anterior","Preterite (Archaic)","I had elected","hube elegido","hubiste elegido","hubo elegido","hubimos elegido","hubisteis elegido","hubieron elegido","eligiendo","electing","elegido","elected"]
["elegir","to elect, choose","Indicativo","Indicative","Condicional perfecto","Conditional Perfect","I would have elected","habría elegido","habrías elegido","habría elegido","habríamos elegido","habríais elegido","habrían elegido","eligiendo","electing","elegido","elected"]
["elegir","to elect, choose","Subjuntivo","Subjunctive","Presente","Present","I elect, am electing","elija","elijas","elija","elijamos","elijáis","elijan","eligiendo","electing","elegido","elected"]
["elegir","to elect, choose","Subjuntivo","Subjunctive","Imperfecto","Imperfect","I elected, was electing","eligiera","eligieras","eligiera","eligiéramos","eligierais","eligieran","eligiendo","electing","elegido","elected"]
["elegir","to elect, choose","Subjuntivo","Subjunctive","Futuro","Future","I will elect","eligiere","eligieres","eligiere","eligiéremos","eligiereis","eligieren","eligiendo","electing","elegido","elected"]
["elegir","to elect, choose","Subjuntivo","Subjunctive","Presente perfecto","Present Perfect","I have elected, elected","haya elegido","hayas elegido","haya elegido","hayamos elegido","hayáis elegido","hayan elegido","eligiendo","electing","elegido","elected"]
["elegir","to elect, choose","Subjuntivo","Subjunctive","Futuro perfecto","Future Perfect","I will have elected","hubiere elegido","hubieres elegido","hubiere elegido","hubiéremos elegido","hubiereis elegido","hubieren elegido","eligiendo","electing","elegido","elected"]
["elegir","to elect, choose","Subjuntivo","Subjunctive","Pluscuamperfecto","Past Perfect","I had elected","hubiera elegido","hubieras elegido","hubiera elegido","hubiéramos elegido","hubierais elegido","hubieran elegido","eligiendo","electing","elegido","elected"]
["empezar","to begin, start","Imperativo Afirmativo","Imperative Affirmative","Presente","Present","Begin! Don't begin!",null,"empieza","empezad",null,"empiece","empiecen","empezando","beginning","empezado","begun"]
["empezar","to begin, start","Imperativo Negativo","Imperative Negative","Presente","Present","Begin! Don't begin!",null,"no empieces","no empecéis",null,"no empiece","no empiecen","empezando","beginning","empezado","begun"]
["empezar","to begin, start","Indicativo","Indicative","Presente","Present","I begin, am beginning","empiezo","empiezas","empieza","empezamos","empezáis","empiezan","empezando","beginning","empezado","begun"]
["empezar","to begin, start","Indicativo","Indicative","Futuro","Future","I will begin","empezaré","empezarás","empezará","empezaremos","empezaréis","empezarán","empezando","beginning","empezado","begun"]
["empezar","to begin, start","Indicativo","Indicative","Imperfecto","Imperfect","I was beginning, used to begin, began","empezaba","empezabas","empezaba","empezábamos","empezabais","empezaban","empezando","beginning","empezado","begun"]
["empezar","to begin, start","Indicativo","Indicative","Pretérito","Preterite","I began","empecé","empezaste","empezó","empezamos","empezasteis","empezaron","empezando","beginning","empezado","begun"]
["empezar","to begin, start","Indicativo","Indicative","Condicional","Conditional","I would begin","empezaría","empezarías","empezaría","empezaríamos","empezaríais","empezarían","empezando","beginning","empezado","begun"]
["empezar","to begin, start","Indicativo","Indicative","Presente perfecto","Present Perfect","I have begun","he empezado","has empezado","ha empezado","hemos empezado","habéis empezado","han empezado","empezando","beginning","empezado","begun"]
["empezar","to begin, start","Indicativo","Indicative","Futuro perfecto","Future Perfect","I will have begun","habré empezado","habrás empezado","habrá empezado","habremos empezado","habréis empezado","habrán empezado","empezando","beginning","empezado","begun"]
["empezar","to begin, start","Indicativo","Indicative","Pluscuamperfecto","Past Perfect","I had begun","había empezado","habías empezado","había empezado","habíamos empezado","habíais empezado","habían empezado","empezando","beginning","empezado","begun"]
["empezar","to begin, start","Indicativo","Indicative","Pretérito anterior","Preterite (Archaic)","I had begun","hube empezado","hubiste empezado","hubo empezado","hubimos empezado","hubisteis empezado","hubieron empezado","empezando","beginning","empezado","begun"]
["empezar","to begin, start","Indicativo","Indicative","Condicional perfecto","Conditional Perfect","I would have begun","habría empezado","habrías empezado","habría empezado","habríamos empezado","habríais empezado","habrían empezado","empezando","beginning","empezado","begun"]
["empezar","to begin, start","Subjuntivo","Subjunctive","Presente","Present","I begin, am beginning","empiece","empieces","empiece","empecemos","empecéis","empiecen","empezando","beginning","empezado","begun"]
["empezar","to begin, start","Subjuntivo","Subjunctive","Imperfecto","Imperfect","I began, was beginning","empezara","empezaras","empezara","empezáramos","empezarais","empezaran","empezando","beginning","empezado","begun"]
["empezar","to begin, start","Subjuntivo","Subjunctive","Futuro","Future","I will begin","empezare","empezares","empezare","empezáremos","empezareis","empezaren","empezando","beginning","empezado","begun"]
["empezar","to begin, start","Subjuntivo","Subjunctive","Presente perfecto","Present Perfect","I have begun, began","haya empezado","hayas empezado","haya empezado","hayamos empezado","hayáis empezado","hayan empezado","empezando","beginning","empezado","begun"]
["empezar","to begin, start","Subjuntivo","Subjunctive","Futuro perfecto","Future Perfect","I will have begun","hubiere empezado","hubieres empezado","hubiere empezado","hubiéremos empezado","hubiereis empezado","hubieren empezado","empezando","beginning","empezado","begun"]
["empezar","to begin, start","Subjuntivo","Subjunctive","Pluscuamperfecto","Past Perfect","I had begun","hubiera empezado","hubieras empezado","hubiera empezado","hubiéramos empezado","hubierais empezado","hubieran empezado","empezando","beginning","empezado","begun"]
["encontrar","to find, encounter","Imperativo Afirmativo","Imperative Affirmative","Presente","Present","Find! Don't find!",null,"encuentra","encontrad",null,"encuentre","encuentren","encontrando","finding","encontrado","found"]
["encontrar","to find, encounter","Imperativo Negativo","Imperative Negative","Presente","Present","Find! Don't find!",null,"no encuentres","no encontréis",null,"no encuentre","no encuentren","encontrando","finding","encontrado","found"]
["encontrar","to find, encounter","Indicativo","Indicative","Presente","Present","I find, am finding","encuentro","encuentras","encuentra","encontramos","encontráis","encuentran","encontrando","finding","encontrado","found"]
["encontrar","to find, encounter","Indicativo","Indicative","Futuro","Future","I will find","encontraré","encontrarás","encontrará","encontraremos","encontraréis","encontrarán","encontrando","finding","encontrado","found"]
["encontrar","to find, encounter","Indicativo","Indicative","Imperfecto","Imperfect","I was finding, used to find, found","encontraba","encontrabas","encontraba","encontrábamos","encontrabais","encontraban","encontrando","finding","encontrado","found"]
["encontrar","to find, encounter","Indicativo","Indicative","Pretérito","Preterite","I found","encontré","encontraste","encontró","encontramos","encontrasteis","encontraron","encontrando","finding","encontrado","found"]
["encontrar","to find, encounter","Indicativo","Indicative","Condicional","Conditional","I would find","encontraría","encontrarías","encontraría","encontraríamos","encontraríais","encontrarían","encontrando","finding","encontrado","found"]
["encontrar","to find, encounter","Indicativo","Indicative","Presente perfecto","Present Perfect","I have found","he encontrado","has encontrado","ha encontrado","hemos encontrado","habéis encontrado","han encontrado","encontrando","finding","encontrado","found"]
["encontrar","to find, encounter","Indicativo","Indicative","Futuro perfecto","Future Perfect","I will have found","habré encontrado","habrás encontrado","habrá encontrado","habremos encontrado","habréis encontrado","habrán encontrado","encontrando","finding","encontrado","found"]
["encontrar","to find, encounter","Indicativo","Indicative","Pluscuamperfecto","Past Perfect","I had found","había encontrado","habías encontrado","había encontrado","habíamos encontrado","habíais encontrado","habían encontrado","encontrando","finding","encontrado","found"]
["encontrar","to find, encounter","Indicativo","Indicative","Pretérito anterior","Preterite (Archaic)","I had found","hube encontrado","hubiste encontrado","hubo encontrado","hubimos encontrado","hubisteis encontrado","hubieron encontrado","encontrando","finding","encontrado","found"]
["encontrar","to find, encounter","Indicativo","Indicative","Condicional perfecto","Conditional Perfect","I would have found","habría encontrado","habrías encontrado","habría encontrado","habríamos encontrado","habríais encontrado","habrían encontrado","encontrando","finding","encontrado","found"]
["encontrar","to find, encounter","Subjuntivo","Subjunctive","Presente","Present","I find, am finding","encuentre","encuentres","encuentre","encontremos","encontréis","encuentren","encontrando","finding","encontrado","found"]
["encontrar","to find, encounter","Subjuntivo","Subjunctive","Imperfecto","Imperfect","I found, was finding","encontrara","encontraras","encontrara","encontráramos","encontrarais","encontraran","encontrando","finding","encontrado","found"]
["encontrar","to find, encounter","Subjuntivo","Subjunctive","Futuro","Future","I will find","encontrare","encontrares","encontrare","encontráremos","encontrareis","encontraren","encontrando","finding","encontrado","found"]
["encontrar","to find, encounter","Subjuntivo","Subjunctive","Presente perfecto","Present Perfect","I have found, found","haya encontrado","hayas encontrado","haya encontrado","hayamos encontrado","hayáis encontrado","hayan encontrado","encontrando","finding","encontrado","found"]
["encontrar","to find, encounter","Subjuntivo","Subjunctive","Futuro perfecto","Future Perfect","I will have found","hubiere encontrado","hubieres encontrado","hubiere encontrado","hubiéremos encontrado","hubiereis encontrado","hubieren encontrado","encontrando","finding","encontrado","found"]
["encontrar","to find, encounter","Subjuntivo","Subjunctive","Pluscuamperfecto","Past Perfect","I had found","hubiera encontrado","hubieras encontrado","hubiera encontrado","hubiéramos encontrado","hubierais encontrado","hubieran encontrado","encontrando","finding","encontrado","found"]
["enseñar","to teach, instruct, train, educate","Imperativo Afirmativo","Imperative Affirmative","Presente","Present","Teach! Don't teach!",null,"enseña","enseñad",null,"enseñe","enseñen","enseñando","teaching","enseñado","taught"]
["enseñar","to teach, instruct, train, educate","Imperativo Negativo","Imperative Negative","Presente","Present","Teach! Don't teach!",null,"no enseñes","no enseñéis",null,"no enseñe","no enseñen","enseñando","teaching","enseñado","taught"]
["enseñar","to teach, instruct, train, educate","Indicativo","Indicative","Presente","Present","I teach, am teaching","enseño","enseñas","enseña","enseñamos","enseñáis","enseñan","enseñando","teaching","enseñado","taught"]
["enseñar","to teach, instruct, train, educate","Indicativo","Indicative","Futuro","Future","I will teach","enseñaré","enseñarás","enseñará","enseñaremos","enseñaréis","enseñarán","enseñando","teaching","enseñado","taught"]
["enseñar","to teach, instruct, train, educate","Indicativo","Indicative","Imperfecto","Imperfect","I was teaching, used to teach, taught","enseñaba","enseñabas","enseñaba","enseñábamos","enseñabais","enseñaban","enseñando","teaching","enseñado","taught"]
["enseñar","to teach, instruct, train, educate","Indicativo","Indicative","Pretérito","Preterite","I taught","enseñé","enseñaste","enseñó","enseñamos","enseñasteis","enseñaron","enseñando","teaching","enseñado","taught"]
["enseñar","to teach, instruct, train, educate","Indicativo","Indicative","Condicional","Conditional","I would teach","enseñaría","enseñarías","enseñaría","enseñaríamos","enseñaríais","enseñarían","enseñando","teaching","enseñado","taught"]
["enseñar","to teach, instruct, train, educate","Indicativo","Indicative","Presente perfecto","Present Perfect","I have taught","he enseñado","has enseñado","ha enseñado","hemos enseñado","habéis enseñado","han enseñado","enseñando","teaching","enseñado","taught"]
["enseñar","to teach, instruct, train, educate","Indicativo","Indicative","Futuro perfecto","Future Perfect","I will have taught","habré enseñado","habrás enseñado","habrá enseñado","habremos enseñado","habréis enseñado","habrán enseñado","enseñando","teaching","enseñado","taught"]
["enseñar","to teach, instruct, train, educate","Indicativo","Indicative","Pluscuamperfecto","Past Perfect","I had taught","había enseñado","habías enseñado","había enseñado","habíamos enseñado","habíais enseñado","habían enseñado","enseñando","teaching","enseñado","taught"]
["enseñar","to teach, instruct, train, educate","Indicativo","Indicative","Pretérito anterior","Preterite (Archaic)","I had taught","hube enseñado","hubiste enseñado","hubo enseñado","hubimos enseñado","hubisteis enseñado","hubieron enseñado","enseñando","teaching","enseñado","taught"]
["enseñar","to teach, instruct, train, educate","Indicativo","Indicative","Condicional perfecto","Conditional Perfect","I would have taught","habría enseñado","habrías enseñado","habría enseñado","habríamos enseñado","habríais enseñado","habrían enseñado","enseñando","teaching","enseñado","taught"]
["enseñar","to teach, instruct, train, educate","Subjuntivo","Subjunctive","Presente","Present","I teach, am teaching","enseñe","enseñes","enseñe","enseñemos","enseñéis","enseñen","enseñando","teaching","enseñado","taught"]
["enseñar","to teach, instruct, train, educate","Subjuntivo","Subjunctive","Imperfecto","Imperfect","I taught, was teaching","enseñara","enseñaras","enseñara","enseñáramos","enseñarais","enseñaran","enseñando","teaching","enseñado","taught"]
["enseñar","to teach, instruct, train, educate","Subjuntivo","Subjunctive","Futuro","Future","I will teach","enseñare","enseñares","enseñare","enseñáremos","enseñareis","enseñaren","enseñando","teaching","enseñado","taught"]
["enseñar","to teach, instruct, train, educate","Subjuntivo","Subjunctive","Presente perfecto","Present Perfect","I have taught, taught","haya enseñado","hayas enseñado","haya enseñado","hayamos enseñado","hayáis enseñado","hayan enseñado","enseñando","teaching","enseñado","taught"]
["enseñar","to teach, instruct, train, educate","Subjuntivo","Subjunctive","Futuro perfecto","Future Perfect","I will have taught","hubiere enseñado","hubieres enseñado","hubiere enseñado","hubiéremos enseñado","hubiereis enseñado","hubieren enseñado","enseñando","teaching","enseñado","taught"]
["enseñar","to teach, instruct, train, educate","Subjuntivo","Subjunctive","Pluscuamperfecto","Past Perfect","I had taught","hubiera enseñado","hubieras enseñado","hubiera enseñado","hubiéramos enseñado","hubierais enseñado","hubieran enseñado","enseñando","teaching","enseñado","taught"]
["entender","to understand","Imperativo Afirmativo","Imperative Affirmative","Presente","Present","Understand! Don't understand!",null,"entiende","entended",null,"entienda","entiendan","entendiendo","understanding","entendido","understood"]
["entender","to understand","Imperativo Negativo","Imperative Negative","Presente","Present","Understand! Don't understand!",null,"no entiendas","no entendáis",null,"no entienda","no entiendan","entendiendo","understanding","entendido","understood"]
["entender","to understand","Indicativo","Indicative","Presente","Present","I understand, am understanding","entiendo","entiendes","entiende","entendemos","entendéis","entienden","entendiendo","understanding","entendido","understood"]
["entender","to understand","Indicativo","Indicative","Futuro","Future","I will understand","entenderé","entenderás","entenderá","entenderemos","entenderéis","entenderán","entendiendo","understanding","entendido","understood"]
["entender","to understand","Indicativo","Indicative","Imperfecto","Imperfect","I was understanding, used to understand, understood","entendía","entendías","entendía","entendíamos","entendíais","entendían","entendiendo","understanding","entendido","understood"]
["entender","to understand","Indicativo","Indicative","Pretérito","Preterite","I understood","entendí","entendiste","entendió","entendimos","entendisteis","entendieron","entendiendo","understanding","entendido","understood"]
["entender","to understand","Indicativo","Indicative","Condicional","Conditional","I would understand","entendería","entenderías","entendería","entenderíamos","entenderíais","entenderían","entendiendo","understanding","entendido","understood"]
["entender","to understand","Indicativo","Indicative","Presente perfecto","Present Perfect","I have understood","he entendido","has entendido","ha entendido","hemos entendido","habéis entendido","han entendido","entendiendo","understanding","entendido","understood"]
["entender","to understand","Indicativo","Indicative","Futuro perfecto","Future Perfect","I will have understood","habré entendido","habrás entendido","habrá entendido","habremos entendido","habréis entendido","habrán entendido","entendiendo","understanding","entendido","understood"]
["entender","to understand","Indicativo","Indicative","Pluscuamperfecto","Past Perfect","I had understood","había entendido","habías entendido","había entendido","habíamos entendido","habíais entendido","habían entendido","entendiendo","understanding","entendido","understood"]
["entender","to understand","Indicativo","Indicative","Pretérito anterior","Preterite (Archaic)","I had understood","hube entendido","hubiste entendido","hubo entendido","hubimos entendido","hubisteis entendido","hubieron entendido","entendiendo","understanding","entendido","understood"]
["entender","to understand","Indicativo","Indicative","Condicional perfecto","Conditional Perfect","I would have understood","habría entendido","habrías entendido","habría entendido","habríamos entendido","habríais entendido","habrían entendido","entendiendo","understanding","entendido","understood"]
["entender","to understand","Subjuntivo","Subjunctive","Presente","Present","I understand, am understanding","entienda","entiendas","entienda","entendamos","entendáis","entiendan","entendiendo","understanding","entendido","understood"]
["entender","to understand","Subjuntivo","Subjunctive","Imperfecto","Imperfect","I understood, was understanding","entendiera","entendieras","entendiera","entendiéramos","entendierais","entendieran","entendiendo","understanding","entendido","understood"]
["entender","to understand","Subjuntivo","Subjunctive","Futuro","Future","I will understand","entendiere","entendieres","entendiere","entendiéremos","entendiereis","entendieren","entendiendo","understanding","entendido","understood"]
["entender","to understand","Subjuntivo","Subjunctive","Presente perfecto","Present Perfect","I have understood, understood","haya entendido","hayas entendido","haya entendido","hayamos entendido","hayáis entendido","hayan entendido","entendiendo","understanding","entendido","understood"]
["entender","to understand","Subjuntivo","Subjunctive","Futuro perfecto","Future Perfect","I will have understood","hubiere entendido","hubieres entendido","hubiere entendido","hubiéremos entendido","hubiereis entendido","hubieren entendido","entendiendo","understanding","entendido","understood"]
["entender","to understand","Subjuntivo","Subjunctive","Pluscuamperfecto","Past Perfect","I had understood","hubiera entendido","hubieras entendido","hubiera entendido","hubiéramos entendido","hubierais entendido","hubieran entendido","entendiendo","understanding","entendido","understood"]
["entrar","to enter, go in, come in","Imperativo Afirmativo","Imperative Affirmative","Presente","Present","Enter! Don't enter!",null,"entra","entrad",null,"entre","entren","entrando","entering","entrado","entered"]
["entrar","to enter, go in, come in","Imperativo Negativo","Imperative Negative","Presente","Present","Enter! Don't enter!",null,"no entres","no entréis",null,"no entre","no entren","entrando","entering","entrado","entered"]
["entrar","to enter, go in, come in","Indicativo","Indicative","Presente","Present","I enter, am entering","entro","entras","entra","entramos","entráis","entran","entrando","entering","entrado","entered"]
["entrar","to enter, go in, come in","Indicativo","Indicative","Futuro","Future","I will enter","entraré","entrarás","entrará","entraremos","entraréis","entrarán","entrando","entering","entrado","entered"]
["entrar","to enter, go in, come in","Indicativo","Indicative","Imperfecto","Imperfect","I was entering, used to enter, entered","entraba","entrabas","entraba","entrábamos","entrabais","entraban","entrando","entering","entrado","entered"]
["entrar","to enter, go in, come in","Indicativo","Indicative","Pretérito","Preterite","I entered","entré","entraste","entró","entramos","entrasteis","entraron","entrando","entering","entrado","entered"]
["entrar","to enter, go in, come in","Indicativo","Indicative","Condicional","Conditional","I would enter","entraría","entrarías","entraría","entraríamos","entraríais","entrarían","entrando","entering","entrado","entered"]
["entrar","to enter, go in, come in","Indicativo","Indicative","Presente perfecto","Present Perfect","I have entered","he entrado","has entrado","ha entrado","hemos entrado","habéis entrado","han entrado","entrando","entering","entrado","entered"]
["entrar","to enter, go in, come in","Indicativo","Indicative","Futuro perfecto","Future Perfect","I will have entered","habré entrado","habrás entrado","habrá entrado","habremos entrado","habréis entrado","habrán entrado","entrando","entering","entrado","entered"]
["entrar","to enter, go in, come in","Indicativo","Indicative","Pluscuamperfecto","Past Perfect","I had entered","había entrado","habías entrado","había entrado","habíamos entrado","habíais entrado","habían entrado","entrando","entering","entrado","entered"]
["entrar","to enter, go in, come in","Indicativo","Indicative","Pretérito anterior","Preterite (Archaic)","I had entered","hube entrado","hubiste entrado","hubo entrado","hubimos entrado","hubisteis entrado","hubieron entrado","entrando","entering","entrado","entered"]
["entrar","to enter, go in, come in","Indicativo","Indicative","Condicional perfecto","Conditional Perfect","I would have entered","habría entrado","habrías entrado","habría entrado","habríamos entrado","habríais entrado","habrían entrado","entrando","entering","entrado","entered"]
["entrar","to enter, go in, come in","Subjuntivo","Subjunctive","Presente","Present","I enter, am entering","entre","entres","entre","entremos","entréis","entren","entrando","entering","entrado","entered"]
["entrar","to enter, go in, come in","Subjuntivo","Subjunctive","Imperfecto","Imperfect","I entered, was entering","entrara","entraras","entrara","entráramos","entrarais","entraran","entrando","entering","entrado","entered"]
["entrar","to enter, go in, come in","Subjuntivo","Subjunctive","Futuro","Future","I will enter","entrare","entrares","entrare","entráremos","entrareis","entraren","entrando","entering","entrado","entered"]
["entrar","to enter, go in, come in","Subjuntivo","Subjunctive","Presente perfecto","Present Perfect","I have entered, entered","haya entrado","hayas entrado","haya entrado","hayamos entrado","hayáis entrado","hayan entrado","entrando","entering","entrado","entered"]
["entrar","to enter, go in, come in","Subjuntivo","Subjunctive","Futuro perfecto","Future Perfect","I will have entered","hubiere entrado","hubieres entrado","hubiere entrado","hubiéremos entrado","hubiereis entrado","hubieren entrado","entrando","entering","entrado","entered"]
["entrar","to enter, go in, come in","Subjuntivo","Subjunctive","Pluscuamperfecto","Past Perfect","I had entered","hubiera entrado","hubieras entrado","hubiera entrado","hubiéramos entrado","hubierais entrado","hubieran entrado","entrando","entering","entrado","entered"]
["entregar","to deliver, hand over","Imperativo Afirmativo","Imperative Affirmative","Presente","Present","Deliver! Don't deliver!",null,"entrega","entregad",null,"entregue","entreguen","entregando","delivering","entregado","delivered"]
["entregar","to deliver, hand over","Imperativo Negativo","Imperative Negative","Presente","Present","Deliver! Don't deliver!",null,"no entregues","no entreguéis",null,"no entregue","no entreguen","entregando","delivering","entregado","delivered"]
["entregar","to deliver, hand over","Indicativo","Indicative","Futuro","Future","I will deliver","entregaré","entregarás","entregará","entregaremos","entregaréis","entregarán","entregando","delivering","entregado","delivered"]
["entregar","to deliver, hand over","Indicativo","Indicative","Presente","Present","I deliver, am delivering","entrego","entregas","entrega","entregamos","entregáis","entregan","entregando","delivering","entregado","delivered"]
["entregar","to deliver, hand over","Indicativo","Indicative","Imperfecto","Imperfect","I was delivering, used to deliver, delivered","entregaba","entregabas","entregaba","entregábamos","entregabais","entregaban","entregando","delivering","entregado","delivered"]
["entregar","to deliver, hand over","Indicativo","Indicative","Pretérito","Preterite","I delivered","entregué","entregaste","entregó","entregamos","entregasteis","entregaron","entregando","delivering","entregado","delivered"]
["entregar","to deliver, hand over","Indicativo","Indicative","Condicional","Conditional","I would deliver","entregaría","entregarías","entregaría","entregaríamos","entregaríais","entregarían","entregando","delivering","entregado","delivered"]
["entregar","to deliver, hand over","Indicativo","Indicative","Presente perfecto","Present Perfect","I have delivered","he entregado","has entregado","ha entregado","hemos entregado","habéis entregado","han entregado","entregando","delivering","entregado","delivered"]
["entregar","to deliver, hand over","Indicativo","Indicative","Futuro perfecto","Future Perfect","I will have delivered","habré entregado","habrás entregado","habrá entregado","habremos entregado","habréis entregado","habrán entregado","entregando","delivering","entregado","delivered"]
["entregar","to deliver, hand over","Indicativo","Indicative","Pluscuamperfecto","Past Perfect","I had delivered","había entregado","habías entregado","había entregado","habíamos entregado","habíais entregado","habían entregado","entregando","delivering","entregado","delivered"]
["entregar","to deliver, hand over","Indicativo","Indicative","Pretérito anterior","Preterite (Archaic)","I had delivered","hube entregado","hubiste entregado","hubo entregado","hubimos entregado","hubisteis entregado","hubieron entregado","entregando","delivering","entregado","delivered"]
["entregar","to deliver, hand over","Indicativo","Indicative","Condicional perfecto","Conditional Perfect","I would have delivered","habría entregado","habrías entregado","habría entregado","habríamos entregado","habríais entregado","habrían entregado","entregando","delivering","entregado","delivered"]
["entregar","to deliver, hand over","Subjuntivo","Subjunctive","Presente","Present","I deliver, am delivering","entregue","entregues","entregue","entreguemos","entreguéis","entreguen","entregando","delivering","entregado","delivered"]
["entregar","to deliver, hand over","Subjuntivo","Subjunctive","Imperfecto","Imperfect","I delivered, was delivering","entregara","entregaras","entregara","entregáramos","entregarais","entregaran","entregando","delivering","entregado","delivered"]
["entregar","to deliver, hand over","Subjuntivo","Subjunctive","Futuro","Future","I will deliver","entregare","entregares","entregare","entregáremos","entregareis","entregaren","entregando","delivering","entregado","delivered"]
["entregar","to deliver, hand over","Subjuntivo","Subjunctive","Presente perfecto","Present Perfect","I have delivered, delivered","haya entregado","hayas entregado","haya entregado","hayamos entregado","hayáis entregado","hayan entregado","entregando","delivering","entregado","delivered"]
["entregar","to deliver, hand over","Subjuntivo","Subjunctive","Futuro perfecto","Future Perfect","I will have delivered","hubiere entregado","hubieres entregado","hubiere entregado","hubiéremos entregado","hubiereis entregado","hubieren entregado","entregando","delivering","entregado","delivered"]
["entregar","to deliver, hand over","Subjuntivo","Subjunctive","Pluscuamperfecto","Past Perfect","I had delivered","hubiera entregado","hubieras entregado","hubiera entregado","hubiéramos entregado","hubierais entregado","hubieran entregado","entregando","delivering","entregado","delivered"]
["escribir","to write","Imperativo Afirmativo","Imperative Affirmative","Presente","Present","Write! Don't write!",null,"escribe","escribid",null,"escriba","escriban","escribiendo","writing","escrito","written"]
["escribir","to write","Imperativo Negativo","Imperative Negative","Presente","Present","Write! Don't write!",null,"no escribas","no escribáis",null,"no escriba","no escriban","escribiendo","writing","escrito","written"]
["escribir","to write","Indicativo","Indicative","Presente","Present","I write, am writing","escribo","escribes","escribe","escribimos","escribís","escriben","escribiendo","writing","escrito","written"]
["escribir","to write","Indicativo","Indicative","Futuro","Future","I will write","escribiré","escribirás","escribirá","escribiremos","escribiréis","escribirán","escribiendo","writing","escrito","written"]
["escribir","to write","Indicativo","Indicative","Imperfecto","Imperfect","I was writing, used to write, wrote","escribía","escribías","escribía","escribíamos","escribíais","escribían","escribiendo","writing","escrito","written"]
["escribir","to write","Indicativo","Indicative","Pretérito","Preterite","I wrote","escribí","escribiste","escribió","escribimos","escribisteis","escribieron","escribiendo","writing","escrito","written"]
["escribir","to write","Indicativo","Indicative","Condicional","Conditional","I would write","escribiría","escribirías","escribiría","escribiríamos","escribiríais","escribirían","escribiendo","writing","escrito","written"]
["escribir","to write","Indicativo","Indicative","Presente perfecto","Present Perfect","I have written","he escrito","has escrito","ha escrito","hemos escrito","habéis escrito","han escrito","escribiendo","writing","escrito","written"]
["escribir","to write","Indicativo","Indicative","Futuro perfecto","Future Perfect","I will have written","habré escrito","habrás escrito","habrá escrito","habremos escrito","habréis escrito","habrán escrito","escribiendo","writing","escrito","written"]
["escribir","to write","Indicativo","Indicative","Pluscuamperfecto","Past Perfect","I had written","había escrito","habías escrito","había escrito","habíamos escrito","habíais escrito","habían escrito","escribiendo","writing","escrito","written"]
["escribir","to write","Indicativo","Indicative","Pretérito anterior","Preterite (Archaic)","I had written","hube escrito","hubiste escrito","hubo escrito","hubimos escrito","hubisteis escrito","hubieron escrito","escribiendo","writing","escrito","written"]
["escribir","to write","Indicativo","Indicative","Condicional perfecto","Conditional Perfect","I would have written","habría escrito","habrías escrito","habría escrito","habríamos escrito","habríais escrito","habrían escrito","escribiendo","writing","escrito","written"]
["escribir","to write","Subjuntivo","Subjunctive","Presente","Present","I write, am writing","escriba","escribas","escriba","escribamos","escribáis","escriban","escribiendo","writing","escrito","written"]
["escribir","to write","Subjuntivo","Subjunctive","Imperfecto","Imperfect","I wrote, was writing","escribiera","escribieras","escribiera","escribiéramos","escribierais","escribieran","escribiendo","writing","escrito","written"]
["escribir","to write","Subjuntivo","Subjunctive","Futuro","Future","I will write","escribiere","escribieres","escribiere","escribiéremos","escribiereis","escribieren","escribiendo","writing","escrito","written"]
["escribir","to write","Subjuntivo","Subjunctive","Presente perfecto","Present Perfect","I have written, wrote","haya escrito","hayas escrito","haya escrito","hayamos escrito","hayáis escrito","hayan escrito","escribiendo","writing","escrito","written"]
["escribir","to write","Subjuntivo","Subjunctive","Futuro perfecto","Future Perfect","I will have written","hubiere escrito","hubieres escrito","hubiere escrito","hubiéremos escrito","hubiereis escrito","hubieren escrito","escribiendo","writing","escrito","written"]
["escribir","to write","Subjuntivo","Subjunctive","Pluscuamperfecto","Past Perfect","I had written","hubiera escrito","hubieras escrito","hubiera escrito","hubiéramos escrito","hubierais escrito","hubieran escrito","escribiendo","writing","escrito","written"]
["escuchar","to listen to, hear","Imperativo Afirmativo","Imperative Affirmative","Presente","Present","Listen to! Don't listen to!",null,"escucha","escuchad",null,"escuche","escuchen","escuchando","listening to","escuchado","listened to"]
["escuchar","to listen to, hear","Imperativo Negativo","Imperative Negative","Presente","Present","Listen to! Don't listen to!",null,"no escuches","no escuchéis",null,"no escuche","no escuchen","escuchando","listening to","escuchado","listened to"]
["escuchar","to listen to, hear","Indicativo","Indicative","Presente","Present","I listen to, am listening to","escucho","escuchas","escucha","escuchamos","escucháis","escuchan","escuchando","listening to","escuchado","listened to"]
["escuchar","to listen to, hear","Indicativo","Indicative","Futuro","Future","I will listen to","escucharé","escucharás","escuchará","escucharemos","escucharéis","escucharán","escuchando","listening to","escuchado","listened to"]
["escuchar","to listen to, hear","Indicativo","Indicative","Imperfecto","Imperfect","I was listening to, used to listen to, listened to","escuchaba","escuchabas","escuchaba","escuchábamos","escuchabais","escuchaban","escuchando","listening to","escuchado","listened to"]
["escuchar","to listen to, hear","Indicativo","Indicative","Pretérito","Preterite","I listened to","escuché","escuchaste","escuchó","escuchamos","escuchasteis","escucharon","escuchando","listening to","escuchado","listened to"]
["escuchar","to listen to, hear","Indicativo","Indicative","Condicional","Conditional","I would listen to","escucharía","escucharías","escucharía","escucharíamos","escucharíais","escucharían","escuchando","listening to","escuchado","listened to"]
["escuchar","to listen to, hear","Indicativo","Indicative","Presente perfecto","Present Perfect","I have listened to","he escuchado","has escuchado","ha escuchado","hemos escuchado","habéis escuchado","han escuchado","escuchando","listening to","escuchado","listened to"]
["escuchar","to listen to, hear","Indicativo","Indicative","Futuro perfecto","Future Perfect","I will have listened to","habré escuchado","habrás escuchado","habrá escuchado","habremos escuchado","habréis escuchado","habrán escuchado","escuchando","listening to","escuchado","listened to"]
["escuchar","to listen to, hear","Indicativo","Indicative","Pluscuamperfecto","Past Perfect","I had listened to","había escuchado","habías escuchado","había escuchado","habíamos escuchado","habíais escuchado","habían escuchado","escuchando","listening to","escuchado","listened to"]
["escuchar","to listen to, hear","Indicativo","Indicative","Pretérito anterior","Preterite (Archaic)","I had listened to","hube escuchado","hubiste escuchado","hubo escuchado","hubimos escuchado","hubisteis escuchado","hubieron escuchado","escuchando","listening to","escuchado","listened to"]
["escuchar","to listen to, hear","Indicativo","Indicative","Condicional perfecto","Conditional Perfect","I would have listened to","habría escuchado","habrías escuchado","habría escuchado","habríamos escuchado","habríais escuchado","habrían escuchado","escuchando","listening to","escuchado","listened to"]
["escuchar","to listen to, hear","Subjuntivo","Subjunctive","Presente","Present","I listen to, am listening to","escuche","escuches","escuche","escuchemos","escuchéis","escuchen","escuchando","listening to","escuchado","listened to"]
["escuchar","to listen to, hear","Subjuntivo","Subjunctive","Imperfecto","Imperfect","I listened to, was listening to","escuchara","escucharas","escuchara","escucháramos","escucharais","escucharan","escuchando","listening to","escuchado","listened to"]
["escuchar","to listen to, hear","Subjuntivo","Subjunctive","Futuro","Future","I will listen to","escuchare","escuchares","escuchare","escucháremos","escuchareis","escucharen","escuchando","listening to","escuchado","listened to"]
["escuchar","to listen to, hear","Subjuntivo","Subjunctive","Presente perfecto","Present Perfect","I have listened to, listened to","haya escuchado","hayas escuchado","haya escuchado","hayamos escuchado","hayáis escuchado","hayan escuchado","escuchando","listening to","escuchado","listened to"]
["escuchar","to listen to, hear","Subjuntivo","Subjunctive","Futuro perfecto","Future Perfect","I will have listened to","hubiere escuchado","hubieres escuchado","hubiere escuchado","hubiéremos escuchado","hubiereis escuchado","hubieren escuchado","escuchando","listening to","escuchado","listened to"]
["escuchar","to listen to, hear","Subjuntivo","Subjunctive","Pluscuamperfecto","Past Perfect","I had listened to","hubiera escuchado","hubieras escuchado","hubiera escuchado","hubiéramos escuchado","hubierais escuchado","hubieran escuchado","escuchando","listening to","escuchado","listened to"]
["esperar","to hope","Imperativo Afirmativo","Imperative Affirmative","Presente","Present","Hope! Don't hope!",null,"espera","esperad",null,"espere","esperen","esperando","hoping","esperado","hoped"]
["esperar","to hope","Imperativo Negativo","Imperative Negative","Presente","Present","Hope! Don't hope!",null,"no esperes","no esperéis",null,"no espere","no esperen","esperando","hoping","esperado","hoped"]
["esperar","to hope","Indicativo","Indicative","Presente","Present","I hope, am hoping","espero","esperas","espera","esperamos","esperáis","esperan","esperando","hoping","esperado","hoped"]
["esperar","to hope","Indicativo","Indicative","Futuro","Future","I will hope","esperaré","esperarás","esperará","esperaremos","esperaréis","esperarán","esperando","hoping","esperado","hoped"]
["esperar","to hope","Indicativo","Indicative","Imperfecto","Imperfect","I was hoping, used to hope, hoped","esperaba","esperabas","esperaba","esperábamos","esperabais","esperaban","esperando","hoping","esperado","hoped"]
["esperar","to hope","Indicativo","Indicative","Pretérito","Preterite","I hoped","esperé","esperaste","esperó","esperamos","esperasteis","esperaron","esperando","hoping","esperado","hoped"]
["esperar","to hope","Indicativo","Indicative","Condicional","Conditional","I would hope","esperaría","esperarías","esperaría","esperaríamos","esperaríais","esperarían","esperando","hoping","esperado","hoped"]
["esperar","to hope","Indicativo","Indicative","Presente perfecto","Present Perfect","I have hoped","he esperado","has esperado","ha esperado","hemos esperado","habéis esperado","han esperado","esperando","hoping","esperado","hoped"]
["esperar","to hope","Indicativo","Indicative","Futuro perfecto","Future Perfect","I will have hoped","habré esperado","habrás esperado","habrá esperado","habremos esperado","habréis esperado","habrán esperado","esperando","hoping","esperado","hoped"]
["esperar","to hope","Indicativo","Indicative","Pluscuamperfecto","Past Perfect","I had hoped","había esperado","habías esperado","había esperado","habíamos esperado","habíais esperado","habían esperado","esperando","hoping","esperado","hoped"]
["esperar","to hope","Indicativo","Indicative","Pretérito anterior","Preterite (Archaic)","I had hoped","hube esperado","hubiste esperado","hubo esperado","hubimos esperado","hubisteis esperado","hubieron esperado","esperando","hoping","esperado","hoped"]
["esperar","to hope","Indicativo","Indicative","Condicional perfecto","Conditional Perfect","I would have hoped","habría esperado","habrías esperado","habría esperado","habríamos esperado","habríais esperado","habrían esperado","esperando","hoping","esperado","hoped"]
["esperar","to hope","Subjuntivo","Subjunctive","Presente","Present","I hope, am hoping","espere","esperes","espere","esperemos","esperéis","esperen","esperando","hoping","esperado","hoped"]
["esperar","to hope","Subjuntivo","Subjunctive","Imperfecto","Imperfect","I hoped, was hoping","esperara","esperaras","esperara","esperáramos","esperarais","esperaran","esperando","hoping","esperado","hoped"]
["esperar","to hope","Subjuntivo","Subjunctive","Futuro","Future","I will hope","esperare","esperares","esperare","esperáremos","esperareis","esperaren","esperando","hoping","esperado","hoped"]
["esperar","to hope","Subjuntivo","Subjunctive","Presente perfecto","Present Perfect","I have hoped, hoped","haya esperado","hayas esperado","haya esperado","hayamos esperado","hayáis esperado","hayan esperado","esperando","hoping","esperado","hoped"]
["esperar","to hope","Subjuntivo","Subjunctive","Futuro perfecto","Future Perfect","I will have hoped","hubiere esperado","hubieres esperado","hubiere esperado","hubiéremos esperado","hubiereis esperado","hubieren esperado","esperando","hoping","esperado","hoped"]
["esperar","to hope","Subjuntivo","Subjunctive","Pluscuamperfecto","Past Perfect","I had hoped","hubiera esperado","hubieras esperado","hubiera esperado","hubiéramos esperado","hubierais esperado","hubieran esperado","esperando","hoping","esperado","hoped"]
["establecer","to establish","Imperativo Afirmativo","Imperative Affirmative","Presente","Present","Establish! Don't establish!",null,"establece","estableced",null,"establezca","establezcan","estableciendo","establishing","establecido","established"]
["establecer","to establish","Imperativo Negativo","Imperative Negative","Presente","Present","Establish! Don't establish!",null,"no establezcas","no establezcáis",null,"no establezca","no establezcan","estableciendo","establishing","establecido","established"]
["establecer","to establish","Indicativo","Indicative","Presente","Present","I establish, am establishing","establezco","estableces","establece","establecemos","establecéis","establecen","estableciendo","establishing","establecido","established"]
["establecer","to establish","Indicativo","Indicative","Futuro","Future","I will establish","estableceré","establecerás","establecerá","estableceremos","estableceréis","establecerán","estableciendo","establishing","establecido","established"]
["establecer","to establish","Indicativo","Indicative","Imperfecto","Imperfect","I was establishing, used to establish, established","establecía","establecías","establecía","establecíamos","establecíais","establecían","estableciendo","establishing","establecido","established"]
["establecer","to establish","Indicativo","Indicative","Pretérito","Preterite","I established","establecí","estableciste","estableció","establecimos","establecisteis","establecieron","estableciendo","establishing","establecido","established"]
["establecer","to establish","Indicativo","Indicative","Condicional","Conditional","I would establish","establecería","establecerías","establecería","estableceríamos","estableceríais","establecerían","estableciendo","establishing","establecido","established"]
["establecer","to establish","Indicativo","Indicative","Presente perfecto","Present Perfect","I have established","he establecido","has establecido","ha establecido","hemos establecido","habéis establecido","han establecido","estableciendo","establishing","establecido","established"]
["establecer","to establish","Indicativo","Indicative","Futuro perfecto","Future Perfect","I will have established","habré establecido","habrás establecido","habrá establecido","habremos establecido","habréis establecido","habrán establecido","estableciendo","establishing","establecido","established"]
["establecer","to establish","Indicativo","Indicative","Pluscuamperfecto","Past Perfect","I had established","había establecido","habías establecido","había establecido","habíamos establecido","habíais establecido","habían establecido","estableciendo","establishing","establecido","established"]
["establecer","to establish","Indicativo","Indicative","Pretérito anterior","Preterite (Archaic)","I had established","hube establecido","hubiste establecido","hubo establecido","hubimos establecido","hubisteis establecido","hubieron establecido","estableciendo","establishing","establecido","established"]
["establecer","to establish","Indicativo","Indicative","Condicional perfecto","Conditional Perfect","I would have established","habría establecido","habrías establecido","habría establecido","habríamos establecido","habríais establecido","habrían establecido","estableciendo","establishing","establecido","established"]
["establecer","to establish","Subjuntivo","Subjunctive","Presente","Present","I establish, am establishing","establezca","establezcas","establezca","establezcamos","establezcáis","establezcan","estableciendo","establishing","establecido","established"]
["establecer","to establish","Subjuntivo","Subjunctive","Imperfecto","Imperfect","I established, was establishing","estableciera","establecieras","estableciera","estableciéramos","establecierais","establecieran","estableciendo","establishing","establecido","established"]
["establecer","to establish","Subjuntivo","Subjunctive","Futuro","Future","I will establish","estableciere","establecieres","estableciere","estableciéremos","estableciereis","establecieren","estableciendo","establishing","establecido","established"]
["establecer","to establish","Subjuntivo","Subjunctive","Presente perfecto","Present Perfect","I have established, established","haya establecido","hayas establecido","haya establecido","hayamos establecido","hayáis establecido","hayan establecido","estableciendo","establishing","establecido","established"]
["establecer","to establish","Subjuntivo","Subjunctive","Futuro perfecto","Future Perfect","I will have established","hubiere establecido","hubieres establecido","hubiere establecido","hubiéremos establecido","hubiereis establecido","hubieren establecido","estableciendo","establishing","establecido","established"]
["establecer","to establish","Subjuntivo","Subjunctive","Pluscuamperfecto","Past Perfect","I had established","hubiera establecido","hubieras establecido","hubiera establecido","hubiéramos establecido","hubierais establecido","hubieran establecido","estableciendo","establishing","establecido","established"]
["estar","to be","Imperativo Afirmativo","Imperative Affirmative","Presente","Present","Be! Don't be!",null,"está","estad",null,"esté","estén","estando","being","estado","been"]
["estar","to be","Imperativo Negativo","Imperative Negative","Presente","Present","Be! Don't be!",null,"no estés","no estéis",null,"no esté","no estén","estando","being","estado","been"]
["estar","to be","Indicativo","Indicative","Presente","Present","I am","estoy","estás","está","estamos","estáis","están","estando","being","estado","been"]
["estar","to be","Indicativo","Indicative","Futuro","Future","I will be","estaré","estarás","estará","estaremos","estaréis","estarán","estando","being","estado","been"]
["estar","to be","Indicativo","Indicative","Imperfecto","Imperfect","I was, used to be","estaba","estabas","estaba","estábamos","estabais","estaban","estando","being","estado","been"]
["estar","to be","Indicativo","Indicative","Pretérito","Preterite","I was","estuve","estuviste","estuvo","estuvimos","estuvisteis","estuvieron","estando","being","estado","been"]
["estar","to be","Indicativo","Indicative","Condicional","Conditional","I would be","estaría","estarías","estaría","estaríamos","estaríais","estarían","estando","being","estado","been"]
["estar","to be","Indicativo","Indicative","Presente perfecto","Present Perfect","I have been","he estado","has estado","ha estado","hemos estado","habéis estado","han estado","estando","being","estado","been"]
["estar","to be","Indicativo","Indicative","Futuro perfecto","Future Perfect","I will have been","habré estado","habrás estado","habrá estado","habremos estado","habréis estado","habrán estado","estando","being","estado","been"]
["estar","to be","Indicativo","Indicative","Pluscuamperfecto","Past Perfect","I had been","había estado","habías estado","había estado","habíamos estado","habíais estado","habían estado","estando","being","estado","been"]
["estar","to be","Indicativo","Indicative","Pretérito anterior","Preterite (Archaic)","I had been","hube estado","hubiste estado","hubo estado","hubimos estado","hubisteis estado","hubieron estado","estando","being","estado","been"]
["estar","to be","Indicativo","Indicative","Condicional perfecto","Conditional Perfect","I would have been","habría estado","habrías estado","habría estado","habríamos estado","habríais estado","habrían estado","estando","being","estado","been"]
["estar","to be","Subjuntivo","Subjunctive","Presente","Present","I am","esté","estés","esté","estemos","estéis","estén","estando","being","estado","been"]
["estar","to be","Subjuntivo","Subjunctive","Imperfecto","Imperfect","I was, were","estuviera","estuvieras","estuviera","estuviéramos","estuvierais","estuvieran","estando","being","estado","been"]
["estar","to be","Subjuntivo","Subjunctive","Futuro","Future","I will be","estuviere","estuvieres","estuviere","estuviéremos","estuviereis","estuvieren","estando","being","estado","been"]
["estar","to be","Subjuntivo","Subjunctive","Presente perfecto","Present Perfect","I have been, was","haya estado","hayas estado","haya estado","hayamos estado","hayáis estado","hayan estado","estando","being","estado","been"]
["estar","to be","Subjuntivo","Subjunctive","Futuro perfecto","Future Perfect","I will have been","hubiere estado","hubieres estado","hubiere estado","hubiéremos estado","hubiereis estado","hubieren estado","estando","being","estado","been"]
["estar","to be","Subjuntivo","Subjunctive","Pluscuamperfecto","Past Perfect","I had been","hubiera estado","hubieras estado","hubiera estado","hubiéramos estado","hubierais estado","hubieran estado","estando","being","estado","been"]
["estudiar","to study","Imperativo Afirmativo","Imperative Affirmative","Presente","Present","Study! Don't study!",null,"estudia","estudiad",null,"estudie","estudien","estudiando","studying","estudiado","studied"]
["estudiar","to study","Imperativo Negativo","Imperative Negative","Presente","Present","Study! Don't study!",null,"no estudies","no estudiéis",null,"no estudie","no estudien","estudiando","studying","estudiado","studied"]
["estudiar","to study","Indicativo","Indicative","Presente","Present","I study, am studying","estudio","estudias","estudia","estudiamos","estudiáis","estudian","estudiando","studying","estudiado","studied"]
["estudiar","to study","Indicativo","Indicative","Futuro","Future","I will study","estudiaré","estudiarás","estudiará","estudiaremos","estudiaréis","estudiarán","estudiando","studying","estudiado","studied"]
["estudiar","to study","Indicativo","Indicative","Imperfecto","Imperfect","I was studying, used to study, studied","estudiaba","estudiabas","estudiaba","estudiábamos","estudiabais","estudiaban","estudiando","studying","estudiado","studied"]
["estudiar","to study","Indicativo","Indicative","Pretérito","Preterite","I studied","estudié","estudiaste","estudió","estudiamos","estudiasteis","estudiaron","estudiando","studying","estudiado","studied"]
["estudiar","to study","Indicativo","Indicative","Condicional","Conditional","I would study","estudiaría","estudiarías","estudiaría","estudiaríamos","estudiaríais","estudiarían","estudiando","studying","estudiado","studied"]
["estudiar","to study","Indicativo","Indicative","Presente perfecto","Present Perfect","I have studied","he estudiado","has estudiado","ha estudiado","hemos estudiado","habéis estudiado","han estudiado","estudiando","studying","estudiado","studied"]
["estudiar","to study","Indicativo","Indicative","Futuro perfecto","Future Perfect","I will have studied","habré estudiado","habrás estudiado","habrá estudiado","habremos estudiado","habréis estudiado","habrán estudiado","estudiando","studying","estudiado","studied"]
["estudiar","to study","Indicativo","Indicative","Pluscuamperfecto","Past Perfect","I had studied","había estudiado","habías estudiado","había estudiado","habíamos estudiado","habíais estudiado","habían estudiado","estudiando","studying","estudiado","studied"]
["estudiar","to study","Indicativo","Indicative","Pretérito anterior","Preterite (Archaic)","I had studied","hube estudiado","hubiste estudiado","hubo estudiado","hubimos estudiado","hubisteis estudiado","hubieron estudiado","estudiando","studying","estudiado","studied"]
["estudiar","to study","Indicativo","Indicative","Condicional perfecto","Conditional Perfect","I would have studied","habría estudiado","habrías estudiado","habría estudiado","habríamos estudiado","habríais estudiado","habrían estudiado","estudiando","studying","estudiado","studied"]
["estudiar","to study","Subjuntivo","Subjunctive","Presente","Present","I study, am studying","estudie","estudies","estudie","estudiemos","estudiéis","estudien","estudiando","studying","estudiado","studied"]
["estudiar","to study","Subjuntivo","Subjunctive","Imperfecto","Imperfect","I studied, was studying","estudiara","estudiaras","estudiara","estudiáramos","estudiarais","estudiaran","estudiando","studying","estudiado","studied"]
["estudiar","to study","Subjuntivo","Subjunctive","Futuro","Future","I will study","estudiare","estudiares","estudiare","estudiáremos","estudiareis","estudiaren","estudiando","studying","estudiado","studied"]
["estudiar","to study","Subjuntivo","Subjunctive","Presente perfecto","Present Perfect","I have studied, studied","haya estudiado","hayas estudiado","haya estudiado","hayamos estudiado","hayáis estudiado","hayan estudiado","estudiando","studying","estudiado","studied"]
["estudiar","to study","Subjuntivo","Subjunctive","Futuro perfecto","Future Perfect","I will have studied","hubiere estudiado","hubieres estudiado","hubiere estudiado","hubiéremos estudiado","hubiereis estudiado","hubieren estudiado","estudiando","studying","estudiado","studied"]
["estudiar","to study","Subjuntivo","Subjunctive","Pluscuamperfecto","Past Perfect","I had studied","hubiera estudiado","hubieras estudiado","hubiera estudiado","hubiéramos estudiado","hubierais estudiado","hubieran estudiado","estudiando","studying","estudiado","studied"]
["evitar","to avoid; to prevent","Imperativo Afirmativo","Imperative Affirmative","Presente","Present","Avoid! Don't avoid!",null,"evita","evitad",null,"evite","eviten","evitando","avoiding","evitado","avoided"]
["evitar","to avoid; to prevent","Imperativo Negativo","Imperative Negative","Presente","Present","Avoid! Don't avoid!",null,"no evites","no evitéis",null,"no evite","no eviten","evitando","avoiding","evitado","avoided"]
["evitar","to avoid; to prevent","Indicativo","Indicative","Presente","Present","I avoid, am avoiding","evito","evitas","evita","evitamos","evitáis","evitan","evitando","avoiding","evitado","avoided"]
["evitar","to avoid; to prevent","Indicativo","Indicative","Futuro","Future","I will avoid","evitaré","evitarás","evitará","evitaremos","evitaréis","evitarán","evitando","avoiding","evitado","avoided"]
["evitar","to avoid; to prevent","Indicativo","Indicative","Imperfecto","Imperfect","I was avoiding, used to avoid, avoided","evitaba","evitabas","evitaba","evitábamos","evitabais","evitaban","evitando","avoiding","evitado","avoided"]
["evitar","to avoid; to prevent","Indicativo","Indicative","Pretérito","Preterite","I avoided","evité","evitaste","evitó","evitamos","evitasteis","evitaron","evitando","avoiding","evitado","avoided"]
["evitar","to avoid; to prevent","Indicativo","Indicative","Condicional","Conditional","I would avoid","evitaría","evitarías","evitaría","evitaríamos","evitaríais","evitarían","evitando","avoiding","evitado","avoided"]
["evitar","to avoid; to prevent","Indicativo","Indicative","Presente perfecto","Present Perfect","I have avoided","he evitado","has evitado","ha evitado","hemos evitado","habéis evitado","han evitado","evitando","avoiding","evitado","avoided"]
["evitar","to avoid; to prevent","Indicativo","Indicative","Futuro perfecto","Future Perfect","I will have avoided","habré evitado","habrás evitado","habrá evitado","habremos evitado","habréis evitado","habrán evitado","evitando","avoiding","evitado","avoided"]
["evitar","to avoid; to prevent","Indicativo","Indicative","Pluscuamperfecto","Past Perfect","I had avoided","había evitado","habías evitado","había evitado","habíamos evitado","habíais evitado","habían evitado","evitando","avoiding","evitado","avoided"]
["evitar","to avoid; to prevent","Indicativo","Indicative","Pretérito anterior","Preterite (Archaic)","I had avoided","hube evitado","hubiste evitado","hubo evitado","hubimos evitado","hubisteis evitado","hubieron evitado","evitando","avoiding","evitado","avoided"]
["evitar","to avoid; to prevent","Indicativo","Indicative","Condicional perfecto","Conditional Perfect","I would have avoided","habría evitado","habrías evitado","habría evitado","habríamos evitado","habríais evitado","habrían evitado","evitando","avoiding","evitado","avoided"]
["evitar","to avoid; to prevent","Subjuntivo","Subjunctive","Presente","Present","I avoid, am avoiding","evite","evites","evite","evitemos","evitéis","eviten","evitando","avoiding","evitado","avoided"]
["evitar","to avoid; to prevent","Subjuntivo","Subjunctive","Imperfecto","Imperfect","I avoided, was avoiding","evitara","evitaras","evitara","evitáramos","evitarais","evitaran","evitando","avoiding","evitado","avoided"]
["evitar","to avoid; to prevent","Subjuntivo","Subjunctive","Futuro","Future","I will avoid","evitare","evitares","evitare","evitáremos","evitareis","evitaren","evitando","avoiding","evitado","avoided"]
["evitar","to avoid; to prevent","Subjuntivo","Subjunctive","Presente perfecto","Present Perfect","I have avoided, avoided","haya evitado","hayas evitado","haya evitado","hayamos evitado","hayáis evitado","hayan evitado","evitando","avoiding","evitado","avoided"]
["evitar","to avoid; to prevent","Subjuntivo","Subjunctive","Futuro perfecto","Future Perfect","I will have avoided","hubiere evitado","hubieres evitado","hubiere evitado","hubiéremos evitado","hubiereis evitado","hubieren evitado","evitando","avoiding","evitado","avoided"]
["evitar","to avoid; to prevent","Subjuntivo","Subjunctive","Pluscuamperfecto","Past Perfect","I had avoided","hubiera evitado","hubieras evitado","hubiera evitado","hubiéramos evitado","hubierais evitado","hubieran evitado","evitando","avoiding","evitado","avoided"]
["exigir","to demand, require","Imperativo Afirmativo","Imperative Affirmative","Presente","Present","Demand! Don't demand!",null,"exige","exigid",null,"exija","exijan","exigiendo","demanding","exigido","demanded"]
["exigir","to demand, require","Imperativo Negativo","Imperative Negative","Presente","Present","Demand! Don't demand!",null,"no exijas","no exijáis",null,"no exija","no exijan","exigiendo","demanding","exigido","demanded"]
["exigir","to demand, require","Indicativo","Indicative","Presente","Present","I demand, am demanding","exijo","exiges","exige","exigimos","exigís","exigen","exigiendo","demanding","exigido","demanded"]
["exigir","to demand, require","Indicativo","Indicative","Futuro","Future","I will demand","exigiré","exigirás","exigirá","exigiremos","exigiréis","exigirán","exigiendo","demanding","exigido","demanded"]
["exigir","to demand, require","Indicativo","Indicative","Imperfecto","Imperfect","I was demanding, used to demand, demanded","exigía","exigías","exigía","exigíamos","exigíais","exigían","exigiendo","demanding","exigido","demanded"]
["exigir","to demand, require","Indicativo","Indicative","Pretérito","Preterite","I demanded","exigí","exigiste","exigió","exigimos","exigisteis","exigieron","exigiendo","demanding","exigido","demanded"]
["exigir","to demand, require","Indicativo","Indicative","Condicional","Conditional","I would demand","exigiría","exigirías","exigiría","exigiríamos","exigiríais","exigirían","exigiendo","demanding","exigido","demanded"]
["exigir","to demand, require","Indicativo","Indicative","Presente perfecto","Present Perfect","I have demanded","he exigido","has exigido","ha exigido","hemos exigido","habéis exigido","han exigido","exigiendo","demanding","exigido","demanded"]
["exigir","to demand, require","Indicativo","Indicative","Futuro perfecto","Future Perfect","I will have demanded","habré exigido","habrás exigido","habrá exigido","habremos exigido","habréis exigido","habrán exigido","exigiendo","demanding","exigido","demanded"]
["exigir","to demand, require","Indicativo","Indicative","Pluscuamperfecto","Past Perfect","I had demanded","había exigido","habías exigido","había exigido","habíamos exigido","habíais exigido","habían exigido","exigiendo","demanding","exigido","demanded"]
["exigir","to demand, require","Indicativo","Indicative","Pretérito anterior","Preterite (Archaic)","I had demanded","hube exigido","hubiste exigido","hubo exigido","hubimos exigido","hubisteis exigido","hubieron exigido","exigiendo","demanding","exigido","demanded"]
["exigir","to demand, require","Indicativo","Indicative","Condicional perfecto","Conditional Perfect","I would have demanded","habría exigido","habrías exigido","habría exigido","habríamos exigido","habríais exigido","habrían exigido","exigiendo","demanding","exigido","demanded"]
["exigir","to demand, require","Subjuntivo","Subjunctive","Presente","Present","I demand, am demanding","exija","exijas","exija","exijamos","exijáis","exijan","exigiendo","demanding","exigido","demanded"]
["exigir","to demand, require","Subjuntivo","Subjunctive","Imperfecto","Imperfect","I demanded, was demanding","exigiera","exigieras","exigiera","exigiéramos","exigierais","exigieran","exigiendo","demanding","exigido","demanded"]
["exigir","to demand, require","Subjuntivo","Subjunctive","Futuro","Future","I will demand","exigiere","exigieres","exigiere","exigiéremos","exigiereis","exigieren","exigiendo","demanding","exigido","demanded"]
["exigir","to demand, require","Subjuntivo","Subjunctive","Presente perfecto","Present Perfect","I have demanded, demanded","haya exigido","hayas exigido","haya exigido","hayamos exigido","hayáis exigido","hayan exigido","exigiendo","demanding","exigido","demanded"]
["exigir","to demand, require","Subjuntivo","Subjunctive","Futuro perfecto","Future Perfect","I will have demanded","hubiere exigido","hubieres exigido","hubiere exigido","hubiéremos exigido","hubiereis exigido","hubieren exigido","exigiendo","demanding","exigido","demanded"]
["exigir","to demand, require","Subjuntivo","Subjunctive","Pluscuamperfecto","Past Perfect","I had demanded","hubiera exigido","hubieras exigido","hubiera exigido","hubiéramos exigido","hubierais exigido","hubieran exigido","exigiendo","demanding","exigido","demanded"]
["explicar","to explain","Imperativo Afirmativo","Imperative Affirmative","Presente","Present","explain! Don't explain!",null,"explica","explicad",null,"explique","expliquen","explicando","explaining","explicado","explained"]
["explicar","to explain","Imperativo Negativo","Imperative Negative","Presente","Present","explain! Don't explain!",null,"no expliques","no expliquéis",null,"no explique","no expliquen","explicando","explaining","explicado","explained"]
["explicar","to explain","Indicativo","Indicative","Presente","Present","I explain, am explaining","explico","explicas","explica","explicamos","explicáis","explican","explicando","explaining","explicado","explained"]
["explicar","to explain","Indicativo","Indicative","Futuro","Future","I will explain","explicaré","explicarás","explicará","explicaremos","explicaréis","explicarán","explicando","explaining","explicado","explained"]
["explicar","to explain","Indicativo","Indicative","Imperfecto","Imperfect","I was explaining, used to explain, explained","explicaba","explicabas","explicaba","explicábamos","explicabais","explicaban","explicando","explaining","explicado","explained"]
["explicar","to explain","Indicativo","Indicative","Pretérito","Preterite","I explained","expliqué","explicaste","explicó","explicamos","explicasteis","explicaron","explicando","explaining","explicado","explained"]
["explicar","to explain","Indicativo","Indicative","Condicional","Conditional","I would explain","explicaría","explicarías","explicaría","explicaríamos","explicaríais","explicarían","explicando","explaining","explicado","explained"]
["explicar","to explain","Indicativo","Indicative","Presente perfecto","Present Perfect","I have explained","he explicado","has explicado","ha explicado","hemos explicado","habéis explicado","han explicado","explicando","explaining","explicado","explained"]
["explicar","to explain","Indicativo","Indicative","Futuro perfecto","Future Perfect","I will have explained","habré explicado","habrás explicado","habrá explicado","habremos explicado","habréis explicado","habrán explicado","explicando","explaining","explicado","explained"]
["explicar","to explain","Indicativo","Indicative","Pluscuamperfecto","Past Perfect","I had explained","había explicado","habías explicado","había explicado","habíamos explicado","habíais explicado","habían explicado","explicando","explaining","explicado","explained"]
["explicar","to explain","Indicativo","Indicative","Pretérito anterior","Preterite (Archaic)","I had explained","hube explicado","hubiste explicado","hubo explicado","hubimos explicado","hubisteis explicado","hubieron explicado","explicando","explaining","explicado","explained"]
["explicar","to explain","Indicativo","Indicative","Condicional perfecto","Conditional Perfect","I would have explained","habría explicado","habrías explicado","habría explicado","habríamos explicado","habríais explicado","habrían explicado","explicando","explaining","explicado","explained"]
["explicar","to explain","Subjuntivo","Subjunctive","Presente","Present","I explain, am explaining","explique","expliques","explique","expliquemos","expliquéis","expliquen","explicando","explaining","explicado","explained"]
["explicar","to explain","Subjuntivo","Subjunctive","Imperfecto","Imperfect","I explained, was explaining","explicara","explicaras","explicara","explicáramos","explicarais","explicaran","explicando","explaining","explicado","explained"]
["explicar","to explain","Subjuntivo","Subjunctive","Futuro","Future","I will explain","explicare","explicares","explicare","explicáremos","explicareis","explicaren","explicando","explaining","explicado","explained"]
["explicar","to explain","Subjuntivo","Subjunctive","Presente perfecto","Present Perfect","I have explained, explained","haya explicado","hayas explicado","haya explicado","hayamos explicado","hayáis explicado","hayan explicado","explicando","explaining","explicado","explained"]
["explicar","to explain","Subjuntivo","Subjunctive","Futuro perfecto","Future Perfect","I will have explained","hubiere explicado","hubieres explicado","hubiere explicado","hubiéremos explicado","hubiereis explicado","hubieren explicado","explicando","explaining","explicado","explained"]
["explicar","to explain","Subjuntivo","Subjunctive","Pluscuamperfecto","Past Perfect","I had explained","hubiera explicado","hubieras explicado","hubiera explicado","hubiéramos explicado","hubierais explicado","hubieran explicado","explicando","explaining","explicado","explained"]
["expresar","to express, voice, state","Imperativo Afirmativo","Imperative Affirmative","Presente","Present","Express! Don't express!",null,"expresa","expresad",null,"exprese","expresen","expresando","expressing","expresado","expressed"]
["expresar","to express, voice, state","Imperativo Negativo","Imperative Negative","Presente","Present","Express! Don't express!",null,"no expreses","no expreséis",null,"no exprese","no expresen","expresando","expressing","expresado","expressed"]
["expresar","to express, voice, state","Indicativo","Indicative","Presente","Present","I express, am expressing","expreso","expresas","expresa","expresamos","expresáis","expresan","expresando","expressing","expresado","expressed"]
["expresar","to express, voice, state","Indicativo","Indicative","Futuro","Future","I will express","expresaré","expresarás","expresará","expresaremos","expresaréis","expresarán","expresando","expressing","expresado","expressed"]
["expresar","to express, voice, state","Indicativo","Indicative","Imperfecto","Imperfect","I was expressing, used to express, expressed","expresaba","expresabas","expresaba","expresábamos","expresabais","expresaban","expresando","expressing","expresado","expressed"]
["expresar","to express, voice, state","Indicativo","Indicative","Pretérito","Preterite","I expressed","expresé","expresaste","expresó","expresamos","expresasteis","expresaron","expresando","expressing","expresado","expressed"]
["expresar","to express, voice, state","Indicativo","Indicative","Condicional","Conditional","I would express","expresaría","expresarías","expresaría","expresaríamos","expresaríais","expresarían","expresando","expressing","expresado","expressed"]
["expresar","to express, voice, state","Indicativo","Indicative","Presente perfecto","Present Perfect","I have expressed","he expresado","has expresado","ha expresado","hemos expresado","habéis expresado","han expresado","expresando","expressing","expresado","expressed"]
["expresar","to express, voice, state","Indicativo","Indicative","Futuro perfecto","Future Perfect","I will have expressed","habré expresado","habrás expresado","habrá expresado","habremos expresado","habréis expresado","habrán expresado","expresando","expressing","expresado","expressed"]
["expresar","to express, voice, state","Indicativo","Indicative","Pluscuamperfecto","Past Perfect","I had expressed","había expresado","habías expresado","había expresado","habíamos expresado","habíais expresado","habían expresado","expresando","expressing","expresado","expressed"]
["expresar","to express, voice, state","Indicativo","Indicative","Pretérito anterior","Preterite (Archaic)","I had expressed","hube expresado","hubiste expresado","hubo expresado","hubimos expresado","hubisteis expresado","hubieron expresado","expresando","expressing","expresado","expressed"]
["expresar","to express, voice, state","Indicativo","Indicative","Condicional perfecto","Conditional Perfect","I would have expressed","habría expresado","habrías expresado","habría expresado","habríamos expresado","habríais expresado","habrían expresado","expresando","expressing","expresado","expressed"]
["expresar","to express, voice, state","Subjuntivo","Subjunctive","Presente","Present","I express, am expressing","exprese","expreses","exprese","expresemos","expreséis","expresen","expresando","expressing","expresado","expressed"]
["expresar","to express, voice, state","Subjuntivo","Subjunctive","Imperfecto","Imperfect","I expressed, was expressing","expresara","expresaras","expresara","expresáramos","expresarais","expresaran","expresando","expressing","expresado","expressed"]
["expresar","to express, voice, state","Subjuntivo","Subjunctive","Futuro","Future","I will express","expresare","expresares","expresare","expresáremos","expresareis","expresaren","expresando","expressing","expresado","expressed"]
["expresar","to express, voice, state","Subjuntivo","Subjunctive","Presente perfecto","Present Perfect","I have expressed, expressed","haya expresado","hayas expresado","haya expresado","hayamos expresado","hayáis expresado","hayan expresado","expresando","expressing","expresado","expressed"]
["expresar","to express, voice, state","Subjuntivo","Subjunctive","Futuro perfecto","Future Perfect","I will have expressed","hubiere expresado","hubieres expresado","hubiere expresado","hubiéremos expresado","hubiereis expresado","hubieren expresado","expresando","expressing","expresado","expressed"]
["expresar","to express, voice, state","Subjuntivo","Subjunctive","Pluscuamperfecto","Past Perfect","I had expressed","hubiera expresado","hubieras expresado","hubiera expresado","hubiéramos expresado","hubierais expresado","hubieran expresado","expresando","expressing","expresado","expressed"]
["faltar","to lack, be lacking, be missing, be absent","Imperativo Afirmativo","Imperative Affirmative","Presente","Present","Lack! Don't lack!",null,"falta","faltad",null,"falte","falten","faltando","lacking","faltado","lacked"]
["faltar","to lack, be lacking, be missing, be absent","Imperativo Negativo","Imperative Negative","Presente","Present","Lack! Don't lack!",null,"no faltes","no faltéis",null,"no falte","no falten","faltando","lacking","faltado","lacked"]
["faltar","to lack, be lacking, be missing, be absent","Indicativo","Indicative","Presente","Present","I lack, am lacking","falto","faltas","falta","faltamos","faltáis","faltan","faltando","lacking","faltado","lacked"]
["faltar","to lack, be lacking, be missing, be absent","Indicativo","Indicative","Futuro","Future","I will lack","faltaré","faltarás","faltará","faltaremos","faltaréis","faltarán","faltando","lacking","faltado","lacked"]
["faltar","to lack, be lacking, be missing, be absent","Indicativo","Indicative","Imperfecto","Imperfect","I was lacking, used to lack, lacked","faltaba","faltabas","faltaba","faltábamos","faltabais","faltaban","faltando","lacking","faltado","lacked"]
["faltar","to lack, be lacking, be missing, be absent","Indicativo","Indicative","Pretérito","Preterite","I lacked","falté","faltaste","faltó","faltamos","faltasteis","faltaron","faltando","lacking","faltado","lacked"]
["faltar","to lack, be lacking, be missing, be absent","Indicativo","Indicative","Condicional","Conditional","I would lack","faltaría","faltarías","faltaría","faltaríamos","faltaríais","faltarían","faltando","lacking","faltado","lacked"]
["faltar","to lack, be lacking, be missing, be absent","Indicativo","Indicative","Presente perfecto","Present Perfect","I have lacked","he faltado","has faltado","ha faltado","hemos faltado","habéis faltado","han faltado","faltando","lacking","faltado","lacked"]
["faltar","to lack, be lacking, be missing, be absent","Indicativo","Indicative","Futuro perfecto","Future Perfect","I will have lacked","habré faltado","habrás faltado","habrá faltado","habremos faltado","habréis faltado","habrán faltado","faltando","lacking","faltado","lacked"]
["faltar","to lack, be lacking, be missing, be absent","Indicativo","Indicative","Pluscuamperfecto","Past Perfect","I had lacked","había faltado","habías faltado","había faltado","habíamos faltado","habíais faltado","habían faltado","faltando","lacking","faltado","lacked"]
["faltar","to lack, be lacking, be missing, be absent","Indicativo","Indicative","Pretérito anterior","Preterite (Archaic)","I had lacked","hube faltado","hubiste faltado","hubo faltado","hubimos faltado","hubisteis faltado","hubieron faltado","faltando","lacking","faltado","lacked"]
["faltar","to lack, be lacking, be missing, be absent","Indicativo","Indicative","Condicional perfecto","Conditional Perfect","I would have lacked","habría faltado","habrías faltado","habría faltado","habríamos faltado","habríais faltado","habrían faltado","faltando","lacking","faltado","lacked"]
["faltar","to lack, be lacking, be missing, be absent","Subjuntivo","Subjunctive","Presente","Present","I lack, am lacking","falte","faltes","falte","faltemos","faltéis","falten","faltando","lacking","faltado","lacked"]
["faltar","to lack, be lacking, be missing, be absent","Subjuntivo","Subjunctive","Imperfecto","Imperfect","I lacked, was lacking","faltara","faltaras","faltara","faltáramos","faltarais","faltaran","faltando","lacking","faltado","lacked"]
["faltar","to lack, be lacking, be missing, be absent","Subjuntivo","Subjunctive","Futuro","Future","I will lack","faltare","faltares","faltare","faltáremos","faltareis","faltaren","faltando","lacking","faltado","lacked"]
["faltar","to lack, be lacking, be missing, be absent","Subjuntivo","Subjunctive","Presente perfecto","Present Perfect","I have lacked, lacked","haya faltado","hayas faltado","haya faltado","hayamos faltado","hayáis faltado","hayan faltado","faltando","lacking","faltado","lacked"]
["faltar","to lack, be lacking, be missing, be absent","Subjuntivo","Subjunctive","Futuro perfecto","Future Perfect","I will have lacked","hubiere faltado","hubieres faltado","hubiere faltado","hubiéremos faltado","hubiereis faltado","hubieren faltado","faltando","lacking","faltado","lacked"]
["faltar","to lack, be lacking, be missing, be absent","Subjuntivo","Subjunctive","Pluscuamperfecto","Past Perfect","I had lacked","hubiera faltado","hubieras faltado","hubiera faltado","hubiéramos faltado","hubierais faltado","hubieran faltado","faltando","lacking","faltado","lacked"]
["fijar","to fix, fasten, secure","Imperativo Afirmativo","Imperative Affirmative","Presente","Present","Fix! Don't fix!",null,"fija","fijad",null,"fije","fijen","fijando","fixing","fijado","fixed"]
["fijar","to fix, fasten, secure","Imperativo Negativo","Imperative Negative","Presente","Present","Fix! Don't fix!",null,"no fijes","no fijéis",null,"no fije","no fijen","fijando","fixing","fijado","fixed"]
["fijar","to fix, fasten, secure","Indicativo","Indicative","Presente","Present","I fix, am fixing","fijo","fijas","fija","fijamos","fijáis","fijan","fijando","fixing","fijado","fixed"]
["fijar","to fix, fasten, secure","Indicativo","Indicative","Futuro","Future","I will fix","fijaré","fijarás","fijará","fijaremos","fijaréis","fijarán","fijando","fixing","fijado","fixed"]
["fijar","to fix, fasten, secure","Indicativo","Indicative","Imperfecto","Imperfect","I was fixing, used to fix, fixed","fijaba","fijabas","fijaba","fijábamos","fijabais","fijaban","fijando","fixing","fijado","fixed"]
["fijar","to fix, fasten, secure","Indicativo","Indicative","Pretérito","Preterite","I fixed","fijé","fijaste","fijó","fijamos","fijasteis","fijaron","fijando","fixing","fijado","fixed"]
["fijar","to fix, fasten, secure","Indicativo","Indicative","Condicional","Conditional","I would fix","fijaría","fijarías","fijaría","fijaríamos","fijaríais","fijarían","fijando","fixing","fijado","fixed"]
["fijar","to fix, fasten, secure","Indicativo","Indicative","Presente perfecto","Present Perfect","I have fixed","he fijado","has fijado","ha fijado","hemos fijado","habéis fijado","han fijado","fijando","fixing","fijado","fixed"]
["fijar","to fix, fasten, secure","Indicativo","Indicative","Futuro perfecto","Future Perfect","I will have fixed","habré fijado","habrás fijado","habrá fijado","habremos fijado","habréis fijado","habrán fijado","fijando","fixing","fijado","fixed"]
["fijar","to fix, fasten, secure","Indicativo","Indicative","Pluscuamperfecto","Past Perfect","I had fixed","había fijado","habías fijado","había fijado","habíamos fijado","habíais fijado","habían fijado","fijando","fixing","fijado","fixed"]
["fijar","to fix, fasten, secure","Indicativo","Indicative","Pretérito anterior","Preterite (Archaic)","I had fixed","hube fijado","hubiste fijado","hubo fijado","hubimos fijado","hubisteis fijado","hubieron fijado","fijando","fixing","fijado","fixed"]
["fijar","to fix, fasten, secure","Indicativo","Indicative","Condicional perfecto","Conditional Perfect","I would have fixed","habría fijado","habrías fijado","habría fijado","habríamos fijado","habríais fijado","habrían fijado","fijando","fixing","fijado","fixed"]
["fijar","to fix, fasten, secure","Subjuntivo","Subjunctive","Presente","Present","I fix, am fixing","fije","fijes","fije","fijemos","fijéis","fijen","fijando","fixing","fijado","fixed"]
["fijar","to fix, fasten, secure","Subjuntivo","Subjunctive","Imperfecto","Imperfect","I fixed, was fixing","fijara","fijaras","fijara","fijáramos","fijarais","fijaran","fijando","fixing","fijado","fixed"]
["fijar","to fix, fasten, secure","Subjuntivo","Subjunctive","Futuro","Future","I will fix","fijare","fijares","fijare","fijáremos","fijareis","fijaren","fijando","fixing","fijado","fixed"]
["fijar","to fix, fasten, secure","Subjuntivo","Subjunctive","Presente perfecto","Present Perfect","I have fixed, fixed","haya fijado","hayas fijado","haya fijado","hayamos fijado","hayáis fijado","hayan fijado","fijando","fixing","fijado","fixed"]
["fijar","to fix, fasten, secure","Subjuntivo","Subjunctive","Futuro perfecto","Future Perfect","I will have fixed","hubiere fijado","hubieres fijado","hubiere fijado","hubiéremos fijado","hubiereis fijado","hubieren fijado","fijando","fixing","fijado","fixed"]
["fijar","to fix, fasten, secure","Subjuntivo","Subjunctive","Pluscuamperfecto","Past Perfect","I had fixed","hubiera fijado","hubieras fijado","hubiera fijado","hubiéramos fijado","hubierais fijado","hubieran fijado","fijando","fixing","fijado","fixed"]
["formar","to form, shape, fashion, make","Imperativo Afirmativo","Imperative Affirmative","Presente","Present","Form! Don't form!",null,"forma","formad",null,"forme","formen","formando","forming","formado","formed"]
["formar","to form, shape, fashion, make","Imperativo Negativo","Imperative Negative","Presente","Present","Form! Don't form!",null,"no formes","no forméis",null,"no forme","no formen","formando","forming","formado","formed"]
["formar","to form, shape, fashion, make","Indicativo","Indicative","Presente","Present","I form, am forming","formo","formas","forma","formamos","formáis","forman","formando","forming","formado","formed"]
["formar","to form, shape, fashion, make","Indicativo","Indicative","Futuro","Future","I will form","formaré","formarás","formará","formaremos","formaréis","formarán","formando","forming","formado","formed"]
["formar","to form, shape, fashion, make","Indicativo","Indicative","Imperfecto","Imperfect","I was forming, used to form, formed","formaba","formabas","formaba","formábamos","formabais","formaban","formando","forming","formado","formed"]
["formar","to form, shape, fashion, make","Indicativo","Indicative","Pretérito","Preterite","I formed","formé","formaste","formó","formamos","formasteis","formaron","formando","forming","formado","formed"]
["formar","to form, shape, fashion, make","Indicativo","Indicative","Condicional","Conditional","I would form","formaría","formarías","formaría","formaríamos","formaríais","formarían","formando","forming","formado","formed"]
["formar","to form, shape, fashion, make","Indicativo","Indicative","Presente perfecto","Present Perfect","I have formed","he formado","has formado","ha formado","hemos formado","habéis formado","han formado","formando","forming","formado","formed"]
["formar","to form, shape, fashion, make","Indicativo","Indicative","Futuro perfecto","Future Perfect","I will have formed","habré formado","habrás formado","habrá formado","habremos formado","habréis formado","habrán formado","formando","forming","formado","formed"]
["formar","to form, shape, fashion, make","Indicativo","Indicative","Pluscuamperfecto","Past Perfect","I had formed","había formado","habías formado","había formado","habíamos formado","habíais formado","habían formado","formando","forming","formado","formed"]
["formar","to form, shape, fashion, make","Indicativo","Indicative","Pretérito anterior","Preterite (Archaic)","I had formed","hube formado","hubiste formado","hubo formado","hubimos formado","hubisteis formado","hubieron formado","formando","forming","formado","formed"]
["formar","to form, shape, fashion, make","Indicativo","Indicative","Condicional perfecto","Conditional Perfect","I would have formed","habría formado","habrías formado","habría formado","habríamos formado","habríais formado","habrían formado","formando","forming","formado","formed"]
["formar","to form, shape, fashion, make","Subjuntivo","Subjunctive","Presente","Present","I form, am forming","forme","formes","forme","formemos","forméis","formen","formando","forming","formado","formed"]
["formar","to form, shape, fashion, make","Subjuntivo","Subjunctive","Imperfecto","Imperfect","I formed, was forming","formara","formaras","formara","formáramos","formarais","formaran","formando","forming","formado","formed"]
["formar","to form, shape, fashion, make","Subjuntivo","Subjunctive","Futuro","Future","I will form","formare","formares","formare","formáremos","formareis","formaren","formando","forming","formado","formed"]
["formar","to form, shape, fashion, make","Subjuntivo","Subjunctive","Presente perfecto","Present Perfect","I have formed, formed","haya formado","hayas formado","haya formado","hayamos formado","hayáis formado","hayan formado","formando","forming","formado","formed"]
["formar","to form, shape, fashion, make","Subjuntivo","Subjunctive","Futuro perfecto","Future Perfect","I will have formed","hubiere formado","hubieres formado","hubiere formado","hubiéremos formado","hubiereis formado","hubieren formado","formando","forming","formado","formed"]
["formar","to form, shape, fashion, make","Subjuntivo","Subjunctive","Pluscuamperfecto","Past Perfect","I had formed","hubiera formado","hubieras formado","hubiera formado","hubiéramos formado","hubierais formado","hubieran formado","formando","forming","formado","formed"]
["funcionar","to function; to run, work","Imperativo Afirmativo","Imperative Affirmative","Presente","Present","Function! Don't function!",null,"funciona","funcionad",null,"funcione","funcionen","funcionando","functioning","funcionado","functioned"]
["funcionar","to function; to run, work","Imperativo Negativo","Imperative Negative","Presente","Present","Function! Don't function!",null,"no funciones","no funcionéis",null,"no funcione","no funcionen","funcionando","functioning","funcionado","functioned"]
["funcionar","to function; to run, work","Indicativo","Indicative","Presente","Present","I function, am functioning","funciono","funcionas","funciona","funcionamos","funcionáis","funcionan","funcionando","functioning","funcionado","functioned"]
["funcionar","to function; to run, work","Indicativo","Indicative","Futuro","Future","I will function","funcionaré","funcionarás","funcionará","funcionaremos","funcionaréis","funcionarán","funcionando","functioning","funcionado","functioned"]
["funcionar","to function; to run, work","Indicativo","Indicative","Imperfecto","Imperfect","I was functioning, used to function, functioned","funcionaba","funcionabas","funcionaba","funcionábamos","funcionabais","funcionaban","funcionando","functioning","funcionado","functioned"]
["funcionar","to function; to run, work","Indicativo","Indicative","Pretérito","Preterite","I functioned","funcioné","funcionaste","funcionó","funcionamos","funcionasteis","funcionaron","funcionando","functioning","funcionado","functioned"]
["funcionar","to function; to run, work","Indicativo","Indicative","Condicional","Conditional","I would function","funcionaría","funcionarías","funcionaría","funcionaríamos","funcionaríais","funcionarían","funcionando","functioning","funcionado","functioned"]
["funcionar","to function; to run, work","Indicativo","Indicative","Presente perfecto","Present Perfect","I have functioned","he funcionado","has funcionado","ha funcionado","hemos funcionado","habéis funcionado","han funcionado","funcionando","functioning","funcionado","functioned"]
["funcionar","to function; to run, work","Indicativo","Indicative","Futuro perfecto","Future Perfect","I will have functioned","habré funcionado","habrás funcionado","habrá funcionado","habremos funcionado","habréis funcionado","habrán funcionado","funcionando","functioning","funcionado","functioned"]
["funcionar","to function; to run, work","Indicativo","Indicative","Pluscuamperfecto","Past Perfect","I had functioned","había funcionado","habías funcionado","había funcionado","habíamos funcionado","habíais funcionado","habían funcionado","funcionando","functioning","funcionado","functioned"]
["funcionar","to function; to run, work","Indicativo","Indicative","Pretérito anterior","Preterite (Archaic)","I had functioned","hube funcionado","hubiste funcionado","hubo funcionado","hubimos funcionado","hubisteis funcionado","hubieron funcionado","funcionando","functioning","funcionado","functioned"]
["funcionar","to function; to run, work","Indicativo","Indicative","Condicional perfecto","Conditional Perfect","I would have functioned","habría funcionado","habrías funcionado","habría funcionado","habríamos funcionado","habríais funcionado","habrían funcionado","funcionando","functioning","funcionado","functioned"]
["funcionar","to function; to run, work","Subjuntivo","Subjunctive","Presente","Present","I function, am functioning","funcione","funciones","funcione","funcionemos","funcionéis","funcionen","funcionando","functioning","funcionado","functioned"]
["funcionar","to function; to run, work","Subjuntivo","Subjunctive","Imperfecto","Imperfect","I functioned, was functioning","funcionara","funcionaras","funcionara","funcionáramos","funcionarais","funcionaran","funcionando","functioning","funcionado","functioned"]
["funcionar","to function; to run, work","Subjuntivo","Subjunctive","Futuro","Future","I will function","funcionare","funcionares","funcionare","funcionáremos","funcionareis","funcionaren","funcionando","functioning","funcionado","functioned"]
["funcionar","to function; to run, work","Subjuntivo","Subjunctive","Presente perfecto","Present Perfect","I have functioned, functioned","haya funcionado","hayas funcionado","haya funcionado","hayamos funcionado","hayáis funcionado","hayan funcionado","funcionando","functioning","funcionado","functioned"]
["funcionar","to function; to run, work","Subjuntivo","Subjunctive","Futuro perfecto","Future Perfect","I will have functioned","hubiere funcionado","hubieres funcionado","hubiere funcionado","hubiéremos funcionado","hubiereis funcionado","hubieren funcionado","funcionando","functioning","funcionado","functioned"]
["funcionar","to function; to run, work","Subjuntivo","Subjunctive","Pluscuamperfecto","Past Perfect","I had functioned","hubiera funcionado","hubieras funcionado","hubiera funcionado","hubiéramos funcionado","hubierais funcionado","hubieran funcionado","funcionando","functioning","funcionado","functioned"]
["ganar","to win, gain, earn, get, acquire","Imperativo Afirmativo","Imperative Affirmative","Presente","Present","Win! Don't win!",null,"gana","ganad",null,"gane","ganen","ganando","winning","ganado","won"]
["ganar","to win, gain, earn, get, acquire","Imperativo Negativo","Imperative Negative","Presente","Present","Win! Don't win!",null,"no ganes","no ganéis",null,"no gane","no ganen","ganando","winning","ganado","won"]
["ganar","to win, gain, earn, get, acquire","Indicativo","Indicative","Presente","Present","I win, am winning","gano","ganas","gana","ganamos","ganáis","ganan","ganando","winning","ganado","won"]
["ganar","to win, gain, earn, get, acquire","Indicativo","Indicative","Futuro","Future","I will win","ganaré","ganarás","ganará","ganaremos","ganaréis","ganarán","ganando","winning","ganado","won"]
["ganar","to win, gain, earn, get, acquire","Indicativo","Indicative","Imperfecto","Imperfect","I was winning, used to win, won","ganaba","ganabas","ganaba","ganábamos","ganabais","ganaban","ganando","winning","ganado","won"]
["ganar","to win, gain, earn, get, acquire","Indicativo","Indicative","Pretérito","Preterite","I won","gané","ganaste","ganó","ganamos","ganasteis","ganaron","ganando","winning","ganado","won"]
["ganar","to win, gain, earn, get, acquire","Indicativo","Indicative","Condicional","Conditional","I would win","ganaría","ganarías","ganaría","ganaríamos","ganaríais","ganarían","ganando","winning","ganado","won"]
["ganar","to win, gain, earn, get, acquire","Indicativo","Indicative","Presente perfecto","Present Perfect","I have won","he ganado","has ganado","ha ganado","hemos ganado","habéis ganado","han ganado","ganando","winning","ganado","won"]
["ganar","to win, gain, earn, get, acquire","Indicativo","Indicative","Futuro perfecto","Future Perfect","I will have won","habré ganado","habrás ganado","habrá ganado","habremos ganado","habréis ganado","habrán ganado","ganando","winning","ganado","won"]
["ganar","to win, gain, earn, get, acquire","Indicativo","Indicative","Pluscuamperfecto","Past Perfect","I had won","había ganado","habías ganado","había ganado","habíamos ganado","habíais ganado","habían ganado","ganando","winning","ganado","won"]
["ganar","to win, gain, earn, get, acquire","Indicativo","Indicative","Pretérito anterior","Preterite (Archaic)","I had won","hube ganado","hubiste ganado","hubo ganado","hubimos ganado","hubisteis ganado","hubieron ganado","ganando","winning","ganado","won"]
["ganar","to win, gain, earn, get, acquire","Indicativo","Indicative","Condicional perfecto","Conditional Perfect","I would have won","habría ganado","habrías ganado","habría ganado","habríamos ganado","habríais ganado","habrían ganado","ganando","winning","ganado","won"]
["ganar","to win, gain, earn, get, acquire","Subjuntivo","Subjunctive","Presente","Present","I win, am winning","gane","ganes","gane","ganemos","ganéis","ganen","ganando","winning","ganado","won"]
["ganar","to win, gain, earn, get, acquire","Subjuntivo","Subjunctive","Imperfecto","Imperfect","I won, was winning","ganara","ganaras","ganara","ganáramos","ganarais","ganaran","ganando","winning","ganado","won"]
["ganar","to win, gain, earn, get, acquire","Subjuntivo","Subjunctive","Futuro","Future","I will win","ganare","ganares","ganare","ganáremos","ganareis","ganaren","ganando","winning","ganado","won"]
["ganar","to win, gain, earn, get, acquire","Subjuntivo","Subjunctive","Presente perfecto","Present Perfect","I have won, won","haya ganado","hayas ganado","haya ganado","hayamos ganado","hayáis ganado","hayan ganado","ganando","winning","ganado","won"]
["ganar","to win, gain, earn, get, acquire","Subjuntivo","Subjunctive","Futuro perfecto","Future Perfect","I will have won","hubiere ganado","hubieres ganado","hubiere ganado","hubiéremos ganado","hubiereis ganado","hubieren ganado","ganando","winning","ganado","won"]
["ganar","to win, gain, earn, get, acquire","Subjuntivo","Subjunctive","Pluscuamperfecto","Past Perfect","I had won","hubiera ganado","hubieras ganado","hubiera ganado","hubiéramos ganado","hubierais ganado","hubieran ganado","ganando","winning","ganado","won"]
["guardar","to guard, watch over, protect, take care of; to keep, hold on to; to put away, store away","Imperativo Afirmativo","Imperative Affirmative","Presente","Present","Guard! Don't guard!",null,"guarda","guardad",null,"guarde","guarden","guardando","guarding","guardado","guarded"]
["guardar","to guard, watch over, protect, take care of; to keep, hold on to; to put away, store away","Imperativo Negativo","Imperative Negative","Presente","Present","Guard! Don't guard!",null,"no guardes","no guardéis",null,"no guarde","no guarden","guardando","guarding","guardado","guarded"]
["guardar","to guard, watch over, protect, take care of; to keep, hold on to; to put away, store away","Indicativo","Indicative","Presente","Present","I guard, am guarding","guardo","guardas","guarda","guardamos","guardáis","guardan","guardando","guarding","guardado","guarded"]
["guardar","to guard, watch over, protect, take care of; to keep, hold on to; to put away, store away","Indicativo","Indicative","Futuro","Future","I will guard","guardaré","guardarás","guardará","guardaremos","guardaréis","guardarán","guardando","guarding","guardado","guarded"]
["guardar","to guard, watch over, protect, take care of; to keep, hold on to; to put away, store away","Indicativo","Indicative","Imperfecto","Imperfect","I was guarding, used to guard, guarded","guardaba","guardabas","guardaba","guardábamos","guardabais","guardaban","guardando","guarding","guardado","guarded"]
["guardar","to guard, watch over, protect, take care of; to keep, hold on to; to put away, store away","Indicativo","Indicative","Pretérito","Preterite","I guarded","guardé","guardaste","guardó","guardamos","guardasteis","guardaron","guardando","guarding","guardado","guarded"]
["guardar","to guard, watch over, protect, take care of; to keep, hold on to; to put away, store away","Indicativo","Indicative","Condicional","Conditional","I would guard","guardaría","guardarías","guardaría","guardaríamos","guardaríais","guardarían","guardando","guarding","guardado","guarded"]
["guardar","to guard, watch over, protect, take care of; to keep, hold on to; to put away, store away","Indicativo","Indicative","Presente perfecto","Present Perfect","I have guarded","he guardado","has guardado","ha guardado","hemos guardado","habéis guardado","han guardado","guardando","guarding","guardado","guarded"]
["guardar","to guard, watch over, protect, take care of; to keep, hold on to; to put away, store away","Indicativo","Indicative","Futuro perfecto","Future Perfect","I will have guarded","habré guardado","habrás guardado","habrá guardado","habremos guardado","habréis guardado","habrán guardado","guardando","guarding","guardado","guarded"]
["guardar","to guard, watch over, protect, take care of; to keep, hold on to; to put away, store away","Indicativo","Indicative","Pluscuamperfecto","Past Perfect","I had guarded","había guardado","habías guardado","había guardado","habíamos guardado","habíais guardado","habían guardado","guardando","guarding","guardado","guarded"]
["guardar","to guard, watch over, protect, take care of; to keep, hold on to; to put away, store away","Indicativo","Indicative","Pretérito anterior","Preterite (Archaic)","I had guarded","hube guardado","hubiste guardado","hubo guardado","hubimos guardado","hubisteis guardado","hubieron guardado","guardando","guarding","guardado","guarded"]
["guardar","to guard, watch over, protect, take care of; to keep, hold on to; to put away, store away","Indicativo","Indicative","Condicional perfecto","Conditional Perfect","I would have guarded","habría guardado","habrías guardado","habría guardado","habríamos guardado","habríais guardado","habrían guardado","guardando","guarding","guardado","guarded"]
["guardar","to guard, watch over, protect, take care of; to keep, hold on to; to put away, store away","Subjuntivo","Subjunctive","Presente","Present","I guard, am guarding","guarde","guardes","guarde","guardemos","guardéis","guarden","guardando","guarding","guardado","guarded"]
["guardar","to guard, watch over, protect, take care of; to keep, hold on to; to put away, store away","Subjuntivo","Subjunctive","Imperfecto","Imperfect","I guarded, was guarding","guardara","guardaras","guardara","guardáramos","guardarais","guardaran","guardando","guarding","guardado","guarded"]
["guardar","to guard, watch over, protect, take care of; to keep, hold on to; to put away, store away","Subjuntivo","Subjunctive","Futuro","Future","I will guard","guardare","guardares","guardare","guardáremos","guardareis","guardaren","guardando","guarding","guardado","guarded"]
["guardar","to guard, watch over, protect, take care of; to keep, hold on to; to put away, store away","Subjuntivo","Subjunctive","Presente perfecto","Present Perfect","I have guarded, guarded","haya guardado","hayas guardado","haya guardado","hayamos guardado","hayáis guardado","hayan guardado","guardando","guarding","guardado","guarded"]
["guardar","to guard, watch over, protect, take care of; to keep, hold on to; to put away, store away","Subjuntivo","Subjunctive","Futuro perfecto","Future Perfect","I will have guarded","hubiere guardado","hubieres guardado","hubiere guardado","hubiéremos guardado","hubiereis guardado","hubieren guardado","guardando","guarding","guardado","guarded"]
["guardar","to guard, watch over, protect, take care of; to keep, hold on to; to put away, store away","Subjuntivo","Subjunctive","Pluscuamperfecto","Past Perfect","I had guarded","hubiera guardado","hubieras guardado","hubiera guardado","hubiéramos guardado","hubierais guardado","hubieran guardado","guardando","guarding","guardado","guarded"]
["gustar","to please, be pleasing","Imperativo Afirmativo","Imperative Affirmative","Presente","Present","Please! Don't please!",null,"gusta","gustad",null,"guste","gusten","gustando","pleasing","gustado","pleased"]
["gustar","to please, be pleasing","Imperativo Negativo","Imperative Negative","Presente","Present","Please! Don't please!",null,"no gustes","no gustéis",null,"no guste","no gusten","gustando","pleasing","gustado","pleased"]
["gustar","to please, be pleasing","Indicativo","Indicative","Presente","Present","I please, am pleasing","gusto","gustas","gusta","gustamos","gustáis","gustan","gustando","pleasing","gustado","pleased"]
["gustar","to please, be pleasing","Indicativo","Indicative","Futuro","Future","I will please","gustaré","gustarás","gustará","gustaremos","gustaréis","gustarán","gustando","pleasing","gustado","pleased"]
["gustar","to please, be pleasing","Indicativo","Indicative","Imperfecto","Imperfect","I was pleasing, used to please, pleased","gustaba","gustabas","gustaba","gustábamos","gustabais","gustaban","gustando","pleasing","gustado","pleased"]
["gustar","to please, be pleasing","Indicativo","Indicative","Pretérito","Preterite","I pleased","gusté","gustaste","gustó","gustamos","gustasteis","gustaron","gustando","pleasing","gustado","pleased"]
["gustar","to please, be pleasing","Indicativo","Indicative","Condicional","Conditional","I would please","gustaría","gustarías","gustaría","gustaríamos","gustaríais","gustarían","gustando","pleasing","gustado","pleased"]
["gustar","to please, be pleasing","Indicativo","Indicative","Presente perfecto","Present Perfect","I have pleased","he gustado","has gustado","ha gustado","hemos gustado","habéis gustado","han gustado","gustando","pleasing","gustado","pleased"]
["gustar","to please, be pleasing","Indicativo","Indicative","Futuro perfecto","Future Perfect","I will have pleased","habré gustado","habrás gustado","habrá gustado","habremos gustado","habréis gustado","habrán gustado","gustando","pleasing","gustado","pleased"]
["gustar","to please, be pleasing","Indicativo","Indicative","Pluscuamperfecto","Past Perfect","I had pleased","había gustado","habías gustado","había gustado","habíamos gustado","habíais gustado","habían gustado","gustando","pleasing","gustado","pleased"]
["gustar","to please, be pleasing","Indicativo","Indicative","Pretérito anterior","Preterite (Archaic)","I had pleased","hube gustado","hubiste gustado","hubo gustado","hubimos gustado","hubisteis gustado","hubieron gustado","gustando","pleasing","gustado","pleased"]
["gustar","to please, be pleasing","Indicativo","Indicative","Condicional perfecto","Conditional Perfect","I would have pleased","habría gustado","habrías gustado","habría gustado","habríamos gustado","habríais gustado","habrían gustado","gustando","pleasing","gustado","pleased"]
["gustar","to please, be pleasing","Subjuntivo","Subjunctive","Presente","Present","I please, am pleasing","guste","gustes","guste","gustemos","gustéis","gusten","gustando","pleasing","gustado","pleased"]
["gustar","to please, be pleasing","Subjuntivo","Subjunctive","Imperfecto","Imperfect","I pleased, was pleasing","gustara","gustaras","gustara","gustáramos","gustarais","gustaran","gustando","pleasing","gustado","pleased"]
["gustar","to please, be pleasing","Subjuntivo","Subjunctive","Futuro","Future","I will please","gustare","gustares","gustare","gustáremos","gustareis","gustaren","gustando","pleasing","gustado","pleased"]
["gustar","to please, be pleasing","Subjuntivo","Subjunctive","Presente perfecto","Present Perfect","I have pleased, pleased","haya gustado","hayas gustado","haya gustado","hayamos gustado","hayáis gustado","hayan gustado","gustando","pleasing","gustado","pleased"]
["gustar","to please, be pleasing","Subjuntivo","Subjunctive","Futuro perfecto","Future Perfect","I will have pleased","hubiere gustado","hubieres gustado","hubiere gustado","hubiéremos gustado","hubiereis gustado","hubieren gustado","gustando","pleasing","gustado","pleased"]
["gustar","to please, be pleasing","Subjuntivo","Subjunctive","Pluscuamperfecto","Past Perfect","I had pleased","hubiera gustado","hubieras gustado","hubiera gustado","hubiéramos gustado","hubierais gustado","hubieran gustado","gustando","pleasing","gustado","pleased"]
["haber","to have (done)","Imperativo Afirmativo","Imperative Affirmative","Presente","Present",null,"N/A","he","haya","hayamos","habed","hayan","habiendo",null,"habido"]
["haber","to have (done)","Imperativo Negativo","Imperative Negative","Presente","Present",null,"N/A","no hayas","no haya","no hayamos","no hayáis","no hayan","habiendo",null,"habido"]
["haber","to have (done)","Indicativo","Indicative","Presente","Present",null,"he","has","ha/hay","hemos","habéis","han","habiendo",null,"habido"]
["haber","to have (done)","Indicativo","Indicative","Futuro","Future",null,"habré","habrás","habrá","habremos","habréis","habrán","habiendo",null,"habido"]
["haber","to have (done)","Indicativo","Indicative","Imperfecto","Imperfect",null,"había","habías","había","habíamos","habíais","habían","habiendo",null,"habido"]
["haber","to have (done)","Indicativo","Indicative","Pretérito","Preterite",null,"hube","hubiste","hubo","hubimos","hubisteis","hubieron","habiendo",null,"habido"]
["haber","to have (done)","Indicativo","Indicative","Condicional","Conditional",null,"habría","habrías","habría","habríamos","habríais","habrían","habiendo",null,"habido"]
["haber","to have (done)","Indicativo","Indicative","Presente perfecto","Present Perfect",null,"he habido","has habido","ha habido","hemos habido","habéis habido","han habido","habiendo",null,"habido"]
["haber","to have (done)","Indicativo","Indicative","Futuro perfecto","Future Perfect",null,"habré habido","habrás habido","habrá habido","habremos habido","habréis habido","habrán habido","habiendo",null,"habido"]
["haber","to have (done)","Indicativo","Indicative","Pluscuamperfecto","Past Perfect",null,"había habido","habías habido","había habido","habíamos habido","habíais habido","habían habido","habiendo",null,"habido"]
["haber","to have (done)","Indicativo","Indicative","Pretérito anterior","Preterite (Archaic)",null,"hube habido","hubiste habido","hubo habido","hubimos habido","hubisteis habido","hubieron habido","habiendo",null,"habido"]
["haber","to have (done)","Indicativo","Indicative","Condicional perfecto","Conditional Perfect",null,"habría habido","habrías habido","habría habido","habríamos habido","habríais habido","habrían habido","habiendo",null,"habido"]
["haber","to have (done)","Subjuntivo","Subjunctive","Presente","Present",null,"haya","hayas","haya","hayamos","hayáis","hayan","habiendo",null,"habido"]
["haber","to have (done)","Subjuntivo","Subjunctive","Imperfecto","Imperfect",null,"hubiera, hubiese","hubieras, hubieses","hubiera, hubiese","hubiéramos, hubiésemos","hubierais, hubieseis","hubieran, hubiesen","habiendo",null,"habido"]
["haber","to have (done)","Subjuntivo","Subjunctive","Futuro","Future",null,"hubiere","hubieres","hubiere","hubiéremos","hubiereis","hubieren","habiendo",null,"habido"]
["haber","to have (done)","Subjuntivo","Subjunctive","Presente perfecto","Present Perfect",null,"haya habido","hayas habido","haya habido","hayamos habido","hayáis habido","hayan habido","habiendo",null,"habido"]
["haber","to have (done)","Subjuntivo","Subjunctive","Futuro perfecto","Future Perfect",null,"hubiere habido","hubieres habido","hubiere habido","hubiéremos habido","hubiereis habido","hubieren habido","habiendo",null,"habido"]
["haber","to have (done)","Subjuntivo","Subjunctive","Pluscuamperfecto","Past Perfect",null,"hubiera habido, hubiese habido","hubieras habido, hubieses habido","hubiera habido, hubiese habido","hubiéramos habido, hubiésemos habido","hubierais habido, hubieseis habido","hubieran habido, hubiesen habido","habiendo",null,"habido"]
["hablar","to speak/talk","Imperativo Afirmativo","Imperative Affirmative","Presente","Present","Speak! Don't speak!",null,"habla","hablad",null,"hable","hablen","hablando","speaking","hablado","spoken"]
["hablar","to speak/talk","Imperativo Negativo","Imperative Negative","Presente","Present","Speak! Don't speak!",null,"no hables","no habléis",null,"no hable","no hablen","hablando","speaking","hablado","spoken"]
["hablar","to speak/talk","Indicativo","Indicative","Presente","Present","I speak, am speaking","hablo","hablas","habla","hablamos","habláis","hablan","hablando","speaking","hablado","spoken"]
["hablar","to speak/talk","Indicativo","Indicative","Futuro","Future","I will speak","hablaré","hablarás","hablará","hablaremos","hablaréis","hablarán","hablando","speaking","hablado","spoken"]
["hablar","to speak/talk","Indicativo","Indicative","Imperfecto","Imperfect","I was speaking, used to speak, spoke","hablaba","hablabas","hablaba","hablábamos","hablabais","hablaban","hablando","speaking","hablado","spoken"]
["hablar","to speak/talk","Indicativo","Indicative","Pretérito","Preterite","I spoke","hablé","hablaste","habló","hablamos","hablasteis","hablaron","hablando","speaking","hablado","spoken"]
["hablar","to speak/talk","Indicativo","Indicative","Condicional","Conditional","I would speak","hablaría","hablarías","hablaría","hablaríamos","hablaríais","hablarían","hablando","speaking","hablado","spoken"]
["hablar","to speak/talk","Indicativo","Indicative","Presente perfecto","Present Perfect","I have spoken","he hablado","has hablado","ha hablado","hemos hablado","habéis hablado","han hablado","hablando","speaking","hablado","spoken"]
["hablar","to speak/talk","Indicativo","Indicative","Futuro perfecto","Future Perfect","I will have spoken","habré hablado","habrás hablado","habrá hablado","habremos hablado","habréis hablado","habrán hablado","hablando","speaking","hablado","spoken"]
["hablar","to speak/talk","Indicativo","Indicative","Pluscuamperfecto","Past Perfect","I had spoken","había hablado","habías hablado","había hablado","habíamos hablado","habíais hablado","habían hablado","hablando","speaking","hablado","spoken"]
["hablar","to speak/talk","Indicativo","Indicative","Pretérito anterior","Preterite (Archaic)","I had spoken","hube hablado","hubiste hablado","hubo hablado","hubimos hablado","hubisteis hablado","hubieron hablado","hablando","speaking","hablado","spoken"]
["hablar","to speak/talk","Indicativo","Indicative","Condicional perfecto","Conditional Perfect","I would have spoken","habría hablado","habrías hablado","habría hablado","habríamos hablado","habríais hablado","habrían hablado","hablando","speaking","hablado","spoken"]
["hablar","to speak/talk","Subjuntivo","Subjunctive","Presente","Present","I speak, am speaking","hable","hables","hable","hablemos","habléis","hablen","hablando","speaking","hablado","spoken"]
["hablar","to speak/talk","Subjuntivo","Subjunctive","Imperfecto","Imperfect","I spoke, was speaking","hablara","hablaras","hablara","habláramos","hablarais","hablaran","hablando","speaking","hablado","spoken"]
["hablar","to speak/talk","Subjuntivo","Subjunctive","Futuro","Future","I will speak","hablare","hablares","hablare","habláremos","hablareis","hablaren","hablando","speaking","hablado","spoken"]
["hablar","to speak/talk","Subjuntivo","Subjunctive","Presente perfecto","Present Perfect","I have spoken, spoke","haya hablado","hayas hablado","haya hablado","hayamos hablado","hayáis hablado","hayan hablado","hablando","speaking","hablado","spoken"]
["hablar","to speak/talk","Subjuntivo","Subjunctive","Futuro perfecto","Future Perfect","I will have spoken","hubiere hablado","hubieres hablado","hubiere hablado","hubiéremos hablado","hubiereis hablado","hubieren hablado","hablando","speaking","hablado","spoken"]
["hablar","to speak/talk","Subjuntivo","Subjunctive","Pluscuamperfecto","Past Perfect","I had spoken","hubiera hablado","hubieras hablado","hubiera hablado","hubiéramos hablado","hubierais hablado","hubieran hablado","hablando","speaking","hablado","spoken"]
["hacer","to do, make","Imperativo Afirmativo","Imperative Affirmative","Presente","Present","Do! Don't do!",null,"haz","haced",null,"haga","hagan","haciendo","doing","hecho","done"]
["hacer","to do, make","Imperativo Negativo","Imperative Negative","Presente","Present","Do! Don't do!",null,"no hagas","no hagáis",null,"no haga","no hagan","haciendo","doing","hecho","done"]
["hacer","to do, make","Indicativo","Indicative","Presente","Present","I do, am doing","hago","haces","hace","hacemos","hacéis","hacen","haciendo","doing","hecho","done"]
["hacer","to do, make","Indicativo","Indicative","Futuro","Future","I will do","haré","harás","hará","haremos","haréis","harán","haciendo","doing","hecho","done"]
["hacer","to do, make","Indicativo","Indicative","Imperfecto","Imperfect","I was doing, used to do, did","hacía","hacías","hacía","hacíamos","hacíais","hacían","haciendo","doing","hecho","done"]
["hacer","to do, make","Indicativo","Indicative","Pretérito","Preterite","I did","hice","hiciste","hizo","hicimos","hicisteis","hicieron","haciendo","doing","hecho","done"]
["hacer","to do, make","Indicativo","Indicative","Condicional","Conditional","I would do","haría","harías","haría","haríamos","haríais","harían","haciendo","doing","hecho","done"]
["hacer","to do, make","Indicativo","Indicative","Presente perfecto","Present Perfect","I have done","he hecho","has hecho","ha hecho","hemos hecho","habéis hecho","han hecho","haciendo","doing","hecho","done"]
["hacer","to do, make","Indicativo","Indicative","Futuro perfecto","Future Perfect","I will have done","habré hecho","habrás hecho","habrá hecho","habremos hecho","habréis hecho","habrán hecho","haciendo","doing","hecho","done"]
["hacer","to do, make","Indicativo","Indicative","Pluscuamperfecto","Past Perfect","I had done","había hecho","habías hecho","había hecho","habíamos hecho","habíais hecho","habían hecho","haciendo","doing","hecho","done"]
["hacer","to do, make","Indicativo","Indicative","Pretérito anterior","Preterite (Archaic)","I had done","hube hecho","hubiste hecho","hubo hecho","hubimos hecho","hubisteis hecho","hubieron hecho","haciendo","doing","hecho","done"]
["hacer","to do, make","Indicativo","Indicative","Condicional perfecto","Conditional Perfect","I would have done","habría hecho","habrías hecho","habría hecho","habríamos hecho","habríais hecho","habrían hecho","haciendo","doing","hecho","done"]
["hacer","to do, make","Subjuntivo","Subjunctive","Presente","Present","I do, am doing","haga","hagas","haga","hagamos","hagáis","hagan","haciendo","doing","hecho","done"]
["hacer","to do, make","Subjuntivo","Subjunctive","Imperfecto","Imperfect","I did, was doing","hiciera","hicieras","hiciera","hiciéramos","hicierais","hicieran","haciendo","doing","hecho","done"]
["hacer","to do, make","Subjuntivo","Subjunctive","Futuro","Future","I will do","hiciere","hicieres","hiciere","hiciéremos","hiciereis","hicieren","haciendo","doing","hecho","done"]
["hacer","to do, make","Subjuntivo","Subjunctive","Presente perfecto","Present Perfect","I have done, did","haya hecho","hayas hecho","haya hecho","hayamos hecho","hayáis hecho","hayan hecho","haciendo","doing","hecho","done"]
["hacer","to do, make","Subjuntivo","Subjunctive","Futuro perfecto","Future Perfect","I will have done","hubiere hecho","hubieres hecho","hubiere hecho","hubiéremos hecho","hubiereis hecho","hubieren hecho","haciendo","doing","hecho","done"]
["hacer","to do, make","Subjuntivo","Subjunctive","Pluscuamperfecto","Past Perfect","I had done","hubiera hecho","hubieras hecho","hubiera hecho","hubiéramos hecho","hubierais hecho","hubieran hecho","haciendo","doing","hecho","done"]
["importar","to import","Imperativo Afirmativo","Imperative Affirmative","Presente","Present","Import! Don't import!",null,"importa","importad",null,"importe","importen","importando","importing","importado","imported"]
["importar","to import","Imperativo Negativo","Imperative Negative","Presente","Present","Import! Don't import!",null,"no importes","no importéis",null,"no importe","no importen","importando","importing","importado","imported"]
["importar","to import","Indicativo","Indicative","Presente","Present","I import, am importing","importo","importas","importa","importamos","importáis","importan","importando","importing","importado","imported"]
["importar","to import","Indicativo","Indicative","Futuro","Future","I will import","importaré","importarás","importará","importaremos","importaréis","importarán","importando","importing","importado","imported"]
["importar","to import","Indicativo","Indicative","Imperfecto","Imperfect","I was importing, used to import, imported","importaba","importabas","importaba","importábamos","importabais","importaban","importando","importing","importado","imported"]
["importar","to import","Indicativo","Indicative","Pretérito","Preterite","I imported","importé","importaste","importó","importamos","importasteis","importaron","importando","importing","importado","imported"]
["importar","to import","Indicativo","Indicative","Condicional","Conditional","I would import","importaría","importarías","importaría","importaríamos","importaríais","importarían","importando","importing","importado","imported"]
["importar","to import","Indicativo","Indicative","Presente perfecto","Present Perfect","I have imported","he importado","has importado","ha importado","hemos importado","habéis importado","han importado","importando","importing","importado","imported"]
["importar","to import","Indicativo","Indicative","Futuro perfecto","Future Perfect","I will have imported","habré importado","habrás importado","habrá importado","habremos importado","habréis importado","habrán importado","importando","importing","importado","imported"]
["importar","to import","Indicativo","Indicative","Pluscuamperfecto","Past Perfect","I had imported","había importado","habías importado","había importado","habíamos importado","habíais importado","habían importado","importando","importing","importado","imported"]
["importar","to import","Indicativo","Indicative","Pretérito anterior","Preterite (Archaic)","I had imported","hube importado","hubiste importado","hubo importado","hubimos importado","hubisteis importado","hubieron importado","importando","importing","importado","imported"]
["importar","to import","Indicativo","Indicative","Condicional perfecto","Conditional Perfect","I would have imported","habría importado","habrías importado","habría importado","habríamos importado","habríais importado","habrían importado","importando","importing","importado","imported"]
["importar","to import","Subjuntivo","Subjunctive","Presente","Present","I import, am importing","importe","importes","importe","importemos","importéis","importen","importando","importing","importado","imported"]
["importar","to import","Subjuntivo","Subjunctive","Imperfecto","Imperfect","I imported, was importing","importara","importaras","importara","importáramos","importarais","importaran","importando","importing","importado","imported"]
["importar","to import","Subjuntivo","Subjunctive","Futuro","Future","I will import","importare","importares","importare","importáremos","importareis","importaren","importando","importing","importado","imported"]
["importar","to import","Subjuntivo","Subjunctive","Presente perfecto","Present Perfect","I have imported, imported","haya importado","hayas importado","haya importado","hayamos importado","hayáis importado","hayan importado","importando","importing","importado","imported"]
["importar","to import","Subjuntivo","Subjunctive","Futuro perfecto","Future Perfect","I will have imported","hubiere importado","hubieres importado","hubiere importado","hubiéremos importado","hubiereis importado","hubieren importado","importando","importing","importado","imported"]
["importar","to import","Subjuntivo","Subjunctive","Pluscuamperfecto","Past Perfect","I had imported","hubiera importado","hubieras importado","hubiera importado","hubiéramos importado","hubierais importado","hubieran importado","importando","importing","importado","imported"]
["incluir","to include","Imperativo Afirmativo","Imperative Affirmative","Presente","Present","Include! Don't include!",null,"incluye","incluid",null,"incluya","incluyan","incluyendo","including","incluido","included"]
["incluir","to include","Imperativo Negativo","Imperative Negative","Presente","Present","Include! Don't include!",null,"no incluyas","no incluyáis",null,"no incluya","no incluyan","incluyendo","including","incluido","included"]
["incluir","to include","Indicativo","Indicative","Presente","Present","I include, am including","incluyo","incluyes","incluye","incluimos","incluís","incluyen","incluyendo","including","incluido","included"]
["incluir","to include","Indicativo","Indicative","Futuro","Future","I will include","incluiré","incluirás","incluirá","incluiremos","incluiréis","incluirán","incluyendo","including","incluido","included"]
["incluir","to include","Indicativo","Indicative","Imperfecto","Imperfect","I was including, used to include, included","incluía","incluías","incluía","incluíamos","incluíais","incluían","incluyendo","including","incluido","included"]
["incluir","to include","Indicativo","Indicative","Pretérito","Preterite","I included","incluí","incluiste","incluyó","incluimos","incluisteis","incluyeron","incluyendo","including","incluido","included"]
["incluir","to include","Indicativo","Indicative","Condicional","Conditional","I would include","incluiría","incluirías","incluiría","incluiríamos","incluiríais","incluirían","incluyendo","including","incluido","included"]
["incluir","to include","Indicativo","Indicative","Presente perfecto","Present Perfect","I have included","he incluido","has incluido","ha incluido","hemos incluido","habéis incluido","han incluido","incluyendo","including","incluido","included"]
["incluir","to include","Indicativo","Indicative","Futuro perfecto","Future Perfect","I will have included","habré incluido","habrás incluido","habrá incluido","habremos incluido","habréis incluido","habrán incluido","incluyendo","including","incluido","included"]
["incluir","to include","Indicativo","Indicative","Pluscuamperfecto","Past Perfect","I had included","había incluido","habías incluido","había incluido","habíamos incluido","habíais incluido","habían incluido","incluyendo","including","incluido","included"]
["incluir","to include","Indicativo","Indicative","Pretérito anterior","Preterite (Archaic)","I had included","hube incluido","hubiste incluido","hubo incluido","hubimos incluido","hubisteis incluido","hubieron incluido","incluyendo","including","incluido","included"]
["incluir","to include","Indicativo","Indicative","Condicional perfecto","Conditional Perfect","I would have included","habría incluido","habrías incluido","habría incluido","habríamos incluido","habríais incluido","habrían incluido","incluyendo","including","incluido","included"]
["incluir","to include","Subjuntivo","Subjunctive","Presente","Present","I include, am including","incluya","incluyas","incluya","incluyamos","incluyáis","incluyan","incluyendo","including","incluido","included"]
["incluir","to include","Subjuntivo","Subjunctive","Imperfecto","Imperfect","I included, was including","incluyera","incluyeras","incluyera","incluyéramos","incluyerais","incluyeran","incluyendo","including","incluido","included"]
["incluir","to include","Subjuntivo","Subjunctive","Futuro","Future","I will include","incluyere","incluyeres","incluyere","incluyéremos","incluyereis","incluyeren","incluyendo","including","incluido","included"]
["incluir","to include","Subjuntivo","Subjunctive","Presente perfecto","Present Perfect","I have included, included","haya incluido","hayas incluido","haya incluido","hayamos incluido","hayáis incluido","hayan incluido","incluyendo","including","incluido","included"]
["incluir","to include","Subjuntivo","Subjunctive","Futuro perfecto","Future Perfect","I will have included","hubiere incluido","hubieres incluido","hubiere incluido","hubiéremos incluido","hubiereis incluido","hubieren incluido","incluyendo","including","incluido","included"]
["incluir","to include","Subjuntivo","Subjunctive","Pluscuamperfecto","Past Perfect","I had included","hubiera incluido","hubieras incluido","hubiera incluido","hubiéramos incluido","hubierais incluido","hubieran incluido","incluyendo","including","incluido","included"]
["indicar","to indicate","Imperativo Afirmativo","Imperative Affirmative","Presente","Present","Indicate! Don't indicate!",null,"indica","indicad",null,"indique","indiquen","indicando","indicating","indicado","indicated"]
["indicar","to indicate","Imperativo Negativo","Imperative Negative","Presente","Present","Indicate! Don't indicate!",null,"no indiques","no indiquéis",null,"no indique","no indiquen","indicando","indicating","indicado","indicated"]
["indicar","to indicate","Indicativo","Indicative","Presente","Present","I indicate, am indicating","indico","indicas","indica","indicamos","indicáis","indican","indicando","indicating","indicado","indicated"]
["indicar","to indicate","Indicativo","Indicative","Futuro","Future","I will indicate","indicaré","indicarás","indicará","indicaremos","indicaréis","indicarán","indicando","indicating","indicado","indicated"]
["indicar","to indicate","Indicativo","Indicative","Imperfecto","Imperfect","I was indicating, used to indicate, indicated","indicaba","indicabas","indicaba","indicábamos","indicabais","indicaban","indicando","indicating","indicado","indicated"]
["indicar","to indicate","Indicativo","Indicative","Pretérito","Preterite","I indicated","indiqué","indicaste","indicó","indicamos","indicasteis","indicaron","indicando","indicating","indicado","indicated"]
["indicar","to indicate","Indicativo","Indicative","Condicional","Conditional","I would indicate","indicaría","indicarías","indicaría","indicaríamos","indicaríais","indicarían","indicando","indicating","indicado","indicated"]
["indicar","to indicate","Indicativo","Indicative","Presente perfecto","Present Perfect","I have indicated","he indicado","has indicado","ha indicado","hemos indicado","habéis indicado","han indicado","indicando","indicating","indicado","indicated"]
["indicar","to indicate","Indicativo","Indicative","Futuro perfecto","Future Perfect","I will have indicated","habré indicado","habrás indicado","habrá indicado","habremos indicado","habréis indicado","habrán indicado","indicando","indicating","indicado","indicated"]
["indicar","to indicate","Indicativo","Indicative","Pluscuamperfecto","Past Perfect","I had indicated","había indicado","habías indicado","había indicado","habíamos indicado","habíais indicado","habían indicado","indicando","indicating","indicado","indicated"]
["indicar","to indicate","Indicativo","Indicative","Pretérito anterior","Preterite (Archaic)","I had indicated","hube indicado","hubiste indicado","hubo indicado","hubimos indicado","hubisteis indicado","hubieron indicado","indicando","indicating","indicado","indicated"]
["indicar","to indicate","Indicativo","Indicative","Condicional perfecto","Conditional Perfect","I would have indicated","habría indicado","habrías indicado","habría indicado","habríamos indicado","habríais indicado","habrían indicado","indicando","indicating","indicado","indicated"]
["indicar","to indicate","Subjuntivo","Subjunctive","Presente","Present","I indicate, am indicating","indique","indiques","indique","indiquemos","indiquéis","indiquen","indicando","indicating","indicado","indicated"]
["indicar","to indicate","Subjuntivo","Subjunctive","Imperfecto","Imperfect","I indicated, was indicating","indicara","indicaras","indicara","indicáramos","indicarais","indicaran","indicando","indicating","indicado","indicated"]
["indicar","to indicate","Subjuntivo","Subjunctive","Futuro","Future","I will indicate","indicare","indicares","indicare","indicáremos","indicareis","indicaren","indicando","indicating","indicado","indicated"]
["indicar","to indicate","Subjuntivo","Subjunctive","Presente perfecto","Present Perfect","I have indicated, indicated","haya indicado","hayas indicado","haya indicado","hayamos indicado","hayáis indicado","hayan indicado","indicando","indicating","indicado","indicated"]
["indicar","to indicate","Subjuntivo","Subjunctive","Futuro perfecto","Future Perfect","I will have indicated","hubiere indicado","hubieres indicado","hubiere indicado","hubiéremos indicado","hubiereis indicado","hubieren indicado","indicando","indicating","indicado","indicated"]
["indicar","to indicate","Subjuntivo","Subjunctive","Pluscuamperfecto","Past Perfect","I had indicated","hubiera indicado","hubieras indicado","hubiera indicado","hubiéramos indicado","hubierais indicado","hubieran indicado","indicando","indicating","indicado","indicated"]
["iniciar","to initiate, begin, start","Imperativo Afirmativo","Imperative Affirmative","Presente","Present","Initiate! Don't initiate!",null,"inicia","iniciad",null,"inicie","inicien","iniciando","initiating","iniciado","initiated"]
["iniciar","to initiate, begin, start","Imperativo Negativo","Imperative Negative","Presente","Present","Initiate! Don't initiate!",null,"no inicies","no iniciéis",null,"no inicie","no inicien","iniciando","initiating","iniciado","initiated"]
["iniciar","to initiate, begin, start","Indicativo","Indicative","Presente","Present","I initiate, am initiating","inicio","inicias","inicia","iniciamos","iniciáis","inician","iniciando","initiating","iniciado","initiated"]
["iniciar","to initiate, begin, start","Indicativo","Indicative","Futuro","Future","I will initiate","iniciaré","iniciarás","iniciará","iniciaremos","iniciaréis","iniciarán","iniciando","initiating","iniciado","initiated"]
["iniciar","to initiate, begin, start","Indicativo","Indicative","Imperfecto","Imperfect","I was initiating, used to initiate, initiated","iniciaba","iniciabas","iniciaba","iniciábamos","iniciabais","iniciaban","iniciando","initiating","iniciado","initiated"]
["iniciar","to initiate, begin, start","Indicativo","Indicative","Pretérito","Preterite","I initiated","inicié","iniciaste","inició","iniciamos","iniciasteis","iniciaron","iniciando","initiating","iniciado","initiated"]
["iniciar","to initiate, begin, start","Indicativo","Indicative","Condicional","Conditional","I would initiate","iniciaría","iniciarías","iniciaría","iniciaríamos","iniciaríais","iniciarían","iniciando","initiating","iniciado","initiated"]
["iniciar","to initiate, begin, start","Indicativo","Indicative","Presente perfecto","Present Perfect","I have initiated","he iniciado","has iniciado","ha iniciado","hemos iniciado","habéis iniciado","han iniciado","iniciando","initiating","iniciado","initiated"]
["iniciar","to initiate, begin, start","Indicativo","Indicative","Futuro perfecto","Future Perfect","I will have initiated","habré iniciado","habrás iniciado","habrá iniciado","habremos iniciado","habréis iniciado","habrán iniciado","iniciando","initiating","iniciado","initiated"]
["iniciar","to initiate, begin, start","Indicativo","Indicative","Pluscuamperfecto","Past Perfect","I had initiated","había iniciado","habías iniciado","había iniciado","habíamos iniciado","habíais iniciado","habían iniciado","iniciando","initiating","iniciado","initiated"]
["iniciar","to initiate, begin, start","Indicativo","Indicative","Pretérito anterior","Preterite (Archaic)","I had initiated","hube iniciado","hubiste iniciado","hubo iniciado","hubimos iniciado","hubisteis iniciado","hubieron iniciado","iniciando","initiating","iniciado","initiated"]
["iniciar","to initiate, begin, start","Indicativo","Indicative","Condicional perfecto","Conditional Perfect","I would have initiated","habría iniciado","habrías iniciado","habría iniciado","habríamos iniciado","habríais iniciado","habrían iniciado","iniciando","initiating","iniciado","initiated"]
["iniciar","to initiate, begin, start","Subjuntivo","Subjunctive","Presente","Present","I initiate, am initiating","inicie","inicies","inicie","iniciemos","iniciéis","inicien","iniciando","initiating","iniciado","initiated"]
["iniciar","to initiate, begin, start","Subjuntivo","Subjunctive","Imperfecto","Imperfect","I initiated, was initiating","iniciara","iniciaras","iniciara","iniciáramos","iniciarais","iniciaran","iniciando","initiating","iniciado","initiated"]
["iniciar","to initiate, begin, start","Subjuntivo","Subjunctive","Futuro","Future","I will initiate","iniciare","iniciares","iniciare","iniciáremos","iniciareis","iniciaren","iniciando","initiating","iniciado","initiated"]
["iniciar","to initiate, begin, start","Subjuntivo","Subjunctive","Presente perfecto","Present Perfect","I have initiated, initiated","haya iniciado","hayas iniciado","haya iniciado","hayamos iniciado","hayáis iniciado","hayan iniciado","iniciando","initiating","iniciado","initiated"]
["iniciar","to initiate, begin, start","Subjuntivo","Subjunctive","Futuro perfecto","Future Perfect","I will have initiated","hubiere iniciado","hubieres iniciado","hubiere iniciado","hubiéremos iniciado","hubiereis iniciado","hubieren iniciado","iniciando","initiating","iniciado","initiated"]
["iniciar","to initiate, begin, start","Subjuntivo","Subjunctive","Pluscuamperfecto","Past Perfect","I had initiated","hubiera iniciado","hubieras iniciado","hubiera iniciado","hubiéramos iniciado","hubierais iniciado","hubieran iniciado","iniciando","initiating","iniciado","initiated"]
["insistir","to insist","Imperativo Afirmativo","Imperative Affirmative","Presente","Present","Insist! Don't insist!",null,"insiste","insistid",null,"insista","insistan","insistiendo","insisting","insistido","insisted"]
["insistir","to insist","Imperativo Negativo","Imperative Negative","Presente","Present","Insist! Don't insist!",null,"no insistas","no insistáis",null,"no insista","no insistan","insistiendo","insisting","insistido","insisted"]
["insistir","to insist","Indicativo","Indicative","Presente","Present","I insist, am insisting","insisto","insistes","insiste","insistimos","insistís","insisten","insistiendo","insisting","insistido","insisted"]
["insistir","to insist","Indicativo","Indicative","Futuro","Future","I will insist","insistiré","insistirás","insistirá","insistiremos","insistiréis","insistirán","insistiendo","insisting","insistido","insisted"]
["insistir","to insist","Indicativo","Indicative","Imperfecto","Imperfect","I was insisting, used to insist, insisted","insistía","insistías","insistía","insistíamos","insistíais","insistían","insistiendo","insisting","insistido","insisted"]
["insistir","to insist","Indicativo","Indicative","Pretérito","Preterite","I insisted","insistí","insististe","insistió","insistimos","insististeis","insistieron","insistiendo","insisting","insistido","insisted"]
["insistir","to insist","Indicativo","Indicative","Condicional","Conditional","I would insist","insistiría","insistirías","insistiría","insistiríamos","insistiríais","insistirían","insistiendo","insisting","insistido","insisted"]
["insistir","to insist","Indicativo","Indicative","Presente perfecto","Present Perfect","I have insisted","he insistido","has insistido","ha insistido","hemos insistido","habéis insistido","han insistido","insistiendo","insisting","insistido","insisted"]
["insistir","to insist","Indicativo","Indicative","Futuro perfecto","Future Perfect","I will have insisted","habré insistido","habrás insistido","habrá insistido","habremos insistido","habréis insistido","habrán insistido","insistiendo","insisting","insistido","insisted"]
["insistir","to insist","Indicativo","Indicative","Pluscuamperfecto","Past Perfect","I had insisted","había insistido","habías insistido","había insistido","habíamos insistido","habíais insistido","habían insistido","insistiendo","insisting","insistido","insisted"]
["insistir","to insist","Indicativo","Indicative","Pretérito anterior","Preterite (Archaic)","I had insisted","hube insistido","hubiste insistido","hubo insistido","hubimos insistido","hubisteis insistido","hubieron insistido","insistiendo","insisting","insistido","insisted"]
["insistir","to insist","Indicativo","Indicative","Condicional perfecto","Conditional Perfect","I would have insisted","habría insistido","habrías insistido","habría insistido","habríamos insistido","habríais insistido","habrían insistido","insistiendo","insisting","insistido","insisted"]
["insistir","to insist","Subjuntivo","Subjunctive","Presente","Present","I insist, am insisting","insista","insistas","insista","insistamos","insistáis","insistan","insistiendo","insisting","insistido","insisted"]
["insistir","to insist","Subjuntivo","Subjunctive","Imperfecto","Imperfect","I insisted, was insisting","insistiera","insistieras","insistiera","insistiéramos","insistierais","insistieran","insistiendo","insisting","insistido","insisted"]
["insistir","to insist","Subjuntivo","Subjunctive","Futuro","Future","I will insist","insistiere","insistieres","insistiere","insistiéremos","insistiereis","insistieren","insistiendo","insisting","insistido","insisted"]
["insistir","to insist","Subjuntivo","Subjunctive","Presente perfecto","Present Perfect","I have insisted, insisted","haya insistido","hayas insistido","haya insistido","hayamos insistido","hayáis insistido","hayan insistido","insistiendo","insisting","insistido","insisted"]
["insistir","to insist","Subjuntivo","Subjunctive","Futuro perfecto","Future Perfect","I will have insisted","hubiere insistido","hubieres insistido","hubiere insistido","hubiéremos insistido","hubiereis insistido","hubieren insistido","insistiendo","insisting","insistido","insisted"]
["insistir","to insist","Subjuntivo","Subjunctive","Pluscuamperfecto","Past Perfect","I had insisted","hubiera insistido","hubieras insistido","hubiera insistido","hubiéramos insistido","hubierais insistido","hubieran insistido","insistiendo","insisting","insistido","insisted"]
["intentar","to try, attempt","Imperativo Afirmativo","Imperative Affirmative","Presente","Present","Try! Don't try!",null,"intenta","intentad",null,"intente","intenten","intentando","trying","intentado","tried"]
["intentar","to try, attempt","Imperativo Negativo","Imperative Negative","Presente","Present","Try! Don't try!",null,"no intentes","no intentéis",null,"no intente","no intenten","intentando","trying","intentado","tried"]
["intentar","to try, attempt","Indicativo","Indicative","Presente","Present","I try, am trying","intento","intentas","intenta","intentamos","intentáis","intentan","intentando","trying","intentado","tried"]
["intentar","to try, attempt","Indicativo","Indicative","Futuro","Future","I will try","intentaré","intentarás","intentará","intentaremos","intentaréis","intentarán","intentando","trying","intentado","tried"]
["intentar","to try, attempt","Indicativo","Indicative","Imperfecto","Imperfect","I was trying, used to try, tried","intentaba","intentabas","intentaba","intentábamos","intentabais","intentaban","intentando","trying","intentado","tried"]
["intentar","to try, attempt","Indicativo","Indicative","Pretérito","Preterite","I tried","intenté","intentaste","intentó","intentamos","intentasteis","intentaron","intentando","trying","intentado","tried"]
["intentar","to try, attempt","Indicativo","Indicative","Condicional","Conditional","I would try","intentaría","intentarías","intentaría","intentaríamos","intentaríais","intentarían","intentando","trying","intentado","tried"]
["intentar","to try, attempt","Indicativo","Indicative","Presente perfecto","Present Perfect","I have tried","he intentado","has intentado","ha intentado","hemos intentado","habéis intentado","han intentado","intentando","trying","intentado","tried"]
["intentar","to try, attempt","Indicativo","Indicative","Futuro perfecto","Future Perfect","I will have tried","habré intentado","habrás intentado","habrá intentado","habremos intentado","habréis intentado","habrán intentado","intentando","trying","intentado","tried"]
["intentar","to try, attempt","Indicativo","Indicative","Pluscuamperfecto","Past Perfect","I had tried","había intentado","habías intentado","había intentado","habíamos intentado","habíais intentado","habían intentado","intentando","trying","intentado","tried"]
["intentar","to try, attempt","Indicativo","Indicative","Pretérito anterior","Preterite (Archaic)","I had tried","hube intentado","hubiste intentado","hubo intentado","hubimos intentado","hubisteis intentado","hubieron intentado","intentando","trying","intentado","tried"]
["intentar","to try, attempt","Indicativo","Indicative","Condicional perfecto","Conditional Perfect","I would have tried","habría intentado","habrías intentado","habría intentado","habríamos intentado","habríais intentado","habrían intentado","intentando","trying","intentado","tried"]
["intentar","to try, attempt","Subjuntivo","Subjunctive","Presente","Present","I try, am trying","intente","intentes","intente","intentemos","intentéis","intenten","intentando","trying","intentado","tried"]
["intentar","to try, attempt","Subjuntivo","Subjunctive","Imperfecto","Imperfect","I tried, was trying","intentara","intentaras","intentara","intentáramos","intentarais","intentaran","intentando","trying","intentado","tried"]
["intentar","to try, attempt","Subjuntivo","Subjunctive","Futuro","Future","I will try","intentare","intentares","intentare","intentáremos","intentareis","intentaren","intentando","trying","intentado","tried"]
["intentar","to try, attempt","Subjuntivo","Subjunctive","Presente perfecto","Present Perfect","I have tried, tried","haya intentado","hayas intentado","haya intentado","hayamos intentado","hayáis intentado","hayan intentado","intentando","trying","intentado","tried"]
["intentar","to try, attempt","Subjuntivo","Subjunctive","Futuro perfecto","Future Perfect","I will have tried","hubiere intentado","hubieres intentado","hubiere intentado","hubiéremos intentado","hubiereis intentado","hubieren intentado","intentando","trying","intentado","tried"]
["intentar","to try, attempt","Subjuntivo","Subjunctive","Pluscuamperfecto","Past Perfect","I had tried","hubiera intentado","hubieras intentado","hubiera intentado","hubiéramos intentado","hubierais intentado","hubieran intentado","intentando","trying","intentado","tried"]
["interesar","to interest, be of interest [to]","Imperativo Afirmativo","Imperative Affirmative","Presente","Present","Interest! Don't interest!",null,"interesa","interesad",null,"interese","interesen","interesando","interesting","interesado","interested"]
["interesar","to interest, be of interest [to]","Imperativo Negativo","Imperative Negative","Presente","Present","Interest! Don't interest!",null,"no intereses","no intereséis",null,"no interese","no interesen","interesando","interesting","interesado","interested"]
["interesar","to interest, be of interest [to]","Indicativo","Indicative","Presente","Present","I interest, am interesting","intereso","interesas","interesa","interesamos","interesáis","interesan","interesando","interesting","interesado","interested"]
["interesar","to interest, be of interest [to]","Indicativo","Indicative","Futuro","Future","I will interest","interesaré","interesarás","interesará","interesaremos","interesaréis","interesarán","interesando","interesting","interesado","interested"]
["interesar","to interest, be of interest [to]","Indicativo","Indicative","Imperfecto","Imperfect","I was interesting, used to interest, interested","interesaba","interesabas","interesaba","interesábamos","interesabais","interesaban","interesando","interesting","interesado","interested"]
["interesar","to interest, be of interest [to]","Indicativo","Indicative","Pretérito","Preterite","I interested","interesé","interesaste","interesó","interesamos","interesasteis","interesaron","interesando","interesting","interesado","interested"]
["interesar","to interest, be of interest [to]","Indicativo","Indicative","Condicional","Conditional","I would interest","interesaría","interesarías","interesaría","interesaríamos","interesaríais","interesarían","interesando","interesting","interesado","interested"]
["interesar","to interest, be of interest [to]","Indicativo","Indicative","Presente perfecto","Present Perfect","I have interested","he interesado","has interesado","ha interesado","hemos interesado","habéis interesado","han interesado","interesando","interesting","interesado","interested"]
["interesar","to interest, be of interest [to]","Indicativo","Indicative","Futuro perfecto","Future Perfect","I will have interested","habré interesado","habrás interesado","habrá interesado","habremos interesado","habréis interesado","habrán interesado","interesando","interesting","interesado","interested"]
["interesar","to interest, be of interest [to]","Indicativo","Indicative","Pluscuamperfecto","Past Perfect","I had interested","había interesado","habías interesado","había interesado","habíamos interesado","habíais interesado","habían interesado","interesando","interesting","interesado","interested"]
["interesar","to interest, be of interest [to]","Indicativo","Indicative","Pretérito anterior","Preterite (Archaic)","I had interested","hube interesado","hubiste interesado","hubo interesado","hubimos interesado","hubisteis interesado","hubieron interesado","interesando","interesting","interesado","interested"]
["interesar","to interest, be of interest [to]","Indicativo","Indicative","Condicional perfecto","Conditional Perfect","I would have interested","habría interesado","habrías interesado","habría interesado","habríamos interesado","habríais interesado","habrían interesado","interesando","interesting","interesado","interested"]
["interesar","to interest, be of interest [to]","Subjuntivo","Subjunctive","Presente","Present","I interest, am interesting","interese","intereses","interese","interesemos","intereséis","interesen","interesando","interesting","interesado","interested"]
["interesar","to interest, be of interest [to]","Subjuntivo","Subjunctive","Imperfecto","Imperfect","I interested, was interesting","interesara","interesaras","interesara","interesáramos","interesarais","interesaran","interesando","interesting","interesado","interested"]
["interesar","to interest, be of interest [to]","Subjuntivo","Subjunctive","Futuro","Future","I will interest","interesare","interesares","interesare","interesáremos","interesareis","interesaren","interesando","interesting","interesado","interested"]
["interesar","to interest, be of interest [to]","Subjuntivo","Subjunctive","Presente perfecto","Present Perfect","I have interested, interested","haya interesado","hayas interesado","haya interesado","hayamos interesado","hayáis interesado","hayan interesado","interesando","interesting","interesado","interested"]
["interesar","to interest, be of interest [to]","Subjuntivo","Subjunctive","Futuro perfecto","Future Perfect","I will have interested","hubiere interesado","hubieres interesado","hubiere interesado","hubiéremos interesado","hubiereis interesado","hubieren interesado","interesando","interesting","interesado","interested"]
["interesar","to interest, be of interest [to]","Subjuntivo","Subjunctive","Pluscuamperfecto","Past Perfect","I had interested","hubiera interesado","hubieras interesado","hubiera interesado","hubiéramos interesado","hubierais interesado","hubieran interesado","interesando","interesting","interesado","interested"]
["ir","to go","Imperativo Afirmativo","Imperative Affirmative","Presente","Present","Go! Don't go!",null,"ve","id",null,"vaya","vayan","yendo","going","ido","gone"]
["ir","to go","Imperativo Negativo","Imperative Negative","Presente","Present","Go! Don't go!",null,"no vayas","no vayáis",null,"no vaya","no vayan","yendo","going","ido","gone"]
["ir","to go","Indicativo","Indicative","Presente","Present","I go, am going","voy","vas","va","vamos","vais","van","yendo","going","ido","gone"]
["ir","to go","Indicativo","Indicative","Futuro","Future","I will go","iré","irás","irá","iremos","iréis","irán","yendo","going","ido","gone"]
["ir","to go","Indicativo","Indicative","Imperfecto","Imperfect","I was going, used to go, went","iba","ibas","iba","íbamos","ibais","iban","yendo","going","ido","gone"]
["ir","to go","Indicativo","Indicative","Pretérito","Preterite","I went","fui","fuiste","fue","fuimos","fuisteis","fueron","yendo","going","ido","gone"]
["ir","to go","Indicativo","Indicative","Condicional","Conditional","I would go","iría","irías","iría","iríamos","iríais","irían","yendo","going","ido","gone"]
["ir","to go","Indicativo","Indicative","Presente perfecto","Present Perfect","I have gone","he ido","has ido","ha ido","hemos ido","habéis ido","han ido","yendo","going","ido","gone"]
["ir","to go","Indicativo","Indicative","Futuro perfecto","Future Perfect","I will have gone","habré ido","habrás ido","habrá ido","habremos ido","habréis ido","habrán ido","yendo","going","ido","gone"]
["ir","to go","Indicativo","Indicative","Pluscuamperfecto","Past Perfect","I had gone","había ido","habías ido","había ido","habíamos ido","habíais ido","habían ido","yendo","going","ido","gone"]
["ir","to go","Indicativo","Indicative","Pretérito anterior","Preterite (Archaic)","I had gone","hube ido","hubiste ido","hubo ido","hubimos ido","hubisteis ido","hubieron ido","yendo","going","ido","gone"]
["ir","to go","Indicativo","Indicative","Condicional perfecto","Conditional Perfect","I would have gone","habría ido","habrías ido","habría ido","habríamos ido","habríais ido","habrían ido","yendo","going","ido","gone"]
["ir","to go","Subjuntivo","Subjunctive","Presente","Present","I go, am going","vaya","vayas","vaya","vayamos","vayáis","vayan","yendo","going","ido","gone"]
["ir","to go","Subjuntivo","Subjunctive","Imperfecto","Imperfect","I went, was going","fuera","fueras","fuera","fuéramos","fuerais","fueran","yendo","going","ido","gone"]
["ir","to go","Subjuntivo","Subjunctive","Futuro","Future","I will go","fuere","fueres","fuere","fuéremos","fuereis","fueren","yendo","going","ido","gone"]
["ir","to go","Subjuntivo","Subjunctive","Presente perfecto","Present Perfect","I have gone, went","haya ido","hayas ido","haya ido","hayamos ido","hayáis ido","hayan ido","yendo","going","ido","gone"]
["ir","to go","Subjuntivo","Subjunctive","Futuro perfecto","Future Perfect","I will have gone","hubiere ido","hubieres ido","hubiere ido","hubiéremos ido","hubiereis ido","hubieren ido","yendo","going","ido","gone"]
["ir","to go","Subjuntivo","Subjunctive","Pluscuamperfecto","Past Perfect","I had gone","hubiera ido","hubieras ido","hubiera ido","hubiéramos ido","hubierais ido","hubieran ido","yendo","going","ido","gone"]
["jugar","to play","Imperativo Afirmativo","Imperative Affirmative","Presente","Present","Play! Don't play!",null,"juega","jugad",null,"juegue","jueguen","jugando","playing","jugado","played"]
["jugar","to play","Imperativo Negativo","Imperative Negative","Presente","Present","Play! Don't play!",null,"no juegues","no juguéis",null,"no juegue","no jueguen","jugando","playing","jugado","played"]
["jugar","to play","Indicativo","Indicative","Presente","Present","I play, am playing","juego","juegas","juega","jugamos","jugáis","juegan","jugando","playing","jugado","played"]
["jugar","to play","Indicativo","Indicative","Futuro","Future","I will play","jugaré","jugarás","jugará","jugaremos","jugaréis","jugarán","jugando","playing","jugado","played"]
["jugar","to play","Indicativo","Indicative","Imperfecto","Imperfect","I was playing, used to play, played","jugaba","jugabas","jugaba","jugábamos","jugabais","jugaban","jugando","playing","jugado","played"]
["jugar","to play","Indicativo","Indicative","Pretérito","Preterite","I played","jugué","jugaste","jugó","jugamos","jugasteis","jugaron","jugando","playing","jugado","played"]
["jugar","to play","Indicativo","Indicative","Condicional","Conditional","I would play","jugaría","jugarías","jugaría","jugaríamos","jugaríais","jugarían","jugando","playing","jugado","played"]
["jugar","to play","Indicativo","Indicative","Presente perfecto","Present Perfect","I have played","he jugado","has jugado","ha jugado","hemos jugado","habéis jugado","han jugado","jugando","playing","jugado","played"]
["jugar","to play","Indicativo","Indicative","Futuro perfecto","Future Perfect","I will have played","habré jugado","habrás jugado","habrá jugado","habremos jugado","habréis jugado","habrán jugado","jugando","playing","jugado","played"]
["jugar","to play","Indicativo","Indicative","Pluscuamperfecto","Past Perfect","I had played","había jugado","habías jugado","había jugado","habíamos jugado","habíais jugado","habían jugado","jugando","playing","jugado","played"]
["jugar","to play","Indicativo","Indicative","Pretérito anterior","Preterite (Archaic)","I had played","hube jugado","hubiste jugado","hubo jugado","hubimos jugado","hubisteis jugado","hubieron jugado","jugando","playing","jugado","played"]
["jugar","to play","Indicativo","Indicative","Condicional perfecto","Conditional Perfect","I would have played","habría jugado","habrías jugado","habría jugado","habríamos jugado","habríais jugado","habrían jugado","jugando","playing","jugado","played"]
["jugar","to play","Subjuntivo","Subjunctive","Presente","Present","I play, am playing","juegue","juegues","juegue","juguemos","juguéis","jueguen","jugando","playing","jugado","played"]
["jugar","to play","Subjuntivo","Subjunctive","Imperfecto","Imperfect","I played, was playing","jugara","jugaras","jugara","jugáramos","jugarais","jugaran","jugando","playing","jugado","played"]
["jugar","to play","Subjuntivo","Subjunctive","Futuro","Future","I will play","jugare","jugares","jugare","jugáremos","jugareis","jugaren","jugando","playing","jugado","played"]
["jugar","to play","Subjuntivo","Subjunctive","Presente perfecto","Present Perfect","I have played, played","haya jugado","hayas jugado","haya jugado","hayamos jugado","hayáis jugado","hayan jugado","jugando","playing","jugado","played"]
["jugar","to play","Subjuntivo","Subjunctive","Futuro perfecto","Future Perfect","I will have played","hubiere jugado","hubieres jugado","hubiere jugado","hubiéremos jugado","hubiereis jugado","hubieren jugado","jugando","playing","jugado","played"]
["jugar","to play","Subjuntivo","Subjunctive","Pluscuamperfecto","Past Perfect","I had played","hubiera jugado","hubieras jugado","hubiera jugado","hubiéramos jugado","hubierais jugado","hubieran jugado","jugando","playing","jugado","played"]
["lanzar","to throw, hurl, cast, fling","Imperativo Afirmativo","Imperative Affirmative","Presente","Present","Throw! Don't throw!",null,"lanza","lanzad",null,"lance","lancen","lanzando","throwing","lanzado","thrown"]
["lanzar","to throw, hurl, cast, fling","Imperativo Negativo","Imperative Negative","Presente","Present","Throw! Don't throw!",null,"no lances","no lancéis",null,"no lance","no lancen","lanzando","throwing","lanzado","thrown"]
["lanzar","to throw, hurl, cast, fling","Indicativo","Indicative","Presente","Present","I throw, am throwing","lanzo","lanzas","lanza","lanzamos","lanzáis","lanzan","lanzando","throwing","lanzado","thrown"]
["lanzar","to throw, hurl, cast, fling","Indicativo","Indicative","Futuro","Future","I will throw","lanzaré","lanzarás","lanzará","lanzaremos","lanzaréis","lanzarán","lanzando","throwing","lanzado","thrown"]
["lanzar","to throw, hurl, cast, fling","Indicativo","Indicative","Imperfecto","Imperfect","I was throwing, used to throw, threw","lanzaba","lanzabas","lanzaba","lanzábamos","lanzabais","lanzaban","lanzando","throwing","lanzado","thrown"]
["lanzar","to throw, hurl, cast, fling","Indicativo","Indicative","Pretérito","Preterite","I threw","lancé","lanzaste","lanzó","lanzamos","lanzasteis","lanzaron","lanzando","throwing","lanzado","thrown"]
["lanzar","to throw, hurl, cast, fling","Indicativo","Indicative","Condicional","Conditional","I would throw","lanzaría","lanzarías","lanzaría","lanzaríamos","lanzaríais","lanzarían","lanzando","throwing","lanzado","thrown"]
["lanzar","to throw, hurl, cast, fling","Indicativo","Indicative","Presente perfecto","Present Perfect","I have thrown","he lanzado","has lanzado","ha lanzado","hemos lanzado","habéis lanzado","han lanzado","lanzando","throwing","lanzado","thrown"]
["lanzar","to throw, hurl, cast, fling","Indicativo","Indicative","Futuro perfecto","Future Perfect","I will have thrown","habré lanzado","habrás lanzado","habrá lanzado","habremos lanzado","habréis lanzado","habrán lanzado","lanzando","throwing","lanzado","thrown"]
["lanzar","to throw, hurl, cast, fling","Indicativo","Indicative","Pluscuamperfecto","Past Perfect","I had thrown","había lanzado","habías lanzado","había lanzado","habíamos lanzado","habíais lanzado","habían lanzado","lanzando","throwing","lanzado","thrown"]
["lanzar","to throw, hurl, cast, fling","Indicativo","Indicative","Pretérito anterior","Preterite (Archaic)","I had thrown","hube lanzado","hubiste lanzado","hubo lanzado","hubimos lanzado","hubisteis lanzado","hubieron lanzado","lanzando","throwing","lanzado","thrown"]
["lanzar","to throw, hurl, cast, fling","Indicativo","Indicative","Condicional perfecto","Conditional Perfect","I would have thrown","habría lanzado","habrías lanzado","habría lanzado","habríamos lanzado","habríais lanzado","habrían lanzado","lanzando","throwing","lanzado","thrown"]
["lanzar","to throw, hurl, cast, fling","Subjuntivo","Subjunctive","Presente","Present","I throw, am throwing","lance","lances","lance","lancemos","lancéis","lancen","lanzando","throwing","lanzado","thrown"]
["lanzar","to throw, hurl, cast, fling","Subjuntivo","Subjunctive","Imperfecto","Imperfect","I threw, was throwing","lanzara","lanzaras","lanzara","lanzáramos","lanzarais","lanzaran","lanzando","throwing","lanzado","thrown"]
["lanzar","to throw, hurl, cast, fling","Subjuntivo","Subjunctive","Futuro","Future","I will throw","lanzare","lanzares","lanzare","lanzáremos","lanzareis","lanzaren","lanzando","throwing","lanzado","thrown"]
["lanzar","to throw, hurl, cast, fling","Subjuntivo","Subjunctive","Presente perfecto","Present Perfect","I have thrown, threw","haya lanzado","hayas lanzado","haya lanzado","hayamos lanzado","hayáis lanzado","hayan lanzado","lanzando","throwing","lanzado","thrown"]
["lanzar","to throw, hurl, cast, fling","Subjuntivo","Subjunctive","Futuro perfecto","Future Perfect","I will have thrown","hubiere lanzado","hubieres lanzado","hubiere lanzado","hubiéremos lanzado","hubiereis lanzado","hubieren lanzado","lanzando","throwing","lanzado","thrown"]
["lanzar","to throw, hurl, cast, fling","Subjuntivo","Subjunctive","Pluscuamperfecto","Past Perfect","I had thrown","hubiera lanzado","hubieras lanzado","hubiera lanzado","hubiéramos lanzado","hubierais lanzado","hubieran lanzado","lanzando","throwing","lanzado","thrown"]
["leer","to read","Imperativo Afirmativo","Imperative Affirmative","Presente","Present","Read! Don't read!",null,"lee","leed",null,"lea","lean","leyendo","reading","leído","read"]
["leer","to read","Imperativo Negativo","Imperative Negative","Presente","Present","Read! Don't read!",null,"no leas","no leáis",null,"no lea","no lean","leyendo","reading","leído","read"]
["leer","to read","Indicativo","Indicative","Presente","Present","I read, am reading","leo","lees","lee","leemos","leéis","leen","leyendo","reading","leído","read"]
["leer","to read","Indicativo","Indicative","Futuro","Future","I will read","leeré","leerás","leerá","leeremos","leeréis","leerán","leyendo","reading","leído","read"]
["leer","to read","Indicativo","Indicative","Imperfecto","Imperfect","I was reading, used to read, read","leía","leías","leía","leíamos","leíais","leían","leyendo","reading","leído","read"]
["leer","to read","Indicativo","Indicative","Pretérito","Preterite","I read","leí","leíste","leyó","leímos","leísteis","leyeron","leyendo","reading","leído","read"]
["leer","to read","Indicativo","Indicative","Condicional","Conditional","I would read","leería","leerías","leería","leeríamos","leeríais","leerían","leyendo","reading","leído","read"]
["leer","to read","Indicativo","Indicative","Presente perfecto","Present Perfect","I have read","he leído","has leído","ha leído","hemos leído","habéis leído","han leído","leyendo","reading","leído","read"]
["leer","to read","Indicativo","Indicative","Futuro perfecto","Future Perfect","I will have read","habré leído","habrás leído","habrá leído","habremos leído","habréis leído","habrán leído","leyendo","reading","leído","read"]
["leer","to read","Indicativo","Indicative","Pluscuamperfecto","Past Perfect","I had read","había leído","habías leído","había leído","habíamos leído","habíais leído","habían leído","leyendo","reading","leído","read"]
["leer","to read","Indicativo","Indicative","Pretérito anterior","Preterite (Archaic)","I had read","hube leído","hubiste leído","hubo leído","hubimos leído","hubisteis leído","hubieron leído","leyendo","reading","leído","read"]
["leer","to read","Indicativo","Indicative","Condicional perfecto","Conditional Perfect","I would have read","habría leído","habrías leído","habría leído","habríamos leído","habríais leído","habrían leído","leyendo","reading","leído","read"]
["leer","to read","Subjuntivo","Subjunctive","Presente","Present","I read, am reading","lea","leas","lea","leamos","leáis","lean","leyendo","reading","leído","read"]
["leer","to read","Subjuntivo","Subjunctive","Imperfecto","Imperfect","I read, was reading","leyera","leyeras","leyera","leyéramos","leyerais","leyeran","leyendo","reading","leído","read"]
["leer","to read","Subjuntivo","Subjunctive","Futuro","Future","I will read","leyere","leyeres","leyere","leyéremos","leyereis","leyeren","leyendo","reading","leído","read"]
["leer","to read","Subjuntivo","Subjunctive","Presente perfecto","Present Perfect","I have read, read","haya leído","hayas leído","haya leído","hayamos leído","hayáis leído","hayan leído","leyendo","reading","leído","read"]
["leer","to read","Subjuntivo","Subjunctive","Futuro perfecto","Future Perfect","I will have read","hubiere leído","hubieres leído","hubiere leído","hubiéremos leído","hubiereis leído","hubieren leído","leyendo","reading","leído","read"]
["leer","to read","Subjuntivo","Subjunctive","Pluscuamperfecto","Past Perfect","I had read","hubiera leído","hubieras leído","hubiera leído","hubiéramos leído","hubierais leído","hubieran leído","leyendo","reading","leído","read"]
["levantar","to raise, to lift","Imperativo Afirmativo","Imperative Affirmative","Presente","Present","raise! Don't raise!",null,"levanta","levantad",null,"levante","levanten","levantando","raising","levantado","raised"]
["levantar","to raise, to lift","Imperativo Negativo","Imperative Negative","Presente","Present","raise! Don't raise!",null,"no levantes","no levantéis",null,"no levante","no levanten","levantando","raising","levantado","raised"]
["levantar","to raise, to lift","Indicativo","Indicative","Presente","Present","I raise, am raising","levanto","levantas","levanta","levantamos","levantáis","levantan","levantando","raising","levantado","raised"]
["levantar","to raise, to lift","Indicativo","Indicative","Futuro","Future","I will raise","levantaré","levantarás","levantará","levantaremos","levantaréis","levantarán","levantando","raising","levantado","raised"]
["levantar","to raise, to lift","Indicativo","Indicative","Imperfecto","Imperfect","I was raising, used to raise, raised","levantaba","levantabas","levantaba","levantábamos","levantabais","levantaban","levantando","raising","levantado","raised"]
["levantar","to raise, to lift","Indicativo","Indicative","Pretérito","Preterite","I raised","levanté","levantaste","levantó","levantamos","levantasteis","levantaron","levantando","raising","levantado","raised"]
["levantar","to raise, to lift","Indicativo","Indicative","Condicional","Conditional","I would raise","levantaría","levantarías","levantaría","levantaríamos","levantaríais","levantarían","levantando","raising","levantado","raised"]
["levantar","to raise, to lift","Indicativo","Indicative","Presente perfecto","Present Perfect","I have raised","he levantado","has levantado","ha levantado","hemos levantado","habéis levantado","han levantado","levantando","raising","levantado","raised"]
["levantar","to raise, to lift","Indicativo","Indicative","Futuro perfecto","Future Perfect","I will have raised","habré levantado","habrás levantado","habrá levantado","habremos levantado","habréis levantado","habrán levantado","levantando","raising","levantado","raised"]
["levantar","to raise, to lift","Indicativo","Indicative","Pluscuamperfecto","Past Perfect","I had raised","había levantado","habías levantado","había levantado","habíamos levantado","habíais levantado","habían levantado","levantando","raising","levantado","raised"]
["levantar","to raise, to lift","Indicativo","Indicative","Pretérito anterior","Preterite (Archaic)","I had raised","hube levantado","hubiste levantado","hubo levantado","hubimos levantado","hubisteis levantado","hubieron levantado","levantando","raising","levantado","raised"]
["levantar","to raise, to lift","Indicativo","Indicative","Condicional perfecto","Conditional Perfect","I would have raised","habría levantado","habrías levantado","habría levantado","habríamos levantado","habríais levantado","habrían levantado","levantando","raising","levantado","raised"]
["levantar","to raise, to lift","Subjuntivo","Subjunctive","Presente","Present","I raise, am raising","levante","levantes","levante","levantemos","levantéis","levanten","levantando","raising","levantado","raised"]
["levantar","to raise, to lift","Subjuntivo","Subjunctive","Imperfecto","Imperfect","I raised, was raising","levantara","levantaras","levantara","levantáramos","levantarais","levantaran","levantando","raising","levantado","raised"]
["levantar","to raise, to lift","Subjuntivo","Subjunctive","Futuro","Future","I will raise","levantare","levantares","levantare","levantáremos","levantareis","levantaren","levantando","raising","levantado","raised"]
["levantar","to raise, to lift","Subjuntivo","Subjunctive","Presente perfecto","Present Perfect","I have raised, raised","haya levantado","hayas levantado","haya levantado","hayamos levantado","hayáis levantado","hayan levantado","levantando","raising","levantado","raised"]
["levantar","to raise, to lift","Subjuntivo","Subjunctive","Futuro perfecto","Future Perfect","I will have raised","hubiere levantado","hubieres levantado","hubiere levantado","hubiéremos levantado","hubiereis levantado","hubieren levantado","levantando","raising","levantado","raised"]
["levantar","to raise, to lift","Subjuntivo","Subjunctive","Pluscuamperfecto","Past Perfect","I had raised","hubiera levantado","hubieras levantado","hubiera levantado","hubiéramos levantado","hubierais levantado","hubieran levantado","levantando","raising","levantado","raised"]
["llamar","to call, to name","Imperativo Afirmativo","Imperative Affirmative","Presente","Present","Call! Don't call!",null,"llama","llamad",null,"llame","llamen","llamando","calling","llamado","called"]
["llamar","to call, to name","Imperativo Negativo","Imperative Negative","Presente","Present","Call! Don't call!",null,"no llames","no llaméis",null,"no llame","no llamen","llamando","calling","llamado","called"]
["llamar","to call, to name","Indicativo","Indicative","Presente","Present","I call, am calling","llamo","llamas","llama","llamamos","llamáis","llaman","llamando","calling","llamado","called"]
["llamar","to call, to name","Indicativo","Indicative","Futuro","Future","I will call","llamaré","llamarás","llamará","llamaremos","llamaréis","llamarán","llamando","calling","llamado","called"]
["llamar","to call, to name","Indicativo","Indicative","Imperfecto","Imperfect","I was calling, used to call, called","llamaba","llamabas","llamaba","llamábamos","llamabais","llamaban","llamando","calling","llamado","called"]
["llamar","to call, to name","Indicativo","Indicative","Pretérito","Preterite","I called","llamé","llamaste","llamó","llamamos","llamasteis","llamaron","llamando","calling","llamado","called"]
["llamar","to call, to name","Indicativo","Indicative","Condicional","Conditional","I would call","llamaría","llamarías","llamaría","llamaríamos","llamaríais","llamarían","llamando","calling","llamado","called"]
["llamar","to call, to name","Indicativo","Indicative","Presente perfecto","Present Perfect","I have called","he llamado","has llamado","ha llamado","hemos llamado","habéis llamado","han llamado","llamando","calling","llamado","called"]
["llamar","to call, to name","Indicativo","Indicative","Futuro perfecto","Future Perfect","I will have called","habré llamado","habrás llamado","habrá llamado","habremos llamado","habréis llamado","habrán llamado","llamando","calling","llamado","called"]
["llamar","to call, to name","Indicativo","Indicative","Pluscuamperfecto","Past Perfect","I had called","había llamado","habías llamado","había llamado","habíamos llamado","habíais llamado","habían llamado","llamando","calling","llamado","called"]
["llamar","to call, to name","Indicativo","Indicative","Pretérito anterior","Preterite (Archaic)","I had called","hube llamado","hubiste llamado","hubo llamado","hubimos llamado","hubisteis llamado","hubieron llamado","llamando","calling","llamado","called"]
["llamar","to call, to name","Indicativo","Indicative","Condicional perfecto","Conditional Perfect","I would have called","habría llamado","habrías llamado","habría llamado","habríamos llamado","habríais llamado","habrían llamado","llamando","calling","llamado","called"]
["llamar","to call, to name","Subjuntivo","Subjunctive","Presente","Present","I call, am calling","llame","llames","llame","llamemos","llaméis","llamen","llamando","calling","llamado","called"]
["llamar","to call, to name","Subjuntivo","Subjunctive","Imperfecto","Imperfect","I called, was calling","llamara","llamaras","llamara","llamáramos","llamarais","llamaran","llamando","calling","llamado","called"]
["llamar","to call, to name","Subjuntivo","Subjunctive","Futuro","Future","I will call","llamare","llamares","llamare","llamáremos","llamareis","llamaren","llamando","calling","llamado","called"]
["llamar","to call, to name","Subjuntivo","Subjunctive","Presente perfecto","Present Perfect","I have called, called","haya llamado","hayas llamado","haya llamado","hayamos llamado","hayáis llamado","hayan llamado","llamando","calling","llamado","called"]
["llamar","to call, to name","Subjuntivo","Subjunctive","Futuro perfecto","Future Perfect","I will have called","hubiere llamado","hubieres llamado","hubiere llamado","hubiéremos llamado","hubiereis llamado","hubieren llamado","llamando","calling","llamado","called"]
["llamar","to call, to name","Subjuntivo","Subjunctive","Pluscuamperfecto","Past Perfect","I had called","hubiera llamado","hubieras llamado","hubiera llamado","hubiéramos llamado","hubierais llamado","hubieran llamado","llamando","calling","llamado","called"]
["llegar","to arrive, come, reach; to bring up, bring over; to gather together","Imperativo Afirmativo","Imperative Affirmative","Presente","Present","Arrive! Don't arrive!",null,"llega","llegad",null,"llegue","lleguen","llegando","arriving","llegado","arrived"]
["llegar","to arrive, come, reach; to bring up, bring over; to gather together","Imperativo Negativo","Imperative Negative","Presente","Present","Arrive! Don't arrive!",null,"no llegues","no lleguéis",null,"no llegue","no lleguen","llegando","arriving","llegado","arrived"]
["llegar","to arrive, come, reach; to bring up, bring over; to gather together","Indicativo","Indicative","Presente","Present","I arrive, am arriving","llego","llegas","llega","llegamos","llegáis","llegan","llegando","arriving","llegado","arrived"]
["llegar","to arrive, come, reach; to bring up, bring over; to gather together","Indicativo","Indicative","Futuro","Future","I will arrive","llegaré","llegarás","llegará","llegaremos","llegaréis","llegarán","llegando","arriving","llegado","arrived"]
["llegar","to arrive, come, reach; to bring up, bring over; to gather together","Indicativo","Indicative","Imperfecto","Imperfect","I was arriving, used to arrive, arrived","llegaba","llegabas","llegaba","llegábamos","llegabais","llegaban","llegando","arriving","llegado","arrived"]
["llegar","to arrive, come, reach; to bring up, bring over; to gather together","Indicativo","Indicative","Pretérito","Preterite","I arrived","llegué","llegaste","llegó","llegamos","llegasteis","llegaron","llegando","arriving","llegado","arrived"]
["llegar","to arrive, come, reach; to bring up, bring over; to gather together","Indicativo","Indicative","Condicional","Conditional","I would arrive","llegaría","llegarías","llegaría","llegaríamos","llegaríais","llegarían","llegando","arriving","llegado","arrived"]
["llegar","to arrive, come, reach; to bring up, bring over; to gather together","Indicativo","Indicative","Presente perfecto","Present Perfect","I have arrived","he llegado","has llegado","ha llegado","hemos llegado","habéis llegado","han llegado","llegando","arriving","llegado","arrived"]
["llegar","to arrive, come, reach; to bring up, bring over; to gather together","Indicativo","Indicative","Futuro perfecto","Future Perfect","I will have arrived","habré llegado","habrás llegado","habrá llegado","habremos llegado","habréis llegado","habrán llegado","llegando","arriving","llegado","arrived"]
["llegar","to arrive, come, reach; to bring up, bring over; to gather together","Indicativo","Indicative","Pluscuamperfecto","Past Perfect","I had arrived","había llegado","habías llegado","había llegado","habíamos llegado","habíais llegado","habían llegado","llegando","arriving","llegado","arrived"]
["llegar","to arrive, come, reach; to bring up, bring over; to gather together","Indicativo","Indicative","Pretérito anterior","Preterite (Archaic)","I had arrived","hube llegado","hubiste llegado","hubo llegado","hubimos llegado","hubisteis llegado","hubieron llegado","llegando","arriving","llegado","arrived"]
["llegar","to arrive, come, reach; to bring up, bring over; to gather together","Indicativo","Indicative","Condicional perfecto","Conditional Perfect","I would have arrived","habría llegado","habrías llegado","habría llegado","habríamos llegado","habríais llegado","habrían llegado","llegando","arriving","llegado","arrived"]
["llegar","to arrive, come, reach; to bring up, bring over; to gather together","Subjuntivo","Subjunctive","Presente","Present","I arrive, am arriving","llegue","llegues","llegue","lleguemos","lleguéis","lleguen","llegando","arriving","llegado","arrived"]
["llegar","to arrive, come, reach; to bring up, bring over; to gather together","Subjuntivo","Subjunctive","Imperfecto","Imperfect","I arrived, was arriving","llegara","llegaras","llegara","llegáramos","llegarais","llegaran","llegando","arriving","llegado","arrived"]
["llegar","to arrive, come, reach; to bring up, bring over; to gather together","Subjuntivo","Subjunctive","Futuro","Future","I will arrive","llegare","llegares","llegare","llegáremos","llegareis","llegaren","llegando","arriving","llegado","arrived"]
["llegar","to arrive, come, reach; to bring up, bring over; to gather together","Subjuntivo","Subjunctive","Presente perfecto","Present Perfect","I have arrived, arrived","haya llegado","hayas llegado","haya llegado","hayamos llegado","hayáis llegado","hayan llegado","llegando","arriving","llegado","arrived"]
["llegar","to arrive, come, reach; to bring up, bring over; to gather together","Subjuntivo","Subjunctive","Futuro perfecto","Future Perfect","I will have arrived","hubiere llegado","hubieres llegado","hubiere llegado","hubiéremos llegado","hubiereis llegado","hubieren llegado","llegando","arriving","llegado","arrived"]
["llegar","to arrive, come, reach; to bring up, bring over; to gather together","Subjuntivo","Subjunctive","Pluscuamperfecto","Past Perfect","I had arrived","hubiera llegado","hubieras llegado","hubiera llegado","hubiéramos llegado","hubierais llegado","hubieran llegado","llegando","arriving","llegado","arrived"]
["llevar","to carry, bring","Imperativo Afirmativo","Imperative Affirmative","Presente","Present","Carry! Don't carry!",null,"lleva","llevad",null,"lleve","lleven","llevando","carrying","llevado","carried"]
["llevar","to carry, bring","Imperativo Negativo","Imperative Negative","Presente","Present","Carry! Don't carry!",null,"no lleves","no llevéis",null,"no lleve","no lleven","llevando","carrying","llevado","carried"]
["llevar","to carry, bring","Indicativo","Indicative","Presente","Present","I carry, am carrying","llevo","llevas","lleva","llevamos","lleváis","llevan","llevando","carrying","llevado","carried"]
["llevar","to carry, bring","Indicativo","Indicative","Futuro","Future","I will carry","llevaré","llevarás","llevará","llevaremos","llevaréis","llevarán","llevando","carrying","llevado","carried"]
["llevar","to carry, bring","Indicativo","Indicative","Imperfecto","Imperfect","I was carrying, used to carry, carried","llevaba","llevabas","llevaba","llevábamos","llevabais","llevaban","llevando","carrying","llevado","carried"]
["llevar","to carry, bring","Indicativo","Indicative","Pretérito","Preterite","I carried","llevé","llevaste","llevó","llevamos","llevasteis","llevaron","llevando","carrying","llevado","carried"]
["llevar","to carry, bring","Indicativo","Indicative","Condicional","Conditional","I would carry","llevaría","llevarías","llevaría","llevaríamos","llevaríais","llevarían","llevando","carrying","llevado","carried"]
["llevar","to carry, bring","Indicativo","Indicative","Presente perfecto","Present Perfect","I have carried","he llevado","has llevado","ha llevado","hemos llevado","habéis llevado","han llevado","llevando","carrying","llevado","carried"]
["llevar","to carry, bring","Indicativo","Indicative","Futuro perfecto","Future Perfect","I will have carried","habré llevado","habrás llevado","habrá llevado","habremos llevado","habréis llevado","habrán llevado","llevando","carrying","llevado","carried"]
["llevar","to carry, bring","Indicativo","Indicative","Pluscuamperfecto","Past Perfect","I had carried","había llevado","habías llevado","había llevado","habíamos llevado","habíais llevado","habían llevado","llevando","carrying","llevado","carried"]
["llevar","to carry, bring","Indicativo","Indicative","Pretérito anterior","Preterite (Archaic)","I had carried","hube llevado","hubiste llevado","hubo llevado","hubimos llevado","hubisteis llevado","hubieron llevado","llevando","carrying","llevado","carried"]
["llevar","to carry, bring","Indicativo","Indicative","Condicional perfecto","Conditional Perfect","I would have carried","habría llevado","habrías llevado","habría llevado","habríamos llevado","habríais llevado","habrían llevado","llevando","carrying","llevado","carried"]
["llevar","to carry, bring","Subjuntivo","Subjunctive","Presente","Present","I carry, am carrying","lleve","lleves","lleve","llevemos","llevéis","lleven","llevando","carrying","llevado","carried"]
["llevar","to carry, bring","Subjuntivo","Subjunctive","Imperfecto","Imperfect","I carried, was carrying","llevara","llevaras","llevara","lleváramos","llevarais","llevaran","llevando","carrying","llevado","carried"]
["llevar","to carry, bring","Subjuntivo","Subjunctive","Futuro","Future","I will carry","llevare","llevares","llevare","lleváremos","llevareis","llevaren","llevando","carrying","llevado","carried"]
["llevar","to carry, bring","Subjuntivo","Subjunctive","Presente perfecto","Present Perfect","I have carried, carried","haya llevado","hayas llevado","haya llevado","hayamos llevado","hayáis llevado","hayan llevado","llevando","carrying","llevado","carried"]
["llevar","to carry, bring","Subjuntivo","Subjunctive","Futuro perfecto","Future Perfect","I will have carried","hubiere llevado","hubieres llevado","hubiere llevado","hubiéremos llevado","hubiereis llevado","hubieren llevado","llevando","carrying","llevado","carried"]
["llevar","to carry, bring","Subjuntivo","Subjunctive","Pluscuamperfecto","Past Perfect","I had carried","hubiera llevado","hubieras llevado","hubiera llevado","hubiéramos llevado","hubierais llevado","hubieran llevado","llevando","carrying","llevado","carried"]
["lograr","to get, obtain; to achieve, attain","Imperativo Afirmativo","Imperative Affirmative","Presente","Present","Get! Don't get!",null,"logra","lograd",null,"logre","logren","logrando","getting","logrado","got"]
["lograr","to get, obtain; to achieve, attain","Imperativo Negativo","Imperative Negative","Presente","Present","Get! Don't get!",null,"no logres","no logréis",null,"no logre","no logren","logrando","getting","logrado","got"]
["lograr","to get, obtain; to achieve, attain","Indicativo","Indicative","Presente","Present","I get, am getting","logro","logras","logra","logramos","lográis","logran","logrando","getting","logrado","got"]
["lograr","to get, obtain; to achieve, attain","Indicativo","Indicative","Futuro","Future","I will get","lograré","lograrás","logrará","lograremos","lograréis","lograrán","logrando","getting","logrado","got"]
["lograr","to get, obtain; to achieve, attain","Indicativo","Indicative","Imperfecto","Imperfect","I was getting, used to get, got","lograba","lograbas","lograba","lográbamos","lograbais","lograban","logrando","getting","logrado","got"]
["lograr","to get, obtain; to achieve, attain","Indicativo","Indicative","Pretérito","Preterite","I got","logré","lograste","logró","logramos","lograsteis","lograron","logrando","getting","logrado","got"]
["lograr","to get, obtain; to achieve, attain","Indicativo","Indicative","Condicional","Conditional","I would get","lograría","lograrías","lograría","lograríamos","lograríais","lograrían","logrando","getting","logrado","got"]
["lograr","to get, obtain; to achieve, attain","Indicativo","Indicative","Presente perfecto","Present Perfect","I have got","he logrado","has logrado","ha logrado","hemos logrado","habéis logrado","han logrado","logrando","getting","logrado","got"]
["lograr","to get, obtain; to achieve, attain","Indicativo","Indicative","Futuro perfecto","Future Perfect","I will have got","habré logrado","habrás logrado","habrá logrado","habremos logrado","habréis logrado","habrán logrado","logrando","getting","logrado","got"]
["lograr","to get, obtain; to achieve, attain","Indicativo","Indicative","Pluscuamperfecto","Past Perfect","I had got","había logrado","habías logrado","había logrado","habíamos logrado","habíais logrado","habían logrado","logrando","getting","logrado","got"]
["lograr","to get, obtain; to achieve, attain","Indicativo","Indicative","Pretérito anterior","Preterite (Archaic)","I had got","hube logrado","hubiste logrado","hubo logrado","hubimos logrado","hubisteis logrado","hubieron logrado","logrando","getting","logrado","got"]
["lograr","to get, obtain; to achieve, attain","Indicativo","Indicative","Condicional perfecto","Conditional Perfect","I would have got","habría logrado","habrías logrado","habría logrado","habríamos logrado","habríais logrado","habrían logrado","logrando","getting","logrado","got"]
["lograr","to get, obtain; to achieve, attain","Subjuntivo","Subjunctive","Presente","Present","I get, am getting","logre","logres","logre","logremos","logréis","logren","logrando","getting","logrado","got"]
["lograr","to get, obtain; to achieve, attain","Subjuntivo","Subjunctive","Imperfecto","Imperfect","I got, was getting","lograra","lograras","lograra","lográramos","lograrais","lograran","logrando","getting","logrado","got"]
["lograr","to get, obtain; to achieve, attain","Subjuntivo","Subjunctive","Futuro","Future","I will get","lograre","lograres","lograre","lográremos","lograreis","lograren","logrando","getting","logrado","got"]
["lograr","to get, obtain; to achieve, attain","Subjuntivo","Subjunctive","Presente perfecto","Present Perfect","I have got, got","haya logrado","hayas logrado","haya logrado","hayamos logrado","hayáis logrado","hayan logrado","logrando","getting","logrado","got"]
["lograr","to get, obtain; to achieve, attain","Subjuntivo","Subjunctive","Futuro perfecto","Future Perfect","I will have got","hubiere logrado","hubieres logrado","hubiere logrado","hubiéremos logrado","hubiereis logrado","hubieren logrado","logrando","getting","logrado","got"]
["lograr","to get, obtain; to achieve, attain","Subjuntivo","Subjunctive","Pluscuamperfecto","Past Perfect","I had got","hubiera logrado","hubieras logrado","hubiera logrado","hubiéramos logrado","hubierais logrado","hubieran logrado","logrando","getting","logrado","got"]
["mandar","to order","Imperativo Afirmativo","Imperative Affirmative","Presente","Present","Order! Don't order!",null,"manda","mandad",null,"mande","manden","mandando","ordering","mandado","ordered"]
["mandar","to order","Imperativo Negativo","Imperative Negative","Presente","Present","Order! Don't order!",null,"no mandes","no mandéis",null,"no mande","no manden","mandando","ordering","mandado","ordered"]
["mandar","to order","Indicativo","Indicative","Presente","Present","I order, am ordering","mando","mandas","manda","mandamos","mandáis","mandan","mandando","ordering","mandado","ordered"]
["mandar","to order","Indicativo","Indicative","Futuro","Future","I will order","mandaré","mandarás","mandará","mandaremos","mandaréis","mandarán","mandando","ordering","mandado","ordered"]
["mandar","to order","Indicativo","Indicative","Imperfecto","Imperfect","I was ordering, used to order, ordered","mandaba","mandabas","mandaba","mandábamos","mandabais","mandaban","mandando","ordering","mandado","ordered"]
["mandar","to order","Indicativo","Indicative","Pretérito","Preterite","I ordered","mandé","mandaste","mandó","mandamos","mandasteis","mandaron","mandando","ordering","mandado","ordered"]
["mandar","to order","Indicativo","Indicative","Condicional","Conditional","I would order","mandaría","mandarías","mandaría","mandaríamos","mandaríais","mandarían","mandando","ordering","mandado","ordered"]
["mandar","to order","Indicativo","Indicative","Presente perfecto","Present Perfect","I have ordered","he mandado","has mandado","ha mandado","hemos mandado","habéis mandado","han mandado","mandando","ordering","mandado","ordered"]
["mandar","to order","Indicativo","Indicative","Futuro perfecto","Future Perfect","I will have ordered","habré mandado","habrás mandado","habrá mandado","habremos mandado","habréis mandado","habrán mandado","mandando","ordering","mandado","ordered"]
["mandar","to order","Indicativo","Indicative","Pluscuamperfecto","Past Perfect","I had ordered","había mandado","habías mandado","había mandado","habíamos mandado","habíais mandado","habían mandado","mandando","ordering","mandado","ordered"]
["mandar","to order","Indicativo","Indicative","Pretérito anterior","Preterite (Archaic)","I had ordered","hube mandado","hubiste mandado","hubo mandado","hubimos mandado","hubisteis mandado","hubieron mandado","mandando","ordering","mandado","ordered"]
["mandar","to order","Indicativo","Indicative","Condicional perfecto","Conditional Perfect","I would have ordered","habría mandado","habrías mandado","habría mandado","habríamos mandado","habríais mandado","habrían mandado","mandando","ordering","mandado","ordered"]
["mandar","to order","Subjuntivo","Subjunctive","Presente","Present","I order, am ordering","mande","mandes","mande","mandemos","mandéis","manden","mandando","ordering","mandado","ordered"]
["mandar","to order","Subjuntivo","Subjunctive","Imperfecto","Imperfect","I ordered, was ordering","mandara","mandaras","mandara","mandáramos","mandarais","mandaran","mandando","ordering","mandado","ordered"]
["mandar","to order","Subjuntivo","Subjunctive","Futuro","Future","I will order","mandare","mandares","mandare","mandáremos","mandareis","mandaren","mandando","ordering","mandado","ordered"]
["mandar","to order","Subjuntivo","Subjunctive","Presente perfecto","Present Perfect","I have ordered, ordered","haya mandado","hayas mandado","haya mandado","hayamos mandado","hayáis mandado","hayan mandado","mandando","ordering","mandado","ordered"]
["mandar","to order","Subjuntivo","Subjunctive","Futuro perfecto","Future Perfect","I will have ordered","hubiere mandado","hubieres mandado","hubiere mandado","hubiéremos mandado","hubiereis mandado","hubieren mandado","mandando","ordering","mandado","ordered"]
["mandar","to order","Subjuntivo","Subjunctive","Pluscuamperfecto","Past Perfect","I had ordered","hubiera mandado","hubieras mandado","hubiera mandado","hubiéramos mandado","hubierais mandado","hubieran mandado","mandando","ordering","mandado","ordered"]
["mantener","to maintain, get","Imperativo Afirmativo","Imperative Affirmative","Presente","Present","Maintain! Don't maintain!",null,"mantén","mantened",null,"mantenga","mantengan","manteniendo","maintaining","mantenido","maintained"]
["mantener","to maintain, get","Imperativo Negativo","Imperative Negative","Presente","Present","Maintain! Don't maintain!",null,"no mantengas","no mantengáis",null,"no mantenga","no mantengan","manteniendo","maintaining","mantenido","maintained"]
["mantener","to maintain, get","Indicativo","Indicative","Presente","Present","I maintain, am maintaining","mantengo","mantienes","mantiene","mantenemos","mantenéis","mantienen","manteniendo","maintaining","mantenido","maintained"]
["mantener","to maintain, get","Indicativo","Indicative","Futuro","Future","I will maintain","mantendré","mantendrás","mantendrá","mantendremos","mantendréis","mantendrán","manteniendo","maintaining","mantenido","maintained"]
["mantener","to maintain, get","Indicativo","Indicative","Imperfecto","Imperfect","I was maintaining, used to maintain, maintained","mantenía","mantenías","mantenía","manteníamos","manteníais","mantenían","manteniendo","maintaining","mantenido","maintained"]
["mantener","to maintain, get","Indicativo","Indicative","Pretérito","Preterite","I maintained","mantuve","mantuviste","mantuvo","mantuvimos","mantuvisteis","mantuvieron","manteniendo","maintaining","mantenido","maintained"]
["mantener","to maintain, get","Indicativo","Indicative","Condicional","Conditional","I would maintain","mantendría","mantendrías","mantendría","mantendríamos","mantendríais","mantendrían","manteniendo","maintaining","mantenido","maintained"]
["mantener","to maintain, get","Indicativo","Indicative","Presente perfecto","Present Perfect","I have maintained","he mantenido","has mantenido","ha mantenido","hemos mantenido","habéis mantenido","han mantenido","manteniendo","maintaining","mantenido","maintained"]
["mantener","to maintain, get","Indicativo","Indicative","Futuro perfecto","Future Perfect","I will have maintained","habré mantenido","habrás mantenido","habrá mantenido","habremos mantenido","habréis mantenido","habrán mantenido","manteniendo","maintaining","mantenido","maintained"]
["mantener","to maintain, get","Indicativo","Indicative","Pluscuamperfecto","Past Perfect","I had maintained","había mantenido","habías mantenido","había mantenido","habíamos mantenido","habíais mantenido","habían mantenido","manteniendo","maintaining","mantenido","maintained"]
["mantener","to maintain, get","Indicativo","Indicative","Pretérito anterior","Preterite (Archaic)","I had maintained","hube mantenido","hubiste mantenido","hubo mantenido","hubimos mantenido","hubisteis mantenido","hubieron mantenido","manteniendo","maintaining","mantenido","maintained"]
["mantener","to maintain, get","Indicativo","Indicative","Condicional perfecto","Conditional Perfect","I would have maintained","habría mantenido","habrías mantenido","habría mantenido","habríamos mantenido","habríais mantenido","habrían mantenido","manteniendo","maintaining","mantenido","maintained"]
["mantener","to maintain, get","Subjuntivo","Subjunctive","Presente","Present","I maintain, am maintaining","mantenga","mantengas","mantenga","mantengamos","mantengáis","mantengan","manteniendo","maintaining","mantenido","maintained"]
["mantener","to maintain, get","Subjuntivo","Subjunctive","Imperfecto","Imperfect","I maintained, was maintaining","mantuviera","mantuvieras","mantuviera","mantuviéramos","mantuvierais","mantuvieran","manteniendo","maintaining","mantenido","maintained"]
["mantener","to maintain, get","Subjuntivo","Subjunctive","Futuro","Future","I will maintain","mantuviere","mantuvieres","mantuviere","mantuviéremos","mantuviereis","mantuvieren","manteniendo","maintaining","mantenido","maintained"]
["mantener","to maintain, get","Subjuntivo","Subjunctive","Presente perfecto","Present Perfect","I have maintained, maintained","haya mantenido","hayas mantenido","haya mantenido","hayamos mantenido","hayáis mantenido","hayan mantenido","manteniendo","maintaining","mantenido","maintained"]
["mantener","to maintain, get","Subjuntivo","Subjunctive","Futuro perfecto","Future Perfect","I will have maintained","hubiere mantenido","hubieres mantenido","hubiere mantenido","hubiéremos mantenido","hubiereis mantenido","hubieren mantenido","manteniendo","maintaining","mantenido","maintained"]
["mantener","to maintain, get","Subjuntivo","Subjunctive","Pluscuamperfecto","Past Perfect","I had maintained","hubiera mantenido","hubieras mantenido","hubiera mantenido","hubiéramos mantenido","hubierais mantenido","hubieran mantenido","manteniendo","maintaining","mantenido","maintained"]
["marcar","to mark, stamp, to show, indicate; to dial [e.g., a phone]","Imperativo Afirmativo","Imperative Affirmative","Presente","Present","Mark! Don't mark!",null,"marca","marcad",null,"marque","marquen","marcando","marking","marcado","marked"]
["marcar","to mark, stamp, to show, indicate; to dial [e.g., a phone]","Imperativo Negativo","Imperative Negative","Presente","Present","Mark! Don't mark!",null,"no marques","no marquéis",null,"no marque","no marquen","marcando","marking","marcado","marked"]
["marcar","to mark, stamp, to show, indicate; to dial [e.g., a phone]","Indicativo","Indicative","Presente","Present","I mark, am marking","marco","marcas","marca","marcamos","marcáis","marcan","marcando","marking","marcado","marked"]
["marcar","to mark, stamp, to show, indicate; to dial [e.g., a phone]","Indicativo","Indicative","Futuro","Future","I will mark","marcaré","marcarás","marcará","marcaremos","marcaréis","marcarán","marcando","marking","marcado","marked"]
["marcar","to mark, stamp, to show, indicate; to dial [e.g., a phone]","Indicativo","Indicative","Imperfecto","Imperfect","I was marking, used to mark, marked","marcaba","marcabas","marcaba","marcábamos","marcabais","marcaban","marcando","marking","marcado","marked"]
["marcar","to mark, stamp, to show, indicate; to dial [e.g., a phone]","Indicativo","Indicative","Pretérito","Preterite","I marked","marqué","marcaste","marcó","marcamos","marcasteis","marcaron","marcando","marking","marcado","marked"]
["marcar","to mark, stamp, to show, indicate; to dial [e.g., a phone]","Indicativo","Indicative","Condicional","Conditional","I would mark","marcaría","marcarías","marcaría","marcaríamos","marcaríais","marcarían","marcando","marking","marcado","marked"]
["marcar","to mark, stamp, to show, indicate; to dial [e.g., a phone]","Indicativo","Indicative","Presente perfecto","Present Perfect","I have marked","he marcado","has marcado","ha marcado","hemos marcado","habéis marcado","han marcado","marcando","marking","marcado","marked"]
["marcar","to mark, stamp, to show, indicate; to dial [e.g., a phone]","Indicativo","Indicative","Futuro perfecto","Future Perfect","I will have marked","habré marcado","habrás marcado","habrá marcado","habremos marcado","habréis marcado","habrán marcado","marcando","marking","marcado","marked"]
["marcar","to mark, stamp, to show, indicate; to dial [e.g., a phone]","Indicativo","Indicative","Pluscuamperfecto","Past Perfect","I had marked","había marcado","habías marcado","había marcado","habíamos marcado","habíais marcado","habían marcado","marcando","marking","marcado","marked"]
["marcar","to mark, stamp, to show, indicate; to dial [e.g., a phone]","Indicativo","Indicative","Pretérito anterior","Preterite (Archaic)","I had marked","hube marcado","hubiste marcado","hubo marcado","hubimos marcado","hubisteis marcado","hubieron marcado","marcando","marking","marcado","marked"]
["marcar","to mark, stamp, to show, indicate; to dial [e.g., a phone]","Indicativo","Indicative","Condicional perfecto","Conditional Perfect","I would have marked","habría marcado","habrías marcado","habría marcado","habríamos marcado","habríais marcado","habrían marcado","marcando","marking","marcado","marked"]
["marcar","to mark, stamp, to show, indicate; to dial [e.g., a phone]","Subjuntivo","Subjunctive","Presente","Present","I mark, am marking","marque","marques","marque","marquemos","marquéis","marquen","marcando","marking","marcado","marked"]
["marcar","to mark, stamp, to show, indicate; to dial [e.g., a phone]","Subjuntivo","Subjunctive","Imperfecto","Imperfect","I marked, was marking","marcara","marcaras","marcara","marcáramos","marcarais","marcaran","marcando","marking","marcado","marked"]
["marcar","to mark, stamp, to show, indicate; to dial [e.g., a phone]","Subjuntivo","Subjunctive","Futuro","Future","I will mark","marcare","marcares","marcare","marcáremos","marcareis","marcaren","marcando","marking","marcado","marked"]
["marcar","to mark, stamp, to show, indicate; to dial [e.g., a phone]","Subjuntivo","Subjunctive","Presente perfecto","Present Perfect","I have marked, marked","haya marcado","hayas marcado","haya marcado","hayamos marcado","hayáis marcado","hayan marcado","marcando","marking","marcado","marked"]
["marcar","to mark, stamp, to show, indicate; to dial [e.g., a phone]","Subjuntivo","Subjunctive","Futuro perfecto","Future Perfect","I will have marked","hubiere marcado","hubieres marcado","hubiere marcado","hubiéremos marcado","hubiereis marcado","hubieren marcado","marcando","marking","marcado","marked"]
["marcar","to mark, stamp, to show, indicate; to dial [e.g., a phone]","Subjuntivo","Subjunctive","Pluscuamperfecto","Past Perfect","I had marked","hubiera marcado","hubieras marcado","hubiera marcado","hubiéramos marcado","hubierais marcado","hubieran marcado","marcando","marking","marcado","marked"]
["matar","to kill, slay, slaughter","Imperativo Afirmativo","Imperative Affirmative","Presente","Present","Kill! Don't kill!",null,"mata","matad",null,"mate","maten","matando","killing","matado","killed"]
["matar","to kill, slay, slaughter","Imperativo Negativo","Imperative Negative","Presente","Present","Kill! Don't kill!",null,"no mates","no matéis",null,"no mate","no maten","matando","killing","matado","killed"]
["matar","to kill, slay, slaughter","Indicativo","Indicative","Presente","Present","I kill, am killing","mato","matas","mata","matamos","matáis","matan","matando","killing","matado","killed"]
["matar","to kill, slay, slaughter","Indicativo","Indicative","Futuro","Future","I will kill","mataré","matarás","matará","mataremos","mataréis","matarán","matando","killing","matado","killed"]
["matar","to kill, slay, slaughter","Indicativo","Indicative","Imperfecto","Imperfect","I was killing, used to kill, killed","mataba","matabas","mataba","matábamos","matabais","mataban","matando","killing","matado","killed"]
["matar","to kill, slay, slaughter","Indicativo","Indicative","Pretérito","Preterite","I killed","maté","mataste","mató","matamos","matasteis","mataron","matando","killing","matado","killed"]
["matar","to kill, slay, slaughter","Indicativo","Indicative","Condicional","Conditional","I would kill","mataría","matarías","mataría","mataríamos","mataríais","matarían","matando","killing","matado","killed"]
["matar","to kill, slay, slaughter","Indicativo","Indicative","Presente perfecto","Present Perfect","I have killed","he matado","has matado","ha matado","hemos matado","habéis matado","han matado","matando","killing","matado","killed"]
["matar","to kill, slay, slaughter","Indicativo","Indicative","Futuro perfecto","Future Perfect","I will have killed","habré matado","habrás matado","habrá matado","habremos matado","habréis matado","habrán matado","matando","killing","matado","killed"]
["matar","to kill, slay, slaughter","Indicativo","Indicative","Pluscuamperfecto","Past Perfect","I had killed","había matado","habías matado","había matado","habíamos matado","habíais matado","habían matado","matando","killing","matado","killed"]
["matar","to kill, slay, slaughter","Indicativo","Indicative","Pretérito anterior","Preterite (Archaic)","I had killed","hube matado","hubiste matado","hubo matado","hubimos matado","hubisteis matado","hubieron matado","matando","killing","matado","killed"]
["matar","to kill, slay, slaughter","Indicativo","Indicative","Condicional perfecto","Conditional Perfect","I would have killed","habría matado","habrías matado","habría matado","habríamos matado","habríais matado","habrían matado","matando","killing","matado","killed"]
["matar","to kill, slay, slaughter","Subjuntivo","Subjunctive","Presente","Present","I kill, am killing","mate","mates","mate","matemos","matéis","maten","matando","killing","matado","killed"]
["matar","to kill, slay, slaughter","Subjuntivo","Subjunctive","Imperfecto","Imperfect","I killed, was killing","matara","mataras","matara","matáramos","matarais","mataran","matando","killing","matado","killed"]
["matar","to kill, slay, slaughter","Subjuntivo","Subjunctive","Futuro","Future","I will kill","matare","matares","matare","matáremos","matareis","mataren","matando","killing","matado","killed"]
["matar","to kill, slay, slaughter","Subjuntivo","Subjunctive","Presente perfecto","Present Perfect","I have killed, killed","haya matado","hayas matado","haya matado","hayamos matado","hayáis matado","hayan matado","matando","killing","matado","killed"]
["matar","to kill, slay, slaughter","Subjuntivo","Subjunctive","Futuro perfecto","Future Perfect","I will have killed","hubiere matado","hubieres matado","hubiere matado","hubiéremos matado","hubiereis matado","hubieren matado","matando","killing","matado","killed"]
["matar","to kill, slay, slaughter","Subjuntivo","Subjunctive","Pluscuamperfecto","Past Perfect","I had killed","hubiera matado","hubieras matado","hubiera matado","hubiéramos matado","hubierais matado","hubieran matado","matando","killing","matado","killed"]
["merecer","to deserve, merit","Imperativo Afirmativo","Imperative Affirmative","Presente","Present","Deserve! Don't deserve!",null,"merece","mereced",null,"merezca","merezcan","mereciendo","deserving","merecido","deserved"]
["merecer","to deserve, merit","Imperativo Negativo","Imperative Negative","Presente","Present","Deserve! Don't deserve!",null,"no merezcas","no merezcáis",null,"no merezca","no merezcan","mereciendo","deserving","merecido","deserved"]
["merecer","to deserve, merit","Indicativo","Indicative","Presente","Present","I deserve, am deserving","merezco","mereces","merece","merecemos","merecéis","merecen","mereciendo","deserving","merecido","deserved"]
["merecer","to deserve, merit","Indicativo","Indicative","Futuro","Future","I will deserve","mereceré","merecerás","merecerá","mereceremos","mereceréis","merecerán","mereciendo","deserving","merecido","deserved"]
["merecer","to deserve, merit","Indicativo","Indicative","Imperfecto","Imperfect","I was deserving, used to deserve, deserved","merecía","merecías","merecía","merecíamos","merecíais","merecían","mereciendo","deserving","merecido","deserved"]
["merecer","to deserve, merit","Indicativo","Indicative","Pretérito","Preterite","I deserved","merecí","mereciste","mereció","merecimos","merecisteis","merecieron","mereciendo","deserving","merecido","deserved"]
["merecer","to deserve, merit","Indicativo","Indicative","Condicional","Conditional","I would deserve","merecería","merecerías","merecería","mereceríamos","mereceríais","merecerían","mereciendo","deserving","merecido","deserved"]
["merecer","to deserve, merit","Indicativo","Indicative","Presente perfecto","Present Perfect","I have deserved","he merecido","has merecido","ha merecido","hemos merecido","habéis merecido","han merecido","mereciendo","deserving","merecido","deserved"]
["merecer","to deserve, merit","Indicativo","Indicative","Futuro perfecto","Future Perfect","I will have deserved","habré merecido","habrás merecido","habrá merecido","habremos merecido","habréis merecido","habrán merecido","mereciendo","deserving","merecido","deserved"]
["merecer","to deserve, merit","Indicativo","Indicative","Pluscuamperfecto","Past Perfect","I had deserved","había merecido","habías merecido","había merecido","habíamos merecido","habíais merecido","habían merecido","mereciendo","deserving","merecido","deserved"]
["merecer","to deserve, merit","Indicativo","Indicative","Pretérito anterior","Preterite (Archaic)","I had deserved","hube merecido","hubiste merecido","hubo merecido","hubimos merecido","hubisteis merecido","hubieron merecido","mereciendo","deserving","merecido","deserved"]
["merecer","to deserve, merit","Indicativo","Indicative","Condicional perfecto","Conditional Perfect","I would have deserved","habría merecido","habrías merecido","habría merecido","habríamos merecido","habríais merecido","habrían merecido","mereciendo","deserving","merecido","deserved"]
["merecer","to deserve, merit","Subjuntivo","Subjunctive","Presente","Present","I deserve, am deserving","merezca","merezcas","merezca","merezcamos","merezcáis","merezcan","mereciendo","deserving","merecido","deserved"]
["merecer","to deserve, merit","Subjuntivo","Subjunctive","Imperfecto","Imperfect","I deserved, was deserving","mereciera","merecieras","mereciera","mereciéramos","merecierais","merecieran","mereciendo","deserving","merecido","deserved"]
["merecer","to deserve, merit","Subjuntivo","Subjunctive","Futuro","Future","I will deserve","mereciere","merecieres","mereciere","mereciéremos","mereciereis","merecieren","mereciendo","deserving","merecido","deserved"]
["merecer","to deserve, merit","Subjuntivo","Subjunctive","Presente perfecto","Present Perfect","I have deserved, deserved","haya merecido","hayas merecido","haya merecido","hayamos merecido","hayáis merecido","hayan merecido","mereciendo","deserving","merecido","deserved"]
["merecer","to deserve, merit","Subjuntivo","Subjunctive","Futuro perfecto","Future Perfect","I will have deserved","hubiere merecido","hubieres merecido","hubiere merecido","hubiéremos merecido","hubiereis merecido","hubieren merecido","mereciendo","deserving","merecido","deserved"]
["merecer","to deserve, merit","Subjuntivo","Subjunctive","Pluscuamperfecto","Past Perfect","I had deserved","hubiera merecido","hubieras merecido","hubiera merecido","hubiéramos merecido","hubierais merecido","hubieran merecido","mereciendo","deserving","merecido","deserved"]
["meter","to put [in], place, insert","Imperativo Afirmativo","Imperative Affirmative","Presente","Present","Put! Don't put!",null,"mete","meted",null,"meta","metan","metiendo","putting","metido","put"]
["meter","to put [in], place, insert","Imperativo Negativo","Imperative Negative","Presente","Present","Put! Don't put!",null,"no metas","no metáis",null,"no meta","no metan","metiendo","putting","metido","put"]
["meter","to put [in], place, insert","Indicativo","Indicative","Presente","Present","I put, am putting","meto","metes","mete","metemos","metéis","meten","metiendo","putting","metido","put"]
["meter","to put [in], place, insert","Indicativo","Indicative","Futuro","Future","I will put","meteré","meterás","meterá","meteremos","meteréis","meterán","metiendo","putting","metido","put"]
["meter","to put [in], place, insert","Indicativo","Indicative","Imperfecto","Imperfect","I was putting, used to put, put","metía","metías","metía","metíamos","metíais","metían","metiendo","putting","metido","put"]
["meter","to put [in], place, insert","Indicativo","Indicative","Pretérito","Preterite","I put","metí","metiste","metió","metimos","metisteis","metieron","metiendo","putting","metido","put"]
["meter","to put [in], place, insert","Indicativo","Indicative","Condicional","Conditional","I would put","metería","meterías","metería","meteríamos","meteríais","meterían","metiendo","putting","metido","put"]
["meter","to put [in], place, insert","Indicativo","Indicative","Presente perfecto","Present Perfect","I have put","he metido","has metido","ha metido","hemos metido","habéis metido","han metido","metiendo","putting","metido","put"]
["meter","to put [in], place, insert","Indicativo","Indicative","Futuro perfecto","Future Perfect","I will have put","habré metido","habrás metido","habrá metido","habremos metido","habréis metido","habrán metido","metiendo","putting","metido","put"]
["meter","to put [in], place, insert","Indicativo","Indicative","Pluscuamperfecto","Past Perfect","I had put","había metido","habías metido","había metido","habíamos metido","habíais metido","habían metido","metiendo","putting","metido","put"]
["meter","to put [in], place, insert","Indicativo","Indicative","Pretérito anterior","Preterite (Archaic)","I had put","hube metido","hubiste metido","hubo metido","hubimos metido","hubisteis metido","hubieron metido","metiendo","putting","metido","put"]
["meter","to put [in], place, insert","Indicativo","Indicative","Condicional perfecto","Conditional Perfect","I would have put","habría metido","habrías metido","habría metido","habríamos metido","habríais metido","habrían metido","metiendo","putting","metido","put"]
["meter","to put [in], place, insert","Subjuntivo","Subjunctive","Presente","Present","I put, am putting","meta","metas","meta","metamos","metáis","metan","metiendo","putting","metido","put"]
["meter","to put [in], place, insert","Subjuntivo","Subjunctive","Imperfecto","Imperfect","I put, was putting","metiera","metieras","metiera","metiéramos","metierais","metieran","metiendo","putting","metido","put"]
["meter","to put [in], place, insert","Subjuntivo","Subjunctive","Futuro","Future","I will put","metiere","metieres","metiere","metiéremos","metiereis","metieren","metiendo","putting","metido","put"]
["meter","to put [in], place, insert","Subjuntivo","Subjunctive","Presente perfecto","Present Perfect","I have put, put","haya metido","hayas metido","haya metido","hayamos metido","hayáis metido","hayan metido","metiendo","putting","metido","put"]
["meter","to put [in], place, insert","Subjuntivo","Subjunctive","Futuro perfecto","Future Perfect","I will have put","hubiere metido","hubieres metido","hubiere metido","hubiéremos metido","hubiereis metido","hubieren metido","metiendo","putting","metido","put"]
["meter","to put [in], place, insert","Subjuntivo","Subjunctive","Pluscuamperfecto","Past Perfect","I had put","hubiera metido","hubieras metido","hubiera metido","hubiéramos metido","hubierais metido","hubieran metido","metiendo","putting","metido","put"]
["mirar","to watch, look at","Imperativo Afirmativo","Imperative Affirmative","Presente","Present","Watch! Don't watch!",null,"mira","mirad",null,"mire","miren","mirando","watching","mirado","watched"]
["mirar","to watch, look at","Imperativo Negativo","Imperative Negative","Presente","Present","Watch! Don't watch!",null,"no mires","no miréis",null,"no mire","no miren","mirando","watching","mirado","watched"]
["mirar","to watch, look at","Indicativo","Indicative","Presente","Present","I watch, am watching","miro","miras","mira","miramos","miráis","miran","mirando","watching","mirado","watched"]
["mirar","to watch, look at","Indicativo","Indicative","Futuro","Future","I will watch","miraré","mirarás","mirará","miraremos","miraréis","mirarán","mirando","watching","mirado","watched"]
["mirar","to watch, look at","Indicativo","Indicative","Imperfecto","Imperfect","I was watching, used to watch, watched","miraba","mirabas","miraba","mirábamos","mirabais","miraban","mirando","watching","mirado","watched"]
["mirar","to watch, look at","Indicativo","Indicative","Pretérito","Preterite","I watched","miré","miraste","miró","miramos","mirasteis","miraron","mirando","watching","mirado","watched"]
["mirar","to watch, look at","Indicativo","Indicative","Condicional","Conditional","I would watch","miraría","mirarías","miraría","miraríamos","miraríais","mirarían","mirando","watching","mirado","watched"]
["mirar","to watch, look at","Indicativo","Indicative","Presente perfecto","Present Perfect","I have watched","he mirado","has mirado","ha mirado","hemos mirado","habéis mirado","han mirado","mirando","watching","mirado","watched"]
["mirar","to watch, look at","Indicativo","Indicative","Futuro perfecto","Future Perfect","I will have watched","habré mirado","habrás mirado","habrá mirado","habremos mirado","habréis mirado","habrán mirado","mirando","watching","mirado","watched"]
["mirar","to watch, look at","Indicativo","Indicative","Pluscuamperfecto","Past Perfect","I had watched","había mirado","habías mirado","había mirado","habíamos mirado","habíais mirado","habían mirado","mirando","watching","mirado","watched"]
["mirar","to watch, look at","Indicativo","Indicative","Pretérito anterior","Preterite (Archaic)","I had watched","hube mirado","hubiste mirado","hubo mirado","hubimos mirado","hubisteis mirado","hubieron mirado","mirando","watching","mirado","watched"]
["mirar","to watch, look at","Indicativo","Indicative","Condicional perfecto","Conditional Perfect","I would have watched","habría mirado","habrías mirado","habría mirado","habríamos mirado","habríais mirado","habrían mirado","mirando","watching","mirado","watched"]
["mirar","to watch, look at","Subjuntivo","Subjunctive","Presente","Present","I watch, am watching","mire","mires","mire","miremos","miréis","miren","mirando","watching","mirado","watched"]
["mirar","to watch, look at","Subjuntivo","Subjunctive","Imperfecto","Imperfect","I watched, was watching","mirara","miraras","mirara","miráramos","mirarais","miraran","mirando","watching","mirado","watched"]
["mirar","to watch, look at","Subjuntivo","Subjunctive","Futuro","Future","I will watch","mirare","mirares","mirare","miráremos","mirareis","miraren","mirando","watching","mirado","watched"]
["mirar","to watch, look at","Subjuntivo","Subjunctive","Presente perfecto","Present Perfect","I have watched, watched","haya mirado","hayas mirado","haya mirado","hayamos mirado","hayáis mirado","hayan mirado","mirando","watching","mirado","watched"]
["mirar","to watch, look at","Subjuntivo","Subjunctive","Futuro perfecto","Future Perfect","I will have watched","hubiere mirado","hubieres mirado","hubiere mirado","hubiéremos mirado","hubiereis mirado","hubieren mirado","mirando","watching","mirado","watched"]
["mirar","to watch, look at","Subjuntivo","Subjunctive","Pluscuamperfecto","Past Perfect","I had watched","hubiera mirado","hubieras mirado","hubiera mirado","hubiéramos mirado","hubierais mirado","hubieran mirado","mirando","watching","mirado","watched"]
["morir","to die","Imperativo Afirmativo","Imperative Affirmative","Presente","Present","Die! Don't die!",null,"muere","morid",null,"muera","mueran","muriendo","dying","muerto","died"]
["morir","to die","Imperativo Negativo","Imperative Negative","Presente","Present","Die! Don't die!",null,"no mueras","no muráis",null,"no muera","no mueran","muriendo","dying","muerto","died"]
["morir","to die","Indicativo","Indicative","Presente","Present","I die, am dying","muero","mueres","muere","morimos","morís","mueren","muriendo","dying","muerto","died"]
["morir","to die","Indicativo","Indicative","Futuro","Future","I will die","moriré","morirás","morirá","moriremos","moriréis","morirán","muriendo","dying","muerto","died"]
["morir","to die","Indicativo","Indicative","Imperfecto","Imperfect","I was dying, used to die, died","moría","morías","moría","moríamos","moríais","morían","muriendo","dying","muerto","died"]
["morir","to die","Indicativo","Indicative","Pretérito","Preterite","I died","morí","moriste","murió","morimos","moristeis","murieron","muriendo","dying","muerto","died"]
["morir","to die","Indicativo","Indicative","Condicional","Conditional","I would die","moriría","morirías","moriría","moriríamos","moriríais","morirían","muriendo","dying","muerto","died"]
["morir","to die","Indicativo","Indicative","Presente perfecto","Present Perfect","I have died","he muerto","has muerto","ha muerto","hemos muerto","habéis muerto","han muerto","muriendo","dying","muerto","died"]
["morir","to die","Indicativo","Indicative","Futuro perfecto","Future Perfect","I will have died","habré muerto","habrás muerto","habrá muerto","habremos muerto","habréis muerto","habrán muerto","muriendo","dying","muerto","died"]
["morir","to die","Indicativo","Indicative","Pluscuamperfecto","Past Perfect","I had died","había muerto","habías muerto","había muerto","habíamos muerto","habíais muerto","habían muerto","muriendo","dying","muerto","died"]
["morir","to die","Indicativo","Indicative","Pretérito anterior","Preterite (Archaic)","I had died","hube muerto","hubiste muerto","hubo muerto","hubimos muerto","hubisteis muerto","hubieron muerto","muriendo","dying","muerto","died"]
["morir","to die","Indicativo","Indicative","Condicional perfecto","Conditional Perfect","I would have died","habría muerto","habrías muerto","habría muerto","habríamos muerto","habríais muerto","habrían muerto","muriendo","dying","muerto","died"]
["morir","to die","Subjuntivo","Subjunctive","Presente","Present","I die, am dying","muera","mueras","muera","muramos","muráis","mueran","muriendo","dying","muerto","died"]
["morir","to die","Subjuntivo","Subjunctive","Imperfecto","Imperfect","I died, was dying","muriera","murieras","muriera","muriéramos","murierais","murieran","muriendo","dying","muerto","died"]
["morir","to die","Subjuntivo","Subjunctive","Futuro","Future","I will die","muriere","murieres","muriere","muriéremos","muriereis","murieren","muriendo","dying","muerto","died"]
["morir","to die","Subjuntivo","Subjunctive","Presente perfecto","Present Perfect","I have died, died","haya muerto","hayas muerto","haya muerto","hayamos muerto","hayáis muerto","hayan muerto","muriendo","dying","muerto","died"]
["morir","to die","Subjuntivo","Subjunctive","Futuro perfecto","Future Perfect","I will have died","hubiere muerto","hubieres muerto","hubiere muerto","hubiéremos muerto","hubiereis muerto","hubieren muerto","muriendo","dying","muerto","died"]
["morir","to die","Subjuntivo","Subjunctive","Pluscuamperfecto","Past Perfect","I had died","hubiera muerto","hubieras muerto","hubiera muerto","hubiéramos muerto","hubierais muerto","hubieran muerto","muriendo","dying","muerto","died"]
["mostrar","to show","Imperativo Afirmativo","Imperative Affirmative","Presente","Present","Show! Don't show!",null,"muestra","mostrad",null,"muestre","muestren","mostrando","showing","mostrado","shown"]
["mostrar","to show","Imperativo Negativo","Imperative Negative","Presente","Present","Show! Don't show!",null,"no muestres","no mostréis",null,"no muestre","no muestren","mostrando","showing","mostrado","shown"]
["mostrar","to show","Indicativo","Indicative","Presente","Present","I show, am showing","muestro","muestras","muestra","mostramos","mostráis","muestran","mostrando","showing","mostrado","shown"]
["mostrar","to show","Indicativo","Indicative","Futuro","Future","I will show","mostraré","mostrarás","mostrará","mostraremos","mostraréis","mostrarán","mostrando","showing","mostrado","shown"]
["mostrar","to show","Indicativo","Indicative","Imperfecto","Imperfect","I was showing, used to show, showed","mostraba","mostrabas","mostraba","mostrábamos","mostrabais","mostraban","mostrando","showing","mostrado","shown"]
["mostrar","to show","Indicativo","Indicative","Pretérito","Preterite","I showed","mostré","mostraste","mostró","mostramos","mostrasteis","mostraron","mostrando","showing","mostrado","shown"]
["mostrar","to show","Indicativo","Indicative","Condicional","Conditional","I would show","mostraría","mostrarías","mostraría","mostraríamos","mostraríais","mostrarían","mostrando","showing","mostrado","shown"]
["mostrar","to show","Indicativo","Indicative","Presente perfecto","Present Perfect","I have shown","he mostrado","has mostrado","ha mostrado","hemos mostrado","habéis mostrado","han mostrado","mostrando","showing","mostrado","shown"]
["mostrar","to show","Indicativo","Indicative","Futuro perfecto","Future Perfect","I will have shown","habré mostrado","habrás mostrado","habrá mostrado","habremos mostrado","habréis mostrado","habrán mostrado","mostrando","showing","mostrado","shown"]
["mostrar","to show","Indicativo","Indicative","Pluscuamperfecto","Past Perfect","I had shown","había mostrado","habías mostrado","había mostrado","habíamos mostrado","habíais mostrado","habían mostrado","mostrando","showing","mostrado","shown"]
["mostrar","to show","Indicativo","Indicative","Pretérito anterior","Preterite (Archaic)","I had shown","hube mostrado","hubiste mostrado","hubo mostrado","hubimos mostrado","hubisteis mostrado","hubieron mostrado","mostrando","showing","mostrado","shown"]
["mostrar","to show","Indicativo","Indicative","Condicional perfecto","Conditional Perfect","I would have shown","habría mostrado","habrías mostrado","habría mostrado","habríamos mostrado","habríais mostrado","habrían mostrado","mostrando","showing","mostrado","shown"]
["mostrar","to show","Subjuntivo","Subjunctive","Presente","Present","I show, am showing","muestre","muestres","muestre","mostremos","mostréis","muestren","mostrando","showing","mostrado","shown"]
["mostrar","to show","Subjuntivo","Subjunctive","Imperfecto","Imperfect","I showed, was showing","mostrara","mostraras","mostrara","mostráramos","mostrarais","mostraran","mostrando","showing","mostrado","shown"]
["mostrar","to show","Subjuntivo","Subjunctive","Futuro","Future","I will show","mostrare","mostrares","mostrare","mostráremos","mostrareis","mostraren","mostrando","showing","mostrado","shown"]
["mostrar","to show","Subjuntivo","Subjunctive","Presente perfecto","Present Perfect","I have shown, showed","haya mostrado","hayas mostrado","haya mostrado","hayamos mostrado","hayáis mostrado","hayan mostrado","mostrando","showing","mostrado","shown"]
["mostrar","to show","Subjuntivo","Subjunctive","Futuro perfecto","Future Perfect","I will have shown","hubiere mostrado","hubieres mostrado","hubiere mostrado","hubiéremos mostrado","hubiereis mostrado","hubieren mostrado","mostrando","showing","mostrado","shown"]
["mostrar","to show","Subjuntivo","Subjunctive","Pluscuamperfecto","Past Perfect","I had shown","hubiera mostrado","hubieras mostrado","hubiera mostrado","hubiéramos mostrado","hubierais mostrado","hubieran mostrado","mostrando","showing","mostrado","shown"]
["mover","to move","Imperativo Afirmativo","Imperative Affirmative","Presente","Present","Move! Don't move!",null,"mueve","moved",null,"mueva","muevan","moviendo","moving","movido","moved"]
["mover","to move","Imperativo Negativo","Imperative Negative","Presente","Present","Move! Don't move!",null,"no muevas","no mováis",null,"no mueva","no muevan","moviendo","moving","movido","moved"]
["mover","to move","Indicativo","Indicative","Presente","Present","I move, am moving","muevo","mueves","mueve","movemos","movéis","mueven","moviendo","moving","movido","moved"]
["mover","to move","Indicativo","Indicative","Futuro","Future","I will move","moveré","moverás","moverá","moveremos","moveréis","moverán","moviendo","moving","movido","moved"]
["mover","to move","Indicativo","Indicative","Imperfecto","Imperfect","I was moving, used to move, moved","movía","movías","movía","movíamos","movíais","movían","moviendo","moving","movido","moved"]
["mover","to move","Indicativo","Indicative","Pretérito","Preterite","I moved","moví","moviste","movió","movimos","movisteis","movieron","moviendo","moving","movido","moved"]
["mover","to move","Indicativo","Indicative","Condicional","Conditional","I would move","movería","moverías","movería","moveríamos","moveríais","moverían","moviendo","moving","movido","moved"]
["mover","to move","Indicativo","Indicative","Presente perfecto","Present Perfect","I have moved","he movido","has movido","ha movido","hemos movido","habéis movido","han movido","moviendo","moving","movido","moved"]
["mover","to move","Indicativo","Indicative","Futuro perfecto","Future Perfect","I will have moved","habré movido","habrás movido","habrá movido","habremos movido","habréis movido","habrán movido","moviendo","moving","movido","moved"]
["mover","to move","Indicativo","Indicative","Pluscuamperfecto","Past Perfect","I had moved","había movido","habías movido","había movido","habíamos movido","habíais movido","habían movido","moviendo","moving","movido","moved"]
["mover","to move","Indicativo","Indicative","Pretérito anterior","Preterite (Archaic)","I had moved","hube movido","hubiste movido","hubo movido","hubimos movido","hubisteis movido","hubieron movido","moviendo","moving","movido","moved"]
["mover","to move","Indicativo","Indicative","Condicional perfecto","Conditional Perfect","I would have moved","habría movido","habrías movido","habría movido","habríamos movido","habríais movido","habrían movido","moviendo","moving","movido","moved"]
["mover","to move","Subjuntivo","Subjunctive","Presente","Present","I move, am moving","mueva","muevas","mueva","movamos","mováis","muevan","moviendo","moving","movido","moved"]
["mover","to move","Subjuntivo","Subjunctive","Imperfecto","Imperfect","I moved, was moving","moviera","movieras","moviera","moviéramos","movierais","movieran","moviendo","moving","movido","moved"]
["mover","to move","Subjuntivo","Subjunctive","Futuro","Future","I will move","moviere","movieres","moviere","moviéremos","moviereis","movieren","moviendo","moving","movido","moved"]
["mover","to move","Subjuntivo","Subjunctive","Presente perfecto","Present Perfect","I have moved, moved","haya movido","hayas movido","haya movido","hayamos movido","hayáis movido","hayan movido","moviendo","moving","movido","moved"]
["mover","to move","Subjuntivo","Subjunctive","Futuro perfecto","Future Perfect","I will have moved","hubiere movido","hubieres movido","hubiere movido","hubiéremos movido","hubiereis movido","hubieren movido","moviendo","moving","movido","moved"]
["mover","to move","Subjuntivo","Subjunctive","Pluscuamperfecto","Past Perfect","I had moved","hubiera movido","hubieras movido","hubiera movido","hubiéramos movido","hubierais movido","hubieran movido","moviendo","moving","movido","moved"]
["nacer","to be born","Imperativo Afirmativo","Imperative Affirmative","Presente","Present","Be born! Don't be born!",null,"nace","naced",null,"nazca","nazcan","naciendo","being born","nacido","(been) born"]
["nacer","to be born","Imperativo Negativo","Imperative Negative","Presente","Present","Be born! Don't be born!",null,"no nazcas","no nazcáis",null,"no nazca","no nazcan","naciendo","being born","nacido","(been) born"]
["nacer","to be born","Indicativo","Indicative","Presente","Present","I am born, am being born","nazco","naces","nace","nacemos","nacéis","nacen","naciendo","being born","nacido","(been) born"]
["nacer","to be born","Indicativo","Indicative","Futuro","Future","I will be born","naceré","nacerás","nacerá","naceremos","naceréis","nacerán","naciendo","being born","nacido","(been) born"]
["nacer","to be born","Indicativo","Indicative","Imperfecto","Imperfect","I was being born, used to be born, was born","nacía","nacías","nacía","nacíamos","nacíais","nacían","naciendo","being born","nacido","(been) born"]
["nacer","to be born","Indicativo","Indicative","Pretérito","Preterite","I was born","nací","naciste","nació","nacimos","nacisteis","nacieron","naciendo","being born","nacido","(been) born"]
["nacer","to be born","Indicativo","Indicative","Condicional","Conditional","I would be born","nacería","nacerías","nacería","naceríamos","naceríais","nacerían","naciendo","being born","nacido","(been) born"]
["nacer","to be born","Indicativo","Indicative","Presente perfecto","Present Perfect","I have been born","he nacido","has nacido","ha nacido","hemos nacido","habéis nacido","han nacido","naciendo","being born","nacido","(been) born"]
["nacer","to be born","Indicativo","Indicative","Futuro perfecto","Future Perfect","I will have been born","habré nacido","habrás nacido","habrá nacido","habremos nacido","habréis nacido","habrán nacido","naciendo","being born","nacido","(been) born"]
["nacer","to be born","Indicativo","Indicative","Pluscuamperfecto","Past Perfect","I had been born","había nacido","habías nacido","había nacido","habíamos nacido","habíais nacido","habían nacido","naciendo","being born","nacido","(been) born"]
["nacer","to be born","Indicativo","Indicative","Pretérito anterior","Preterite (Archaic)","I had been born","hube nacido","hubiste nacido","hubo nacido","hubimos nacido","hubisteis nacido","hubieron nacido","naciendo","being born","nacido","(been) born"]
["nacer","to be born","Indicativo","Indicative","Condicional perfecto","Conditional Perfect","I would have been born","habría nacido","habrías nacido","habría nacido","habríamos nacido","habríais nacido","habrían nacido","naciendo","being born","nacido","(been) born"]
["nacer","to be born","Subjuntivo","Subjunctive","Presente","Present","I am born, am being born","nazca","nazcas","nazca","nazcamos","nazcáis","nazcan","naciendo","being born","nacido","(been) born"]
["nacer","to be born","Subjuntivo","Subjunctive","Imperfecto","Imperfect","I was born, was being born","naciera","nacieras","naciera","naciéramos","nacierais","nacieran","naciendo","being born","nacido","(been) born"]
["nacer","to be born","Subjuntivo","Subjunctive","Futuro","Future","I will be born","naciere","nacieres","naciere","naciéremos","naciereis","nacieren","naciendo","being born","nacido","(been) born"]
["nacer","to be born","Subjuntivo","Subjunctive","Presente perfecto","Present Perfect","I have been born, was born","haya nacido","hayas nacido","haya nacido","hayamos nacido","hayáis nacido","hayan nacido","naciendo","being born","nacido","(been) born"]
["nacer","to be born","Subjuntivo","Subjunctive","Futuro perfecto","Future Perfect","I will have been born","hubiere nacido","hubieres nacido","hubiere nacido","hubiéremos nacido","hubiereis nacido","hubieren nacido","naciendo","being born","nacido","(been) born"]
["nacer","to be born","Subjuntivo","Subjunctive","Pluscuamperfecto","Past Perfect","I had been born","hubiera nacido","hubieras nacido","hubiera nacido","hubiéramos nacido","hubierais nacido","hubieran nacido","naciendo","being born","nacido","(been) born"]
["necesitar","to need, require","Imperativo Afirmativo","Imperative Affirmative","Presente","Present","Need! Don't need!",null,"necesita","necesitad",null,"necesite","necesiten","necesitando","needing","necesitado","needed"]
["necesitar","to need, require","Imperativo Negativo","Imperative Negative","Presente","Present","Need! Don't need!",null,"no necesites","no necesitéis",null,"no necesite","no necesiten","necesitando","needing","necesitado","needed"]
["necesitar","to need, require","Indicativo","Indicative","Presente","Present","I need, am needing","necesito","necesitas","necesita","necesitamos","necesitáis","necesitan","necesitando","needing","necesitado","needed"]
["necesitar","to need, require","Indicativo","Indicative","Futuro","Future","I will need","necesitaré","necesitarás","necesitará","necesitaremos","necesitaréis","necesitarán","necesitando","needing","necesitado","needed"]
["necesitar","to need, require","Indicativo","Indicative","Imperfecto","Imperfect","I was needing, used to need, needed","necesitaba","necesitabas","necesitaba","necesitábamos","necesitabais","necesitaban","necesitando","needing","necesitado","needed"]
["necesitar","to need, require","Indicativo","Indicative","Pretérito","Preterite","I needed","necesité","necesitaste","necesitó","necesitamos","necesitasteis","necesitaron","necesitando","needing","necesitado","needed"]
["necesitar","to need, require","Indicativo","Indicative","Condicional","Conditional","I would need","necesitaría","necesitarías","necesitaría","necesitaríamos","necesitaríais","necesitarían","necesitando","needing","necesitado","needed"]
["necesitar","to need, require","Indicativo","Indicative","Presente perfecto","Present Perfect","I have needed","he necesitado","has necesitado","ha necesitado","hemos necesitado","habéis necesitado","han necesitado","necesitando","needing","necesitado","needed"]
["necesitar","to need, require","Indicativo","Indicative","Futuro perfecto","Future Perfect","I will have needed","habré necesitado","habrás necesitado","habrá necesitado","habremos necesitado","habréis necesitado","habrán necesitado","necesitando","needing","necesitado","needed"]
["necesitar","to need, require","Indicativo","Indicative","Pluscuamperfecto","Past Perfect","I had needed","había necesitado","habías necesitado","había necesitado","habíamos necesitado","habíais necesitado","habían necesitado","necesitando","needing","necesitado","needed"]
["necesitar","to need, require","Indicativo","Indicative","Pretérito anterior","Preterite (Archaic)","I had needed","hube necesitado","hubiste necesitado","hubo necesitado","hubimos necesitado","hubisteis necesitado","hubieron necesitado","necesitando","needing","necesitado","needed"]
["necesitar","to need, require","Indicativo","Indicative","Condicional perfecto","Conditional Perfect","I would have needed","habría necesitado","habrías necesitado","habría necesitado","habríamos necesitado","habríais necesitado","habrían necesitado","necesitando","needing","necesitado","needed"]
["necesitar","to need, require","Subjuntivo","Subjunctive","Presente","Present","I need, am needing","necesite","necesites","necesite","necesitemos","necesitéis","necesiten","necesitando","needing","necesitado","needed"]
["necesitar","to need, require","Subjuntivo","Subjunctive","Imperfecto","Imperfect","I needed, was needing","necesitara","necesitaras","necesitara","necesitáramos","necesitarais","necesitaran","necesitando","needing","necesitado","needed"]
["necesitar","to need, require","Subjuntivo","Subjunctive","Futuro","Future","I will need","necesitare","necesitares","necesitare","necesitáremos","necesitareis","necesitaren","necesitando","needing","necesitado","needed"]
["necesitar","to need, require","Subjuntivo","Subjunctive","Presente perfecto","Present Perfect","I have needed, needed","haya necesitado","hayas necesitado","haya necesitado","hayamos necesitado","hayáis necesitado","hayan necesitado","necesitando","needing","necesitado","needed"]
["necesitar","to need, require","Subjuntivo","Subjunctive","Futuro perfecto","Future Perfect","I will have needed","hubiere necesitado","hubieres necesitado","hubiere necesitado","hubiéremos necesitado","hubiereis necesitado","hubieren necesitado","necesitando","needing","necesitado","needed"]
["necesitar","to need, require","Subjuntivo","Subjunctive","Pluscuamperfecto","Past Perfect","I had needed","hubiera necesitado","hubieras necesitado","hubiera necesitado","hubiéramos necesitado","hubierais necesitado","hubieran necesitado","necesitando","needing","necesitado","needed"]
["negar","to deny, refuse","Imperativo Afirmativo","Imperative Affirmative","Presente","Present","Deny! Don't deny!",null,"niega","negad",null,"niegue","nieguen","negando","denying","negado","denied"]
["negar","to deny, refuse","Imperativo Negativo","Imperative Negative","Presente","Present","Deny! Don't deny!",null,"no niegues","no neguéis",null,"no niegue","no nieguen","negando","denying","negado","denied"]
["negar","to deny, refuse","Indicativo","Indicative","Presente","Present","I deny, am denying","niego","niegas","niega","negamos","negáis","niegan","negando","denying","negado","denied"]
["negar","to deny, refuse","Indicativo","Indicative","Futuro","Future","I will deny","negaré","negarás","negará","negaremos","negaréis","negarán","negando","denying","negado","denied"]
["negar","to deny, refuse","Indicativo","Indicative","Imperfecto","Imperfect","I was denying, used to deny, denied","negaba","negabas","negaba","negábamos","negabais","negaban","negando","denying","negado","denied"]
["negar","to deny, refuse","Indicativo","Indicative","Pretérito","Preterite","I denied","negué","negaste","negó","negamos","negasteis","negaron","negando","denying","negado","denied"]
["negar","to deny, refuse","Indicativo","Indicative","Condicional","Conditional","I would deny","negaría","negarías","negaría","negaríamos","negaríais","negarían","negando","denying","negado","denied"]
["negar","to deny, refuse","Indicativo","Indicative","Presente perfecto","Present Perfect","I have denied","he negado","has negado","ha negado","hemos negado","habéis negado","han negado","negando","denying","negado","denied"]
["negar","to deny, refuse","Indicativo","Indicative","Futuro perfecto","Future Perfect","I will have denied","habré negado","habrás negado","habrá negado","habremos negado","habréis negado","habrán negado","negando","denying","negado","denied"]
["negar","to deny, refuse","Indicativo","Indicative","Pluscuamperfecto","Past Perfect","I had denied","había negado","habías negado","había negado","habíamos negado","habíais negado","habían negado","negando","denying","negado","denied"]
["negar","to deny, refuse","Indicativo","Indicative","Pretérito anterior","Preterite (Archaic)","I had denied","hube negado","hubiste negado","hubo negado","hubimos negado","hubisteis negado","hubieron negado","negando","denying","negado","denied"]
["negar","to deny, refuse","Indicativo","Indicative","Condicional perfecto","Conditional Perfect","I would have denied","habría negado","habrías negado","habría negado","habríamos negado","habríais negado","habrían negado","negando","denying","negado","denied"]
["negar","to deny, refuse","Subjuntivo","Subjunctive","Presente","Present","I deny, am denying","niegue","niegues","niegue","neguemos","neguéis","nieguen","negando","denying","negado","denied"]
["negar","to deny, refuse","Subjuntivo","Subjunctive","Imperfecto","Imperfect","I denied, was denying","negara","negaras","negara","negáramos","negarais","negaran","negando","denying","negado","denied"]
["negar","to deny, refuse","Subjuntivo","Subjunctive","Futuro","Future","I will deny","negare","negares","negare","negáremos","negareis","negaren","negando","denying","negado","denied"]
["negar","to deny, refuse","Subjuntivo","Subjunctive","Presente perfecto","Present Perfect","I have denied, denied","haya negado","hayas negado","haya negado","hayamos negado","hayáis negado","hayan negado","negando","denying","negado","denied"]
["negar","to deny, refuse","Subjuntivo","Subjunctive","Futuro perfecto","Future Perfect","I will have denied","hubiere negado","hubieres negado","hubiere negado","hubiéremos negado","hubiereis negado","hubieren negado","negando","denying","negado","denied"]
["negar","to deny, refuse","Subjuntivo","Subjunctive","Pluscuamperfecto","Past Perfect","I had denied","hubiera negado","hubieras negado","hubiera negado","hubiéramos negado","hubierais negado","hubieran negado","negando","denying","negado","denied"]
["notar","to note, notice, observe","Imperativo Afirmativo","Imperative Affirmative","Presente","Present","Note! Don't note!",null,"nota","notad",null,"note","noten","notando","noting","notado","noted"]
["notar","to note, notice, observe","Imperativo Negativo","Imperative Negative","Presente","Present","Note! Don't note!",null,"no notes","no notéis",null,"no note","no noten","notando","noting","notado","noted"]
["notar","to note, notice, observe","Indicativo","Indicative","Presente","Present","I note, am noting","noto","notas","nota","notamos","notáis","notan","notando","noting","notado","noted"]
["notar","to note, notice, observe","Indicativo","Indicative","Futuro","Future","I will note","notaré","notarás","notará","notaremos","notaréis","notarán","notando","noting","notado","noted"]
["notar","to note, notice, observe","Indicativo","Indicative","Imperfecto","Imperfect","I was noting, used to note, noted","notaba","notabas","notaba","notábamos","notabais","notaban","notando","noting","notado","noted"]
["notar","to note, notice, observe","Indicativo","Indicative","Pretérito","Preterite","I noted","noté","notaste","notó","notamos","notasteis","notaron","notando","noting","notado","noted"]
["notar","to note, notice, observe","Indicativo","Indicative","Condicional","Conditional","I would note","notaría","notarías","notaría","notaríamos","notaríais","notarían","notando","noting","notado","noted"]
["notar","to note, notice, observe","Indicativo","Indicative","Presente perfecto","Present Perfect","I have noted","he notado","has notado","ha notado","hemos notado","habéis notado","han notado","notando","noting","notado","noted"]
["notar","to note, notice, observe","Indicativo","Indicative","Futuro perfecto","Future Perfect","I will have noted","habré notado","habrás notado","habrá notado","habremos notado","habréis notado","habrán notado","notando","noting","notado","noted"]
["notar","to note, notice, observe","Indicativo","Indicative","Pluscuamperfecto","Past Perfect","I had noted","había notado","habías notado","había notado","habíamos notado","habíais notado","habían notado","notando","noting","notado","noted"]
["notar","to note, notice, observe","Indicativo","Indicative","Pretérito anterior","Preterite (Archaic)","I had noted","hube notado","hubiste notado","hubo notado","hubimos notado","hubisteis notado","hubieron notado","notando","noting","notado","noted"]
["notar","to note, notice, observe","Indicativo","Indicative","Condicional perfecto","Conditional Perfect","I would have noted","habría notado","habrías notado","habría notado","habríamos notado","habríais notado","habrían notado","notando","noting","notado","noted"]
["notar","to note, notice, observe","Subjuntivo","Subjunctive","Presente","Present","I note, am noting","note","notes","note","notemos","notéis","noten","notando","noting","notado","noted"]
["notar","to note, notice, observe","Subjuntivo","Subjunctive","Imperfecto","Imperfect","I noted, was noting","notara","notaras","notara","notáramos","notarais","notaran","notando","noting","notado","noted"]
["notar","to note, notice, observe","Subjuntivo","Subjunctive","Futuro","Future","I will note","notare","notares","notare","notáremos","notareis","notaren","notando","noting","notado","noted"]
["notar","to note, notice, observe","Subjuntivo","Subjunctive","Presente perfecto","Present Perfect","I have noted, noted","haya notado","hayas notado","haya notado","hayamos notado","hayáis notado","hayan notado","notando","noting","notado","noted"]
["notar","to note, notice, observe","Subjuntivo","Subjunctive","Futuro perfecto","Future Perfect","I will have noted","hubiere notado","hubieres notado","hubiere notado","hubiéremos notado","hubiereis notado","hubieren notado","notando","noting","notado","noted"]
["notar","to note, notice, observe","Subjuntivo","Subjunctive","Pluscuamperfecto","Past Perfect","I had noted","hubiera notado","hubieras notado","hubiera notado","hubiéramos notado","hubierais notado","hubieran notado","notando","noting","notado","noted"]
["obligar","to oblige","Imperativo Afirmativo","Imperative Affirmative","Presente","Present","Oblige! Don't oblige!",null,"obliga","obligad",null,"obligue","obliguen","obligando","obliging","obligado","obliged"]
["obligar","to oblige","Imperativo Negativo","Imperative Negative","Presente","Present","Oblige! Don't oblige!",null,"no obligues","no obliguéis",null,"no obligue","no obliguen","obligando","obliging","obligado","obliged"]
["obligar","to oblige","Indicativo","Indicative","Presente","Present","I oblige, am obliging","obligo","obligas","obliga","obligamos","obligáis","obligan","obligando","obliging","obligado","obliged"]
["obligar","to oblige","Indicativo","Indicative","Futuro","Future","I will oblige","obligaré","obligarás","obligará","obligaremos","obligaréis","obligarán","obligando","obliging","obligado","obliged"]
["obligar","to oblige","Indicativo","Indicative","Imperfecto","Imperfect","I was obliging, used to oblige, obliged","obligaba","obligabas","obligaba","obligábamos","obligabais","obligaban","obligando","obliging","obligado","obliged"]
["obligar","to oblige","Indicativo","Indicative","Pretérito","Preterite","I obliged","obligué","obligaste","obligó","obligamos","obligasteis","obligaron","obligando","obliging","obligado","obliged"]
["obligar","to oblige","Indicativo","Indicative","Condicional","Conditional","I would oblige","obligaría","obligarías","obligaría","obligaríamos","obligaríais","obligarían","obligando","obliging","obligado","obliged"]
["obligar","to oblige","Indicativo","Indicative","Presente perfecto","Present Perfect","I have obliged","he obligado","has obligado","ha obligado","hemos obligado","habéis obligado","han obligado","obligando","obliging","obligado","obliged"]
["obligar","to oblige","Indicativo","Indicative","Futuro perfecto","Future Perfect","I will have obliged","habré obligado","habrás obligado","habrá obligado","habremos obligado","habréis obligado","habrán obligado","obligando","obliging","obligado","obliged"]
["obligar","to oblige","Indicativo","Indicative","Pluscuamperfecto","Past Perfect","I had obliged","había obligado","habías obligado","había obligado","habíamos obligado","habíais obligado","habían obligado","obligando","obliging","obligado","obliged"]
["obligar","to oblige","Indicativo","Indicative","Pretérito anterior","Preterite (Archaic)","I had obliged","hube obligado","hubiste obligado","hubo obligado","hubimos obligado","hubisteis obligado","hubieron obligado","obligando","obliging","obligado","obliged"]
["obligar","to oblige","Indicativo","Indicative","Condicional perfecto","Conditional Perfect","I would have obliged","habría obligado","habrías obligado","habría obligado","habríamos obligado","habríais obligado","habrían obligado","obligando","obliging","obligado","obliged"]
["obligar","to oblige","Subjuntivo","Subjunctive","Presente","Present","I oblige, am obliging","obligue","obligues","obligue","obliguemos","obliguéis","obliguen","obligando","obliging","obligado","obliged"]
["obligar","to oblige","Subjuntivo","Subjunctive","Imperfecto","Imperfect","I obliged, was obliging","obligara","obligaras","obligara","obligáramos","obligarais","obligaran","obligando","obliging","obligado","obliged"]
["obligar","to oblige","Subjuntivo","Subjunctive","Futuro","Future","I will oblige","obligare","obligares","obligare","obligáremos","obligareis","obligaren","obligando","obliging","obligado","obliged"]
["obligar","to oblige","Subjuntivo","Subjunctive","Presente perfecto","Present Perfect","I have obliged, obliged","haya obligado","hayas obligado","haya obligado","hayamos obligado","hayáis obligado","hayan obligado","obligando","obliging","obligado","obliged"]
["obligar","to oblige","Subjuntivo","Subjunctive","Futuro perfecto","Future Perfect","I will have obliged","hubiere obligado","hubieres obligado","hubiere obligado","hubiéremos obligado","hubiereis obligado","hubieren obligado","obligando","obliging","obligado","obliged"]
["obligar","to oblige","Subjuntivo","Subjunctive","Pluscuamperfecto","Past Perfect","I had obliged","hubiera obligado","hubieras obligado","hubiera obligado","hubiéramos obligado","hubierais obligado","hubieran obligado","obligando","obliging","obligado","obliged"]
["obtener","to obtain, get","Imperativo Afirmativo","Imperative Affirmative","Presente","Present","Obtain! Don't obtain!",null,"obtén","obtened",null,"obtenga","obtengan","obteniendo","obtaining","obtenido","obtained"]
["obtener","to obtain, get","Imperativo Negativo","Imperative Negative","Presente","Present","Obtain! Don't obtain!",null,"no obtengas","no obtengáis",null,"no obtenga","no obtengan","obteniendo","obtaining","obtenido","obtained"]
["obtener","to obtain, get","Indicativo","Indicative","Presente","Present","I obtain, am obtaining","obtengo","obtienes","obtiene","obtenemos","obtenéis","obtienen","obteniendo","obtaining","obtenido","obtained"]
["obtener","to obtain, get","Indicativo","Indicative","Futuro","Future","I will obtain","obtendré","obtendrás","obtendrá","obtendremos","obtendréis","obtendrán","obteniendo","obtaining","obtenido","obtained"]
["obtener","to obtain, get","Indicativo","Indicative","Imperfecto","Imperfect","I was obtaining, used to obtain, obtained","obtenía","obtenías","obtenía","obteníamos","obteníais","obtenían","obteniendo","obtaining","obtenido","obtained"]
["obtener","to obtain, get","Indicativo","Indicative","Pretérito","Preterite","I obtained","obtuve","obtuviste","obtuvo","obtuvimos","obtuvisteis","obtuvieron","obteniendo","obtaining","obtenido","obtained"]
["obtener","to obtain, get","Indicativo","Indicative","Condicional","Conditional","I would obtain","obtendría","obtendrías","obtendría","obtendríamos","obtendríais","obtendrían","obteniendo","obtaining","obtenido","obtained"]
["obtener","to obtain, get","Indicativo","Indicative","Presente perfecto","Present Perfect","I have obtained","he obtenido","has obtenido","ha obtenido","hemos obtenido","habéis obtenido","han obtenido","obteniendo","obtaining","obtenido","obtained"]
["obtener","to obtain, get","Indicativo","Indicative","Futuro perfecto","Future Perfect","I will have obtained","habré obtenido","habrás obtenido","habrá obtenido","habremos obtenido","habréis obtenido","habrán obtenido","obteniendo","obtaining","obtenido","obtained"]
["obtener","to obtain, get","Indicativo","Indicative","Pluscuamperfecto","Past Perfect","I had obtained","había obtenido","habías obtenido","había obtenido","habíamos obtenido","habíais obtenido","habían obtenido","obteniendo","obtaining","obtenido","obtained"]
["obtener","to obtain, get","Indicativo","Indicative","Pretérito anterior","Preterite (Archaic)","I had obtained","hube obtenido","hubiste obtenido","hubo obtenido","hubimos obtenido","hubisteis obtenido","hubieron obtenido","obteniendo","obtaining","obtenido","obtained"]
["obtener","to obtain, get","Indicativo","Indicative","Condicional perfecto","Conditional Perfect","I would have obtained","habría obtenido","habrías obtenido","habría obtenido","habríamos obtenido","habríais obtenido","habrían obtenido","obteniendo","obtaining","obtenido","obtained"]
["obtener","to obtain, get","Subjuntivo","Subjunctive","Presente","Present","I obtain, am obtaining","obtenga","obtengas","obtenga","obtengamos","obtengáis","obtengan","obteniendo","obtaining","obtenido","obtained"]
["obtener","to obtain, get","Subjuntivo","Subjunctive","Imperfecto","Imperfect","I obtained, was obtaining","obtuviera","obtuvieras","obtuviera","obtuviéramos","obtuvierais","obtuvieran","obteniendo","obtaining","obtenido","obtained"]
["obtener","to obtain, get","Subjuntivo","Subjunctive","Futuro","Future","I will obtain","obtuviere","obtuvieres","obtuviere","obtuviéremos","obtuviereis","obtuvieren","obteniendo","obtaining","obtenido","obtained"]
["obtener","to obtain, get","Subjuntivo","Subjunctive","Presente perfecto","Present Perfect","I have obtained, obtained","haya obtenido","hayas obtenido","haya obtenido","hayamos obtenido","hayáis obtenido","hayan obtenido","obteniendo","obtaining","obtenido","obtained"]
["obtener","to obtain, get","Subjuntivo","Subjunctive","Futuro perfecto","Future Perfect","I will have obtained","hubiere obtenido","hubieres obtenido","hubiere obtenido","hubiéremos obtenido","hubiereis obtenido","hubieren obtenido","obteniendo","obtaining","obtenido","obtained"]
["obtener","to obtain, get","Subjuntivo","Subjunctive","Pluscuamperfecto","Past Perfect","I had obtained","hubiera obtenido","hubieras obtenido","hubiera obtenido","hubiéramos obtenido","hubierais obtenido","hubieran obtenido","obteniendo","obtaining","obtenido","obtained"]
["ocurrir","to occur, happen","Imperativo Afirmativo","Imperative Affirmative","Presente","Present","Occur! Don't occur!",null,"ocurre","ocurrid",null,"ocurra","ocurran","ocurriendo","occurring","ocurrido","occurred"]
["ocurrir","to occur, happen","Imperativo Negativo","Imperative Negative","Presente","Present","Occur! Don't occur!",null,"no ocurras","no ocurráis",null,"no ocurra","no ocurran","ocurriendo","occurring","ocurrido","occurred"]
["ocurrir","to occur, happen","Indicativo","Indicative","Presente","Present","it occurs, is occurring",null,null,"ocurre",null,null,"ocurren","ocurriendo","occurring","ocurrido","occurred"]
["ocurrir","to occur, happen","Indicativo","Indicative","Futuro","Future","it will occur",null,null,"ocurrirá",null,null,"ocurrirán","ocurriendo","occurring","ocurrido","occurred"]
["ocurrir","to occur, happen","Indicativo","Indicative","Imperfecto","Imperfect","it was occurring, used to occur, occurred",null,null,"ocurría",null,null,"ocurrían","ocurriendo","occurring","ocurrido","occurred"]
["ocurrir","to occur, happen","Indicativo","Indicative","Pretérito","Preterite","it occurred",null,null,"ocurrió",null,null,"ocurrieron","ocurriendo","occurring","ocurrido","occurred"]
["ocurrir","to occur, happen","Indicativo","Indicative","Condicional","Conditional","it would occur",null,null,"ocurriría",null,null,"ocurrirían","ocurriendo","occurring","ocurrido","occurred"]
["ocurrir","to occur, happen","Indicativo","Indicative","Presente perfecto","Present Perfect","it has occurred",null,null,"ha ocurrido",null,null,"han ocurrido","ocurriendo","occurring","ocurrido","occurred"]
["ocurrir","to occur, happen","Indicativo","Indicative","Futuro perfecto","Future Perfect","it will have occurred",null,null,"habrá ocurrido",null,null,"habrán ocurrido","ocurriendo","occurring","ocurrido","occurred"]
["ocurrir","to occur, happen","Indicativo","Indicative","Pluscuamperfecto","Past Perfect","it had occurred",null,null,"había ocurrido",null,null,"habían ocurrido","ocurriendo","occurring","ocurrido","occurred"]
["ocurrir","to occur, happen","Indicativo","Indicative","Pretérito anterior","Preterite (Archaic)","it had occurred",null,null,"hubo ocurrido",null,null,"hubieron ocurrido","ocurriendo","occurring","ocurrido","occurred"]
["ocurrir","to occur, happen","Indicativo","Indicative","Condicional perfecto","Conditional Perfect","it would have occurred",null,null,"habría ocurrido",null,null,"habrían ocurrido","ocurriendo","occurring","ocurrido","occurred"]
["ocurrir","to occur, happen","Subjuntivo","Subjunctive","Presente","Present","it occurs, is occurring",null,null,"ocurra",null,null,"ocurran","ocurriendo","occurring","ocurrido","occurred"]
["ocurrir","to occur, happen","Subjuntivo","Subjunctive","Imperfecto","Imperfect","it occurred, was occurring",null,null,"ocurriera",null,null,"ocurrieran","ocurriendo","occurring","ocurrido","occurred"]
["ocurrir","to occur, happen","Subjuntivo","Subjunctive","Futuro","Future","it will occur",null,null,"ocurriere",null,null,"ocurrieren","ocurriendo","occurring","ocurrido","occurred"]
["ocurrir","to occur, happen","Subjuntivo","Subjunctive","Presente perfecto","Present Perfect","it has occurred, occurred",null,null,"haya ocurrido",null,null,"hayan ocurrido","ocurriendo","occurring","ocurrido","occurred"]
["ocurrir","to occur, happen","Subjuntivo","Subjunctive","Futuro perfecto","Future Perfect","it will have occurred",null,null,"hubiere ocurrido",null,null,"hubieren ocurrido","ocurriendo","occurring","ocurrido","occurred"]
["ocurrir","to occur, happen","Subjuntivo","Subjunctive","Pluscuamperfecto","Past Perfect","it had occurred",null,null,"hubiera ocurrido",null,null,"hubieran ocurrido","ocurriendo","occurring","ocurrido","occurred"]
["ofrecer","to offer","Imperativo Afirmativo","Imperative Affirmative","Presente","Present","Offer! Don't offer!",null,"ofrece","ofreced",null,"ofrezca","ofrezcan","ofreciendo","offering","ofrecido","offered"]
["ofrecer","to offer","Imperativo Negativo","Imperative Negative","Presente","Present","Offer! Don't offer!",null,"no ofrezcas","no ofrezcáis",null,"no ofrezca","no ofrezcan","ofreciendo","offering","ofrecido","offered"]
["ofrecer","to offer","Indicativo","Indicative","Presente","Present","I offer, am offering","ofrezco","ofreces","ofrece","ofrecemos","ofrecéis","ofrecen","ofreciendo","offering","ofrecido","offered"]
["ofrecer","to offer","Indicativo","Indicative","Futuro","Future","I will offer","ofreceré","ofrecerás","ofrecerá","ofreceremos","ofreceréis","ofrecerán","ofreciendo","offering","ofrecido","offered"]
["ofrecer","to offer","Indicativo","Indicative","Imperfecto","Imperfect","I was offering, used to offer, offered","ofrecía","ofrecías","ofrecía","ofrecíamos","ofrecíais","ofrecían","ofreciendo","offering","ofrecido","offered"]
["ofrecer","to offer","Indicativo","Indicative","Pretérito","Preterite","I offered","ofrecí","ofreciste","ofreció","ofrecimos","ofrecisteis","ofrecieron","ofreciendo","offering","ofrecido","offered"]
["ofrecer","to offer","Indicativo","Indicative","Condicional","Conditional","I would offer","ofrecería","ofrecerías","ofrecería","ofreceríamos","ofreceríais","ofrecerían","ofreciendo","offering","ofrecido","offered"]
["ofrecer","to offer","Indicativo","Indicative","Presente perfecto","Present Perfect","I have offered","he ofrecido","has ofrecido","ha ofrecido","hemos ofrecido","habéis ofrecido","han ofrecido","ofreciendo","offering","ofrecido","offered"]
["ofrecer","to offer","Indicativo","Indicative","Futuro perfecto","Future Perfect","I will have offered","habré ofrecido","habrás ofrecido","habrá ofrecido","habremos ofrecido","habréis ofrecido","habrán ofrecido","ofreciendo","offering","ofrecido","offered"]
["ofrecer","to offer","Indicativo","Indicative","Pluscuamperfecto","Past Perfect","I had offered","había ofrecido","habías ofrecido","había ofrecido","habíamos ofrecido","habíais ofrecido","habían ofrecido","ofreciendo","offering","ofrecido","offered"]
["ofrecer","to offer","Indicativo","Indicative","Pretérito anterior","Preterite (Archaic)","I had offered","hube ofrecido","hubiste ofrecido","hubo ofrecido","hubimos ofrecido","hubisteis ofrecido","hubieron ofrecido","ofreciendo","offering","ofrecido","offered"]
["ofrecer","to offer","Indicativo","Indicative","Condicional perfecto","Conditional Perfect","I would have offered","habría ofrecido","habrías ofrecido","habría ofrecido","habríamos ofrecido","habríais ofrecido","habrían ofrecido","ofreciendo","offering","ofrecido","offered"]
["ofrecer","to offer","Subjuntivo","Subjunctive","Presente","Present","I offer, am offering","ofrezca","ofrezcas","ofrezca","ofrezcamos","ofrezcáis","ofrezcan","ofreciendo","offering","ofrecido","offered"]
["ofrecer","to offer","Subjuntivo","Subjunctive","Imperfecto","Imperfect","I offered, was offering","ofreciera","ofrecieras","ofreciera","ofreciéramos","ofrecierais","ofrecieran","ofreciendo","offering","ofrecido","offered"]
["ofrecer","to offer","Subjuntivo","Subjunctive","Futuro","Future","I will offer","ofreciere","ofrecieres","ofreciere","ofreciéremos","ofreciereis","ofrecieren","ofreciendo","offering","ofrecido","offered"]
["ofrecer","to offer","Subjuntivo","Subjunctive","Presente perfecto","Present Perfect","I have offered, offered","haya ofrecido","hayas ofrecido","haya ofrecido","hayamos ofrecido","hayáis ofrecido","hayan ofrecido","ofreciendo","offering","ofrecido","offered"]
["ofrecer","to offer","Subjuntivo","Subjunctive","Futuro perfecto","Future Perfect","I will have offered","hubiere ofrecido","hubieres ofrecido","hubiere ofrecido","hubiéremos ofrecido","hubiereis ofrecido","hubieren ofrecido","ofreciendo","offering","ofrecido","offered"]
["ofrecer","to offer","Subjuntivo","Subjunctive","Pluscuamperfecto","Past Perfect","I had offered","hubiera ofrecido","hubieras ofrecido","hubiera ofrecido","hubiéramos ofrecido","hubierais ofrecido","hubieran ofrecido","ofreciendo","offering","ofrecido","offered"]
["oír","to hear","Imperativo Afirmativo","Imperative Affirmative","Presente","Present","Hear! Don't hear!",null,"oye","oíd",null,"oiga","oigan","oyendo","hearing","oído","heard"]
["oír","to hear","Imperativo Negativo","Imperative Negative","Presente","Present","Hear! Don't hear!",null,"no oigas","no oigáis",null,"no oiga","no oigan","oyendo","hearing","oído","heard"]
["oír","to hear","Indicativo","Indicative","Presente","Present","I hear, am hearing","oigo","oyes","oye","oímos","oís","oyen","oyendo","hearing","oído","heard"]
["oír","to hear","Indicativo","Indicative","Futuro","Future","I will hear","oiré","oirás","oirá","oiremos","oiréis","oirán","oyendo","hearing","oído","heard"]
["oír","to hear","Indicativo","Indicative","Imperfecto","Imperfect","I was hearing, used to hear, heard","oía","oías","oía","oíamos","oíais","oían","oyendo","hearing","oído","heard"]
["oír","to hear","Indicativo","Indicative","Pretérito","Preterite","I heard","oí","oíste","oyó","oímos","oísteis","oyeron","oyendo","hearing","oído","heard"]
["oír","to hear","Indicativo","Indicative","Condicional","Conditional","I would hear","oiría","oirías","oiría","oiríamos","oiríais","oirían","oyendo","hearing","oído","heard"]
["oír","to hear","Indicativo","Indicative","Presente perfecto","Present Perfect","I have heard","he oído","has oído","ha oído","hemos oído","habéis oído","han oído","oyendo","hearing","oído","heard"]
["oír","to hear","Indicativo","Indicative","Futuro perfecto","Future Perfect","I will have heard","habré oído","habrás oído","habrá oído","habremos oído","habréis oído","habrán oído","oyendo","hearing","oído","heard"]
["oír","to hear","Indicativo","Indicative","Pluscuamperfecto","Past Perfect","I had heard","había oído","habías oído","había oído","habíamos oído","habíais oído","habían oído","oyendo","hearing","oído","heard"]
["oír","to hear","Indicativo","Indicative","Pretérito anterior","Preterite (Archaic)","I had heard","hube oído","hubiste oído","hubo oído","hubimos oído","hubisteis oído","hubieron oído","oyendo","hearing","oído","heard"]
["oír","to hear","Indicativo","Indicative","Condicional perfecto","Conditional Perfect","I would have heard","habría oído","habrías oído","habría oído","habríamos oído","habríais oído","habrían oído","oyendo","hearing","oído","heard"]
["oír","to hear","Subjuntivo","Subjunctive","Presente","Present","I hear, am hearing","oiga","oigas","oiga","oigamos","oigáis","oigan","oyendo","hearing","oído","heard"]
["oír","to hear","Subjuntivo","Subjunctive","Imperfecto","Imperfect","I heard, was hearing","oyera","oyeras","oyera","oyéramos","oyerais","oyeran","oyendo","hearing","oído","heard"]
["oír","to hear","Subjuntivo","Subjunctive","Futuro","Future","I will hear","oyere","oyeres","oyere","oyéremos","oyereis","oyeren","oyendo","hearing","oído","heard"]
["oír","to hear","Subjuntivo","Subjunctive","Presente perfecto","Present Perfect","I have heard, heard","haya oído","hayas oído","haya oído","hayamos oído","hayáis oído","hayan oído","oyendo","hearing","oído","heard"]
["oír","to hear","Subjuntivo","Subjunctive","Futuro perfecto","Future Perfect","I will have heard","hubiere oído","hubieres oído","hubiere oído","hubiéremos oído","hubiereis oído","hubieren oído","oyendo","hearing","oído","heard"]
["oír","to hear","Subjuntivo","Subjunctive","Pluscuamperfecto","Past Perfect","I had heard","hubiera oído","hubieras oído","hubiera oído","hubiéramos oído","hubierais oído","hubieran oído","oyendo","hearing","oído","heard"]
["olvidar","to forget","Imperativo Afirmativo","Imperative Affirmative","Presente","Present","Forget! Don't forget!",null,"olvida","olvidad",null,"olvide","olviden","olvidando","forgetting","olvidado","forgotten"]
["olvidar","to forget","Imperativo Negativo","Imperative Negative","Presente","Present","Forget! Don't forget!",null,"no olvides","no olvidéis",null,"no olvide","no olviden","olvidando","forgetting","olvidado","forgotten"]
["olvidar","to forget","Indicativo","Indicative","Presente","Present","I forget, am forgetting","olvido","olvidas","olvida","olvidamos","olvidáis","olvidan","olvidando","forgetting","olvidado","forgotten"]
["olvidar","to forget","Indicativo","Indicative","Futuro","Future","I will forget","olvidaré","olvidarás","olvidará","olvidaremos","olvidaréis","olvidarán","olvidando","forgetting","olvidado","forgotten"]
["olvidar","to forget","Indicativo","Indicative","Imperfecto","Imperfect","I was forgetting, used to forget, forgot","olvidaba","olvidabas","olvidaba","olvidábamos","olvidabais","olvidaban","olvidando","forgetting","olvidado","forgotten"]
["olvidar","to forget","Indicativo","Indicative","Pretérito","Preterite","I forgot","olvidé","olvidaste","olvidó","olvidamos","olvidasteis","olvidaron","olvidando","forgetting","olvidado","forgotten"]
["olvidar","to forget","Indicativo","Indicative","Condicional","Conditional","I would forget","olvidaría","olvidarías","olvidaría","olvidaríamos","olvidaríais","olvidarían","olvidando","forgetting","olvidado","forgotten"]
["olvidar","to forget","Indicativo","Indicative","Presente perfecto","Present Perfect","I have forgotten","he olvidado","has olvidado","ha olvidado","hemos olvidado","habéis olvidado","han olvidado","olvidando","forgetting","olvidado","forgotten"]
["olvidar","to forget","Indicativo","Indicative","Futuro perfecto","Future Perfect","I will have forgotten","habré olvidado","habrás olvidado","habrá olvidado","habremos olvidado","habréis olvidado","habrán olvidado","olvidando","forgetting","olvidado","forgotten"]
["olvidar","to forget","Indicativo","Indicative","Pluscuamperfecto","Past Perfect","I had forgotten","había olvidado","habías olvidado","había olvidado","habíamos olvidado","habíais olvidado","habían olvidado","olvidando","forgetting","olvidado","forgotten"]
["olvidar","to forget","Indicativo","Indicative","Pretérito anterior","Preterite (Archaic)","I had forgotten","hube olvidado","hubiste olvidado","hubo olvidado","hubimos olvidado","hubisteis olvidado","hubieron olvidado","olvidando","forgetting","olvidado","forgotten"]
["olvidar","to forget","Indicativo","Indicative","Condicional perfecto","Conditional Perfect","I would have forgotten","habría olvidado","habrías olvidado","habría olvidado","habríamos olvidado","habríais olvidado","habrían olvidado","olvidando","forgetting","olvidado","forgotten"]
["olvidar","to forget","Subjuntivo","Subjunctive","Presente","Present","I forget, am forgetting","olvide","olvides","olvide","olvidemos","olvidéis","olviden","olvidando","forgetting","olvidado","forgotten"]
["olvidar","to forget","Subjuntivo","Subjunctive","Imperfecto","Imperfect","I forgot, was forgetting","olvidara","olvidaras","olvidara","olvidáramos","olvidarais","olvidaran","olvidando","forgetting","olvidado","forgotten"]
["olvidar","to forget","Subjuntivo","Subjunctive","Futuro","Future","I will forget","olvidare","olvidares","olvidare","olvidáremos","olvidareis","olvidaren","olvidando","forgetting","olvidado","forgotten"]
["olvidar","to forget","Subjuntivo","Subjunctive","Presente perfecto","Present Perfect","I have forgotten, forgot","haya olvidado","hayas olvidado","haya olvidado","hayamos olvidado","hayáis olvidado","hayan olvidado","olvidando","forgetting","olvidado","forgotten"]
["olvidar","to forget","Subjuntivo","Subjunctive","Futuro perfecto","Future Perfect","I will have forgotten","hubiere olvidado","hubieres olvidado","hubiere olvidado","hubiéremos olvidado","hubiereis olvidado","hubieren olvidado","olvidando","forgetting","olvidado","forgotten"]
["olvidar","to forget","Subjuntivo","Subjunctive","Pluscuamperfecto","Past Perfect","I had forgotten","hubiera olvidado","hubieras olvidado","hubiera olvidado","hubiéramos olvidado","hubierais olvidado","hubieran olvidado","olvidando","forgetting","olvidado","forgotten"]
["pagar","to pay, pay for","Imperativo Afirmativo","Imperative Affirmative","Presente","Present","Pay! Don't pay!",null,"paga","pagad",null,"pague","paguen","pagando","paying","pagado","paid"]
["pagar","to pay, pay for","Imperativo Negativo","Imperative Negative","Presente","Present","Pay! Don't pay!",null,"no pagues","no paguéis",null,"no pague","no paguen","pagando","paying","pagado","paid"]
["pagar","to pay, pay for","Indicativo","Indicative","Presente","Present","I pay, am paying","pago","pagas","paga","pagamos","pagáis","pagan","pagando","paying","pagado","paid"]
["pagar","to pay, pay for","Indicativo","Indicative","Futuro","Future","I will pay","pagaré","pagarás","pagará","pagaremos","pagaréis","pagarán","pagando","paying","pagado","paid"]
["pagar","to pay, pay for","Indicativo","Indicative","Imperfecto","Imperfect","I was paying, used to pay, paid","pagaba","pagabas","pagaba","pagábamos","pagabais","pagaban","pagando","paying","pagado","paid"]
["pagar","to pay, pay for","Indicativo","Indicative","Pretérito","Preterite","I paid","pagué","pagaste","pagó","pagamos","pagasteis","pagaron","pagando","paying","pagado","paid"]
["pagar","to pay, pay for","Indicativo","Indicative","Condicional","Conditional","I would pay","pagaría","pagarías","pagaría","pagaríamos","pagaríais","pagarían","pagando","paying","pagado","paid"]
["pagar","to pay, pay for","Indicativo","Indicative","Presente perfecto","Present Perfect","I have paid","he pagado","has pagado","ha pagado","hemos pagado","habéis pagado","han pagado","pagando","paying","pagado","paid"]
["pagar","to pay, pay for","Indicativo","Indicative","Futuro perfecto","Future Perfect","I will have paid","habré pagado","habrás pagado","habrá pagado","habremos pagado","habréis pagado","habrán pagado","pagando","paying","pagado","paid"]
["pagar","to pay, pay for","Indicativo","Indicative","Pluscuamperfecto","Past Perfect","I had paid","había pagado","habías pagado","había pagado","habíamos pagado","habíais pagado","habían pagado","pagando","paying","pagado","paid"]
["pagar","to pay, pay for","Indicativo","Indicative","Pretérito anterior","Preterite (Archaic)","I had paid","hube pagado","hubiste pagado","hubo pagado","hubimos pagado","hubisteis pagado","hubieron pagado","pagando","paying","pagado","paid"]
["pagar","to pay, pay for","Indicativo","Indicative","Condicional perfecto","Conditional Perfect","I would have paid","habría pagado","habrías pagado","habría pagado","habríamos pagado","habríais pagado","habrían pagado","pagando","paying","pagado","paid"]
["pagar","to pay, pay for","Subjuntivo","Subjunctive","Presente","Present","I pay, am paying","pague","pagues","pague","paguemos","paguéis","paguen","pagando","paying","pagado","paid"]
["pagar","to pay, pay for","Subjuntivo","Subjunctive","Imperfecto","Imperfect","I paid, was paying","pagara","pagaras","pagara","pagáramos","pagarais","pagaran","pagando","paying","pagado","paid"]
["pagar","to pay, pay for","Subjuntivo","Subjunctive","Futuro","Future","I will pay","pagare","pagares","pagare","pagáremos","pagareis","pagaren","pagando","paying","pagado","paid"]
["pagar","to pay, pay for","Subjuntivo","Subjunctive","Presente perfecto","Present Perfect","I have paid, paid","haya pagado","hayas pagado","haya pagado","hayamos pagado","hayáis pagado","hayan pagado","pagando","paying","pagado","paid"]
["pagar","to pay, pay for","Subjuntivo","Subjunctive","Futuro perfecto","Future Perfect","I will have paid","hubiere pagado","hubieres pagado","hubiere pagado","hubiéremos pagado","hubiereis pagado","hubieren pagado","pagando","paying","pagado","paid"]
["pagar","to pay, pay for","Subjuntivo","Subjunctive","Pluscuamperfecto","Past Perfect","I had paid","hubiera pagado","hubieras pagado","hubiera pagado","hubiéramos pagado","hubierais pagado","hubieran pagado","pagando","paying","pagado","paid"]
["parecer","to seem, appear","Imperativo Afirmativo","Imperative Affirmative","Presente","Present","Seem! Don't seem!",null,"parece","pareced",null,"parezca","parezcan","pareciendo","seeming","parecido","seemed"]
["parecer","to seem, appear","Imperativo Negativo","Imperative Negative","Presente","Present","Seem! Don't seem!",null,"no parezcas","no parezcáis",null,"no parezca","no parezcan","pareciendo","seeming","parecido","seemed"]
["parecer","to seem, appear","Indicativo","Indicative","Presente","Present","I seem, am seeming","parezco","pareces","parece","parecemos","parecéis","parecen","pareciendo","seeming","parecido","seemed"]
["parecer","to seem, appear","Indicativo","Indicative","Futuro","Future","I will seem","pareceré","parecerás","parecerá","pareceremos","pareceréis","parecerán","pareciendo","seeming","parecido","seemed"]
["parecer","to seem, appear","Indicativo","Indicative","Imperfecto","Imperfect","I was seeming, used to seem, seemed","parecía","parecías","parecía","parecíamos","parecíais","parecían","pareciendo","seeming","parecido","seemed"]
["parecer","to seem, appear","Indicativo","Indicative","Pretérito","Preterite","I seemed","parecí","pareciste","pareció","parecimos","parecisteis","parecieron","pareciendo","seeming","parecido","seemed"]
["parecer","to seem, appear","Indicativo","Indicative","Condicional","Conditional","I would seem","parecería","parecerías","parecería","pareceríamos","pareceríais","parecerían","pareciendo","seeming","parecido","seemed"]
["parecer","to seem, appear","Indicativo","Indicative","Presente perfecto","Present Perfect","I have seemed","he parecido","has parecido","ha parecido","hemos parecido","habéis parecido","han parecido","pareciendo","seeming","parecido","seemed"]
["parecer","to seem, appear","Indicativo","Indicative","Futuro perfecto","Future Perfect","I will have seemed","habré parecido","habrás parecido","habrá parecido","habremos parecido","habréis parecido","habrán parecido","pareciendo","seeming","parecido","seemed"]
["parecer","to seem, appear","Indicativo","Indicative","Pluscuamperfecto","Past Perfect","I had seemed","había parecido","habías parecido","había parecido","habíamos parecido","habíais parecido","habían parecido","pareciendo","seeming","parecido","seemed"]
["parecer","to seem, appear","Indicativo","Indicative","Pretérito anterior","Preterite (Archaic)","I had seemed","hube parecido","hubiste parecido","hubo parecido","hubimos parecido","hubisteis parecido","hubieron parecido","pareciendo","seeming","parecido","seemed"]
["parecer","to seem, appear","Indicativo","Indicative","Condicional perfecto","Conditional Perfect","I would have seemed","habría parecido","habrías parecido","habría parecido","habríamos parecido","habríais parecido","habrían parecido","pareciendo","seeming","parecido","seemed"]
["parecer","to seem, appear","Subjuntivo","Subjunctive","Presente","Present","I seem, am seeming","parezca","parezcas","parezca","parezcamos","parezcáis","parezcan","pareciendo","seeming","parecido","seemed"]
["parecer","to seem, appear","Subjuntivo","Subjunctive","Imperfecto","Imperfect","I seemed, was seeming","pareciera","parecieras","pareciera","pareciéramos","parecierais","parecieran","pareciendo","seeming","parecido","seemed"]
["parecer","to seem, appear","Subjuntivo","Subjunctive","Futuro","Future","I will seem","pareciere","parecieres","pareciere","pareciéremos","pareciereis","parecieren","pareciendo","seeming","parecido","seemed"]
["parecer","to seem, appear","Subjuntivo","Subjunctive","Presente perfecto","Present Perfect","I have seemed, seemed","haya parecido","hayas parecido","haya parecido","hayamos parecido","hayáis parecido","hayan parecido","pareciendo","seeming","parecido","seemed"]
["parecer","to seem, appear","Subjuntivo","Subjunctive","Futuro perfecto","Future Perfect","I will have seemed","hubiere parecido","hubieres parecido","hubiere parecido","hubiéremos parecido","hubiereis parecido","hubieren parecido","pareciendo","seeming","parecido","seemed"]
["parecer","to seem, appear","Subjuntivo","Subjunctive","Pluscuamperfecto","Past Perfect","I had seemed","hubiera parecido","hubieras parecido","hubiera parecido","hubiéramos parecido","hubierais parecido","hubieran parecido","pareciendo","seeming","parecido","seemed"]
["participar","to participate, take part in; to share in; to inform, notify","Imperativo Afirmativo","Imperative Affirmative","Presente","Present","Participate! Don't participate!",null,"participa","participad",null,"participe","participen","participando","participating","participado","participated"]
["participar","to participate, take part in; to share in; to inform, notify","Imperativo Negativo","Imperative Negative","Presente","Present","Participate! Don't participate!",null,"no participes","no participéis",null,"no participe","no participen","participando","participating","participado","participated"]
["participar","to participate, take part in; to share in; to inform, notify","Indicativo","Indicative","Presente","Present","I participate, am participating","participo","participas","participa","participamos","participáis","participan","participando","participating","participado","participated"]
["participar","to participate, take part in; to share in; to inform, notify","Indicativo","Indicative","Futuro","Future","I will participate","participaré","participarás","participará","participaremos","participaréis","participarán","participando","participating","participado","participated"]
["participar","to participate, take part in; to share in; to inform, notify","Indicativo","Indicative","Imperfecto","Imperfect","I was participating, used to participate, participated","participaba","participabas","participaba","participábamos","participabais","participaban","participando","participating","participado","participated"]
["participar","to participate, take part in; to share in; to inform, notify","Indicativo","Indicative","Pretérito","Preterite","I participated","participé","participaste","participó","participamos","participasteis","participaron","participando","participating","participado","participated"]
["participar","to participate, take part in; to share in; to inform, notify","Indicativo","Indicative","Condicional","Conditional","I would participate","participaría","participarías","participaría","participaríamos","participaríais","participarían","participando","participating","participado","participated"]
["participar","to participate, take part in; to share in; to inform, notify","Indicativo","Indicative","Presente perfecto","Present Perfect","I have participated","he participado","has participado","ha participado","hemos participado","habéis participado","han participado","participando","participating","participado","participated"]
["participar","to participate, take part in; to share in; to inform, notify","Indicativo","Indicative","Futuro perfecto","Future Perfect","I will have participated","habré participado","habrás participado","habrá participado","habremos participado","habréis participado","habrán participado","participando","participating","participado","participated"]
["participar","to participate, take part in; to share in; to inform, notify","Indicativo","Indicative","Pluscuamperfecto","Past Perfect","I had participated","había participado","habías participado","había participado","habíamos participado","habíais participado","habían participado","participando","participating","participado","participated"]
["participar","to participate, take part in; to share in; to inform, notify","Indicativo","Indicative","Pretérito anterior","Preterite (Archaic)","I had participated","hube participado","hubiste participado","hubo participado","hubimos participado","hubisteis participado","hubieron participado","participando","participating","participado","participated"]
["participar","to participate, take part in; to share in; to inform, notify","Indicativo","Indicative","Condicional perfecto","Conditional Perfect","I would have participated","habría participado","habrías participado","habría participado","habríamos participado","habríais participado","habrían participado","participando","participating","participado","participated"]
["participar","to participate, take part in; to share in; to inform, notify","Subjuntivo","Subjunctive","Presente","Present","I participate, am participating","participe","participes","participe","participemos","participéis","participen","participando","participating","participado","participated"]
["participar","to participate, take part in; to share in; to inform, notify","Subjuntivo","Subjunctive","Imperfecto","Imperfect","I participated, was participating","participara","participaras","participara","participáramos","participarais","participaran","participando","participating","participado","participated"]
["participar","to participate, take part in; to share in; to inform, notify","Subjuntivo","Subjunctive","Futuro","Future","I will participate","participare","participares","participare","participáremos","participareis","participaren","participando","participating","participado","participated"]
["participar","to participate, take part in; to share in; to inform, notify","Subjuntivo","Subjunctive","Presente perfecto","Present Perfect","I have participated, participated","haya participado","hayas participado","haya participado","hayamos participado","hayáis participado","hayan participado","participando","participating","participado","participated"]
["participar","to participate, take part in; to share in; to inform, notify","Subjuntivo","Subjunctive","Futuro perfecto","Future Perfect","I will have participated","hubiere participado","hubieres participado","hubiere participado","hubiéremos participado","hubiereis participado","hubieren participado","participando","participating","participado","participated"]
["participar","to participate, take part in; to share in; to inform, notify","Subjuntivo","Subjunctive","Pluscuamperfecto","Past Perfect","I had participated","hubiera participado","hubieras participado","hubiera participado","hubiéramos participado","hubierais participado","hubieran participado","participando","participating","participado","participated"]
["pasar","to pass, pass by, go; to pass on, hand; to spend [time]; to happen","Imperativo Afirmativo","Imperative Affirmative","Presente","Present","Pass! Don't pass!",null,"pasa","pasad",null,"pase","pasen","pasando","passing","pasado","passed"]
["pasar","to pass, pass by, go; to pass on, hand; to spend [time]; to happen","Imperativo Negativo","Imperative Negative","Presente","Present","Pass! Don't pass!",null,"no pases","no paséis",null,"no pase","no pasen","pasando","passing","pasado","passed"]
["pasar","to pass, pass by, go; to pass on, hand; to spend [time]; to happen","Indicativo","Indicative","Presente","Present","I pass, am passing","paso","pasas","pasa","pasamos","pasáis","pasan","pasando","passing","pasado","passed"]
["pasar","to pass, pass by, go; to pass on, hand; to spend [time]; to happen","Indicativo","Indicative","Futuro","Future","I will pass","pasaré","pasarás","pasará","pasaremos","pasaréis","pasarán","pasando","passing","pasado","passed"]
["pasar","to pass, pass by, go; to pass on, hand; to spend [time]; to happen","Indicativo","Indicative","Imperfecto","Imperfect","I was passing, used to pass, passed","pasaba","pasabas","pasaba","pasábamos","pasabais","pasaban","pasando","passing","pasado","passed"]
["pasar","to pass, pass by, go; to pass on, hand; to spend [time]; to happen","Indicativo","Indicative","Pretérito","Preterite","I passed","pasé","pasaste","pasó","pasamos","pasasteis","pasaron","pasando","passing","pasado","passed"]
["pasar","to pass, pass by, go; to pass on, hand; to spend [time]; to happen","Indicativo","Indicative","Condicional","Conditional","I would pass","pasaría","pasarías","pasaría","pasaríamos","pasaríais","pasarían","pasando","passing","pasado","passed"]
["pasar","to pass, pass by, go; to pass on, hand; to spend [time]; to happen","Indicativo","Indicative","Presente perfecto","Present Perfect","I have passed","he pasado","has pasado","ha pasado","hemos pasado","habéis pasado","han pasado","pasando","passing","pasado","passed"]
["pasar","to pass, pass by, go; to pass on, hand; to spend [time]; to happen","Indicativo","Indicative","Futuro perfecto","Future Perfect","I will have passed","habré pasado","habrás pasado","habrá pasado","habremos pasado","habréis pasado","habrán pasado","pasando","passing","pasado","passed"]
["pasar","to pass, pass by, go; to pass on, hand; to spend [time]; to happen","Indicativo","Indicative","Pluscuamperfecto","Past Perfect","I had passed","había pasado","habías pasado","había pasado","habíamos pasado","habíais pasado","habían pasado","pasando","passing","pasado","passed"]
["pasar","to pass, pass by, go; to pass on, hand; to spend [time]; to happen","Indicativo","Indicative","Pretérito anterior","Preterite (Archaic)","I had passed","hube pasado","hubiste pasado","hubo pasado","hubimos pasado","hubisteis pasado","hubieron pasado","pasando","passing","pasado","passed"]
["pasar","to pass, pass by, go; to pass on, hand; to spend [time]; to happen","Indicativo","Indicative","Condicional perfecto","Conditional Perfect","I would have passed","habría pasado","habrías pasado","habría pasado","habríamos pasado","habríais pasado","habrían pasado","pasando","passing","pasado","passed"]
["pasar","to pass, pass by, go; to pass on, hand; to spend [time]; to happen","Subjuntivo","Subjunctive","Presente","Present","I pass, am passing","pase","pases","pase","pasemos","paséis","pasen","pasando","passing","pasado","passed"]
["pasar","to pass, pass by, go; to pass on, hand; to spend [time]; to happen","Subjuntivo","Subjunctive","Imperfecto","Imperfect","I passed, was passing","pasara","pasaras","pasara","pasáramos","pasarais","pasaran","pasando","passing","pasado","passed"]
["pasar","to pass, pass by, go; to pass on, hand; to spend [time]; to happen","Subjuntivo","Subjunctive","Futuro","Future","I will pass","pasare","pasares","pasare","pasáremos","pasareis","pasaren","pasando","passing","pasado","passed"]
["pasar","to pass, pass by, go; to pass on, hand; to spend [time]; to happen","Subjuntivo","Subjunctive","Presente perfecto","Present Perfect","I have passed, passed","haya pasado","hayas pasado","haya pasado","hayamos pasado","hayáis pasado","hayan pasado","pasando","passing","pasado","passed"]
["pasar","to pass, pass by, go; to pass on, hand; to spend [time]; to happen","Subjuntivo","Subjunctive","Futuro perfecto","Future Perfect","I will have passed","hubiere pasado","hubieres pasado","hubiere pasado","hubiéremos pasado","hubiereis pasado","hubieren pasado","pasando","passing","pasado","passed"]
["pasar","to pass, pass by, go; to pass on, hand; to spend [time]; to happen","Subjuntivo","Subjunctive","Pluscuamperfecto","Past Perfect","I had passed","hubiera pasado","hubieras pasado","hubiera pasado","hubiéramos pasado","hubierais pasado","hubieran pasado","pasando","passing","pasado","passed"]
["pedir","to request, ask for","Imperativo Afirmativo","Imperative Affirmative","Presente","Present","Request! Don't request!",null,"pide","pedid",null,"pida","pidan","pidiendo","requesting","pedido","requested"]
["pedir","to request, ask for","Imperativo Negativo","Imperative Negative","Presente","Present","Request! Don't request!",null,"no pidas","no pidáis",null,"no pida","no pidan","pidiendo","requesting","pedido","requested"]
["pedir","to request, ask for","Indicativo","Indicative","Presente","Present","I request, am requesting","pido","pides","pide","pedimos","pedís","piden","pidiendo","requesting","pedido","requested"]
["pedir","to request, ask for","Indicativo","Indicative","Futuro","Future","I will request","pediré","pedirás","pedirá","pediremos","pediréis","pedirán","pidiendo","requesting","pedido","requested"]
["pedir","to request, ask for","Indicativo","Indicative","Imperfecto","Imperfect","I was requesting, used to request, requested","pedía","pedías","pedía","pedíamos","pedíais","pedían","pidiendo","requesting","pedido","requested"]
["pedir","to request, ask for","Indicativo","Indicative","Pretérito","Preterite","I requested","pedí","pediste","pidió","pedimos","pedisteis","pidieron","pidiendo","requesting","pedido","requested"]
["pedir","to request, ask for","Indicativo","Indicative","Condicional","Conditional","I would request","pediría","pedirías","pediría","pediríamos","pediríais","pedirían","pidiendo","requesting","pedido","requested"]
["pedir","to request, ask for","Indicativo","Indicative","Presente perfecto","Present Perfect","I have requested","he pedido","has pedido","ha pedido","hemos pedido","habéis pedido","han pedido","pidiendo","requesting","pedido","requested"]
["pedir","to request, ask for","Indicativo","Indicative","Futuro perfecto","Future Perfect","I will have requested","habré pedido","habrás pedido","habrá pedido","habremos pedido","habréis pedido","habrán pedido","pidiendo","requesting","pedido","requested"]
["pedir","to request, ask for","Indicativo","Indicative","Pluscuamperfecto","Past Perfect","I had requested","había pedido","habías pedido","había pedido","habíamos pedido","habíais pedido","habían pedido","pidiendo","requesting","pedido","requested"]
["pedir","to request, ask for","Indicativo","Indicative","Pretérito anterior","Preterite (Archaic)","I had requested","hube pedido","hubiste pedido","hubo pedido","hubimos pedido","hubisteis pedido","hubieron pedido","pidiendo","requesting","pedido","requested"]
["pedir","to request, ask for","Indicativo","Indicative","Condicional perfecto","Conditional Perfect","I would have requested","habría pedido","habrías pedido","habría pedido","habríamos pedido","habríais pedido","habrían pedido","pidiendo","requesting","pedido","requested"]
["pedir","to request, ask for","Subjuntivo","Subjunctive","Presente","Present","I request, am requesting","pida","pidas","pida","pidamos","pidáis","pidan","pidiendo","requesting","pedido","requested"]
["pedir","to request, ask for","Subjuntivo","Subjunctive","Imperfecto","Imperfect","I requested, was requesting","pidiera","pidieras","pidiera","pidiéramos","pidierais","pidieran","pidiendo","requesting","pedido","requested"]
["pedir","to request, ask for","Subjuntivo","Subjunctive","Futuro","Future","I will request","pidiere","pidieres","pidiere","pidiéremos","pidiereis","pidieren","pidiendo","requesting","pedido","requested"]
["pedir","to request, ask for","Subjuntivo","Subjunctive","Presente perfecto","Present Perfect","I have requested, requested","haya pedido","hayas pedido","haya pedido","hayamos pedido","hayáis pedido","hayan pedido","pidiendo","requesting","pedido","requested"]
["pedir","to request, ask for","Subjuntivo","Subjunctive","Futuro perfecto","Future Perfect","I will have requested","hubiere pedido","hubieres pedido","hubiere pedido","hubiéremos pedido","hubiereis pedido","hubieren pedido","pidiendo","requesting","pedido","requested"]
["pedir","to request, ask for","Subjuntivo","Subjunctive","Pluscuamperfecto","Past Perfect","I had requested","hubiera pedido","hubieras pedido","hubiera pedido","hubiéramos pedido","hubierais pedido","hubieran pedido","pidiendo","requesting","pedido","requested"]
["pensar","to think","Imperativo Afirmativo","Imperative Affirmative","Presente","Present","Think! Don't think!",null,"piensa","pensad",null,"piense","piensen","pensando","thinking","pensado","thought"]
["pensar","to think","Imperativo Negativo","Imperative Negative","Presente","Present","Think! Don't think!",null,"no pienses","no penséis",null,"no piense","no piensen","pensando","thinking","pensado","thought"]
["pensar","to think","Indicativo","Indicative","Presente","Present","I think, am thinking","pienso","piensas","piensa","pensamos","pensáis","piensan","pensando","thinking","pensado","thought"]
["pensar","to think","Indicativo","Indicative","Futuro","Future","I will think","pensaré","pensarás","pensará","pensaremos","pensaréis","pensarán","pensando","thinking","pensado","thought"]
["pensar","to think","Indicativo","Indicative","Imperfecto","Imperfect","I was thinking, used to think, thought","pensaba","pensabas","pensaba","pensábamos","pensabais","pensaban","pensando","thinking","pensado","thought"]
["pensar","to think","Indicativo","Indicative","Pretérito","Preterite","I thought","pensé","pensaste","pensó","pensamos","pensasteis","pensaron","pensando","thinking","pensado","thought"]
["pensar","to think","Indicativo","Indicative","Condicional","Conditional","I would think","pensaría","pensarías","pensaría","pensaríamos","pensaríais","pensarían","pensando","thinking","pensado","thought"]
["pensar","to think","Indicativo","Indicative","Presente perfecto","Present Perfect","I have thought","he pensado","has pensado","ha pensado","hemos pensado","habéis pensado","han pensado","pensando","thinking","pensado","thought"]
["pensar","to think","Indicativo","Indicative","Futuro perfecto","Future Perfect","I will have thought","habré pensado","habrás pensado","habrá pensado","habremos pensado","habréis pensado","habrán pensado","pensando","thinking","pensado","thought"]
["pensar","to think","Indicativo","Indicative","Pluscuamperfecto","Past Perfect","I had thought","había pensado","habías pensado","había pensado","habíamos pensado","habíais pensado","habían pensado","pensando","thinking","pensado","thought"]
["pensar","to think","Indicativo","Indicative","Pretérito anterior","Preterite (Archaic)","I had thought","hube pensado","hubiste pensado","hubo pensado","hubimos pensado","hubisteis pensado","hubieron pensado","pensando","thinking","pensado","thought"]
["pensar","to think","Indicativo","Indicative","Condicional perfecto","Conditional Perfect","I would have thought","habría pensado","habrías pensado","habría pensado","habríamos pensado","habríais pensado","habrían pensado","pensando","thinking","pensado","thought"]
["pensar","to think","Subjuntivo","Subjunctive","Presente","Present","I think, am thinking","piense","pienses","piense","pensemos","penséis","piensen","pensando","thinking","pensado","thought"]
["pensar","to think","Subjuntivo","Subjunctive","Imperfecto","Imperfect","I thought, was thinking","pensara","pensaras","pensara","pensáramos","pensarais","pensaran","pensando","thinking","pensado","thought"]
["pensar","to think","Subjuntivo","Subjunctive","Futuro","Future","I will think","pensare","pensares","pensare","pensáremos","pensareis","pensaren","pensando","thinking","pensado","thought"]
["pensar","to think","Subjuntivo","Subjunctive","Presente perfecto","Present Perfect","I have thought, thought","haya pensado","hayas pensado","haya pensado","hayamos pensado","hayáis pensado","hayan pensado","pensando","thinking","pensado","thought"]
["pensar","to think","Subjuntivo","Subjunctive","Futuro perfecto","Future Perfect","I will have thought","hubiere pensado","hubieres pensado","hubiere pensado","hubiéremos pensado","hubiereis pensado","hubieren pensado","pensando","thinking","pensado","thought"]
["pensar","to think","Subjuntivo","Subjunctive","Pluscuamperfecto","Past Perfect","I had thought","hubiera pensado","hubieras pensado","hubiera pensado","hubiéramos pensado","hubierais pensado","hubieran pensado","pensando","thinking","pensado","thought"]
["perder","to lose","Imperativo Afirmativo","Imperative Affirmative","Presente","Present","Lose! Don't lose!",null,"pierde","perded",null,"pierda","pierdan","perdiendo","losing","perdido","lost"]
["perder","to lose","Imperativo Negativo","Imperative Negative","Presente","Present","Lose! Don't lose!",null,"no pierdas","no perdáis",null,"no pierda","no pierdan","perdiendo","losing","perdido","lost"]
["perder","to lose","Indicativo","Indicative","Presente","Present","I lose, am losing","pierdo","pierdes","pierde","perdemos","perdéis","pierden","perdiendo","losing","perdido","lost"]
["perder","to lose","Indicativo","Indicative","Futuro","Future","I will lose","perderé","perderás","perderá","perderemos","perderéis","perderán","perdiendo","losing","perdido","lost"]
["perder","to lose","Indicativo","Indicative","Imperfecto","Imperfect","I was losing, used to lose, lost","perdía","perdías","perdía","perdíamos","perdíais","perdían","perdiendo","losing","perdido","lost"]
["perder","to lose","Indicativo","Indicative","Pretérito","Preterite","I lost","perdí","perdiste","perdió","perdimos","perdisteis","perdieron","perdiendo","losing","perdido","lost"]
["perder","to lose","Indicativo","Indicative","Condicional","Conditional","I would lose","perdería","perderías","perdería","perderíamos","perderíais","perderían","perdiendo","losing","perdido","lost"]
["perder","to lose","Indicativo","Indicative","Presente perfecto","Present Perfect","I have lost","he perdido","has perdido","ha perdido","hemos perdido","habéis perdido","han perdido","perdiendo","losing","perdido","lost"]
["perder","to lose","Indicativo","Indicative","Futuro perfecto","Future Perfect","I will have lost","habré perdido","habrás perdido","habrá perdido","habremos perdido","habréis perdido","habrán perdido","perdiendo","losing","perdido","lost"]
["perder","to lose","Indicativo","Indicative","Pluscuamperfecto","Past Perfect","I had lost","había perdido","habías perdido","había perdido","habíamos perdido","habíais perdido","habían perdido","perdiendo","losing","perdido","lost"]
["perder","to lose","Indicativo","Indicative","Pretérito anterior","Preterite (Archaic)","I had lost","hube perdido","hubiste perdido","hubo perdido","hubimos perdido","hubisteis perdido","hubieron perdido","perdiendo","losing","perdido","lost"]
["perder","to lose","Indicativo","Indicative","Condicional perfecto","Conditional Perfect","I would have lost","habría perdido","habrías perdido","habría perdido","habríamos perdido","habríais perdido","habrían perdido","perdiendo","losing","perdido","lost"]
["perder","to lose","Subjuntivo","Subjunctive","Presente","Present","I lose, am losing","pierda","pierdas","pierda","perdamos","perdáis","pierdan","perdiendo","losing","perdido","lost"]
["perder","to lose","Subjuntivo","Subjunctive","Imperfecto","Imperfect","I lost, was losing","perdiera","perdieras","perdiera","perdiéramos","perdierais","perdieran","perdiendo","losing","perdido","lost"]
["perder","to lose","Subjuntivo","Subjunctive","Futuro","Future","I will lose","perdiere","perdieres","perdiere","perdiéremos","perdiereis","perdieren","perdiendo","losing","perdido","lost"]
["perder","to lose","Subjuntivo","Subjunctive","Presente perfecto","Present Perfect","I have lost, lost","haya perdido","hayas perdido","haya perdido","hayamos perdido","hayáis perdido","hayan perdido","perdiendo","losing","perdido","lost"]
["perder","to lose","Subjuntivo","Subjunctive","Futuro perfecto","Future Perfect","I will have lost","hubiere perdido","hubieres perdido","hubiere perdido","hubiéremos perdido","hubiereis perdido","hubieren perdido","perdiendo","losing","perdido","lost"]
["perder","to lose","Subjuntivo","Subjunctive","Pluscuamperfecto","Past Perfect","I had lost","hubiera perdido","hubieras perdido","hubiera perdido","hubiéramos perdido","hubierais perdido","hubieran perdido","perdiendo","losing","perdido","lost"]
["permitir","to permit, allow","Imperativo Afirmativo","Imperative Affirmative","Presente","Present","Permit! Don't permit!",null,"permite","permitid",null,"permita","permitan","permitiendo","permitting","permitido","permitted"]
["permitir","to permit, allow","Imperativo Negativo","Imperative Negative","Presente","Present","Permit! Don't permit!",null,"no permitas","no permitáis",null,"no permita","no permitan","permitiendo","permitting","permitido","permitted"]
["permitir","to permit, allow","Indicativo","Indicative","Presente","Present","I permit, am permitting","permito","permites","permite","permitimos","permitís","permiten","permitiendo","permitting","permitido","permitted"]
["permitir","to permit, allow","Indicativo","Indicative","Futuro","Future","I will permit","permitiré","permitirás","permitirá","permitiremos","permitiréis","permitirán","permitiendo","permitting","permitido","permitted"]
["permitir","to permit, allow","Indicativo","Indicative","Imperfecto","Imperfect","I was permitting, used to permit, permitted","permitía","permitías","permitía","permitíamos","permitíais","permitían","permitiendo","permitting","permitido","permitted"]
["permitir","to permit, allow","Indicativo","Indicative","Pretérito","Preterite","I permitted","permití","permitiste","permitió","permitimos","permitisteis","permitieron","permitiendo","permitting","permitido","permitted"]
["permitir","to permit, allow","Indicativo","Indicative","Condicional","Conditional","I would permit","permitiría","permitirías","permitiría","permitiríamos","permitiríais","permitirían","permitiendo","permitting","permitido","permitted"]
["permitir","to permit, allow","Indicativo","Indicative","Presente perfecto","Present Perfect","I have permitted","he permitido","has permitido","ha permitido","hemos permitido","habéis permitido","han permitido","permitiendo","permitting","permitido","permitted"]
["permitir","to permit, allow","Indicativo","Indicative","Futuro perfecto","Future Perfect","I will have permitted","habré permitido","habrás permitido","habrá permitido","habremos permitido","habréis permitido","habrán permitido","permitiendo","permitting","permitido","permitted"]
["permitir","to permit, allow","Indicativo","Indicative","Pluscuamperfecto","Past Perfect","I had permitted","había permitido","habías permitido","había permitido","habíamos permitido","habíais permitido","habían permitido","permitiendo","permitting","permitido","permitted"]
["permitir","to permit, allow","Indicativo","Indicative","Pretérito anterior","Preterite (Archaic)","I had permitted","hube permitido","hubiste permitido","hubo permitido","hubimos permitido","hubisteis permitido","hubieron permitido","permitiendo","permitting","permitido","permitted"]
["permitir","to permit, allow","Indicativo","Indicative","Condicional perfecto","Conditional Perfect","I would have permitted","habría permitido","habrías permitido","habría permitido","habríamos permitido","habríais permitido","habrían permitido","permitiendo","permitting","permitido","permitted"]
["permitir","to permit, allow","Subjuntivo","Subjunctive","Presente","Present","I permit, am permitting","permita","permitas","permita","permitamos","permitáis","permitan","permitiendo","permitting","permitido","permitted"]
["permitir","to permit, allow","Subjuntivo","Subjunctive","Imperfecto","Imperfect","I permitted, was permitting","permitiera","permitieras","permitiera","permitiéramos","permitierais","permitieran","permitiendo","permitting","permitido","permitted"]
["permitir","to permit, allow","Subjuntivo","Subjunctive","Futuro","Future","I will permit","permitiere","permitieres","permitiere","permitiéremos","permitiereis","permitieren","permitiendo","permitting","permitido","permitted"]
["permitir","to permit, allow","Subjuntivo","Subjunctive","Presente perfecto","Present Perfect","I have permitted, permitted","haya permitido","hayas permitido","haya permitido","hayamos permitido","hayáis permitido","hayan permitido","permitiendo","permitting","permitido","permitted"]
["permitir","to permit, allow","Subjuntivo","Subjunctive","Futuro perfecto","Future Perfect","I will have permitted","hubiere permitido","hubieres permitido","hubiere permitido","hubiéremos permitido","hubiereis permitido","hubieren permitido","permitiendo","permitting","permitido","permitted"]
["permitir","to permit, allow","Subjuntivo","Subjunctive","Pluscuamperfecto","Past Perfect","I had permitted","hubiera permitido","hubieras permitido","hubiera permitido","hubiéramos permitido","hubierais permitido","hubieran permitido","permitiendo","permitting","permitido","permitted"]
["pertenecer","to belong, pertain","Imperativo Afirmativo","Imperative Affirmative","Presente","Present","Belong! Don't belong!",null,"pertenece","perteneced",null,"pertenezca","pertenezcan","perteneciendo","belonging","pertenecido","belonged"]
["pertenecer","to belong, pertain","Imperativo Negativo","Imperative Negative","Presente","Present","Belong! Don't belong!",null,"no pertenezcas","no pertenezcáis",null,"no pertenezca","no pertenezcan","perteneciendo","belonging","pertenecido","belonged"]
["pertenecer","to belong, pertain","Indicativo","Indicative","Presente","Present","I belong, am belonging","pertenezco","perteneces","pertenece","pertenecemos","pertenecéis","pertenecen","perteneciendo","belonging","pertenecido","belonged"]
["pertenecer","to belong, pertain","Indicativo","Indicative","Futuro","Future","I will belong","perteneceré","pertenecerás","pertenecerá","perteneceremos","perteneceréis","pertenecerán","perteneciendo","belonging","pertenecido","belonged"]
["pertenecer","to belong, pertain","Indicativo","Indicative","Imperfecto","Imperfect","I was belonging, used to belong, belonged","pertenecía","pertenecías","pertenecía","pertenecíamos","pertenecíais","pertenecían","perteneciendo","belonging","pertenecido","belonged"]
["pertenecer","to belong, pertain","Indicativo","Indicative","Pretérito","Preterite","I belonged","pertenecí","perteneciste","perteneció","pertenecimos","pertenecisteis","pertenecieron","perteneciendo","belonging","pertenecido","belonged"]
["pertenecer","to belong, pertain","Indicativo","Indicative","Condicional","Conditional","I would belong","pertenecería","pertenecerías","pertenecería","perteneceríamos","perteneceríais","pertenecerían","perteneciendo","belonging","pertenecido","belonged"]
["pertenecer","to belong, pertain","Indicativo","Indicative","Presente perfecto","Present Perfect","I have belonged","he pertenecido","has pertenecido","ha pertenecido","hemos pertenecido","habéis pertenecido","han pertenecido","perteneciendo","belonging","pertenecido","belonged"]
["pertenecer","to belong, pertain","Indicativo","Indicative","Futuro perfecto","Future Perfect","I will have belonged","habré pertenecido","habrás pertenecido","habrá pertenecido","habremos pertenecido","habréis pertenecido","habrán pertenecido","perteneciendo","belonging","pertenecido","belonged"]
["pertenecer","to belong, pertain","Indicativo","Indicative","Pluscuamperfecto","Past Perfect","I had belonged","había pertenecido","habías pertenecido","había pertenecido","habíamos pertenecido","habíais pertenecido","habían pertenecido","perteneciendo","belonging","pertenecido","belonged"]
["pertenecer","to belong, pertain","Indicativo","Indicative","Pretérito anterior","Preterite (Archaic)","I had belonged","hube pertenecido","hubiste pertenecido","hubo pertenecido","hubimos pertenecido","hubisteis pertenecido","hubieron pertenecido","perteneciendo","belonging","pertenecido","belonged"]
["pertenecer","to belong, pertain","Indicativo","Indicative","Condicional perfecto","Conditional Perfect","I would have belonged","habría pertenecido","habrías pertenecido","habría pertenecido","habríamos pertenecido","habríais pertenecido","habrían pertenecido","perteneciendo","belonging","pertenecido","belonged"]
["pertenecer","to belong, pertain","Subjuntivo","Subjunctive","Presente","Present","I belong, am belonging","pertenezca","pertenezcas","pertenezca","pertenezcamos","pertenezcáis","pertenezcan","perteneciendo","belonging","pertenecido","belonged"]
["pertenecer","to belong, pertain","Subjuntivo","Subjunctive","Imperfecto","Imperfect","I belonged, was belonging","perteneciera","pertenecieras","perteneciera","perteneciéramos","pertenecierais","pertenecieran","perteneciendo","belonging","pertenecido","belonged"]
["pertenecer","to belong, pertain","Subjuntivo","Subjunctive","Futuro","Future","I will belong","perteneciere","pertenecieres","perteneciere","perteneciéremos","perteneciereis","pertenecieren","perteneciendo","belonging","pertenecido","belonged"]
["pertenecer","to belong, pertain","Subjuntivo","Subjunctive","Presente perfecto","Present Perfect","I have belonged, belonged","haya pertenecido","hayas pertenecido","haya pertenecido","hayamos pertenecido","hayáis pertenecido","hayan pertenecido","perteneciendo","belonging","pertenecido","belonged"]
["pertenecer","to belong, pertain","Subjuntivo","Subjunctive","Futuro perfecto","Future Perfect","I will have belonged","hubiere pertenecido","hubieres pertenecido","hubiere pertenecido","hubiéremos pertenecido","hubiereis pertenecido","hubieren pertenecido","perteneciendo","belonging","pertenecido","belonged"]
["pertenecer","to belong, pertain","Subjuntivo","Subjunctive","Pluscuamperfecto","Past Perfect","I had belonged","hubiera pertenecido","hubieras pertenecido","hubiera pertenecido","hubiéramos pertenecido","hubierais pertenecido","hubieran pertenecido","perteneciendo","belonging","pertenecido","belonged"]
["pesar","to weigh; to weigh down, weigh heavily;","Imperativo Afirmativo","Imperative Affirmative","Presente","Present","Weigh! Don't weigh!",null,"pesa","pesad",null,"pese","pesen","pesando","weighing","pesado","weighed"]
["pesar","to weigh; to weigh down, weigh heavily;","Imperativo Negativo","Imperative Negative","Presente","Present","Weigh! Don't weigh!",null,"no peses","no peséis",null,"no pese","no pesen","pesando","weighing","pesado","weighed"]
["pesar","to weigh; to weigh down, weigh heavily;","Indicativo","Indicative","Presente","Present","I weigh, am weighing","peso","pesas","pesa","pesamos","pesáis","pesan","pesando","weighing","pesado","weighed"]
["pesar","to weigh; to weigh down, weigh heavily;","Indicativo","Indicative","Futuro","Future","I will weigh","pesaré","pesarás","pesará","pesaremos","pesaréis","pesarán","pesando","weighing","pesado","weighed"]
["pesar","to weigh; to weigh down, weigh heavily;","Indicativo","Indicative","Imperfecto","Imperfect","I was weighing, used to weigh, weighed","pesaba","pesabas","pesaba","pesábamos","pesabais","pesaban","pesando","weighing","pesado","weighed"]
["pesar","to weigh; to weigh down, weigh heavily;","Indicativo","Indicative","Pretérito","Preterite","I weighed","pesé","pesaste","pesó","pesamos","pesasteis","pesaron","pesando","weighing","pesado","weighed"]
["pesar","to weigh; to weigh down, weigh heavily;","Indicativo","Indicative","Condicional","Conditional","I would weigh","pesaría","pesarías","pesaría","pesaríamos","pesaríais","pesarían","pesando","weighing","pesado","weighed"]
["pesar","to weigh; to weigh down, weigh heavily;","Indicativo","Indicative","Presente perfecto","Present Perfect","I have weighed","he pesado","has pesado","ha pesado","hemos pesado","habéis pesado","han pesado","pesando","weighing","pesado","weighed"]
["pesar","to weigh; to weigh down, weigh heavily;","Indicativo","Indicative","Futuro perfecto","Future Perfect","I will have weighed","habré pesado","habrás pesado","habrá pesado","habremos pesado","habréis pesado","habrán pesado","pesando","weighing","pesado","weighed"]
["pesar","to weigh; to weigh down, weigh heavily;","Indicativo","Indicative","Pluscuamperfecto","Past Perfect","I had weighed","había pesado","habías pesado","había pesado","habíamos pesado","habíais pesado","habían pesado","pesando","weighing","pesado","weighed"]
["pesar","to weigh; to weigh down, weigh heavily;","Indicativo","Indicative","Pretérito anterior","Preterite (Archaic)","I had weighed","hube pesado","hubiste pesado","hubo pesado","hubimos pesado","hubisteis pesado","hubieron pesado","pesando","weighing","pesado","weighed"]
["pesar","to weigh; to weigh down, weigh heavily;","Indicativo","Indicative","Condicional perfecto","Conditional Perfect","I would have weighed","habría pesado","habrías pesado","habría pesado","habríamos pesado","habríais pesado","habrían pesado","pesando","weighing","pesado","weighed"]
["pesar","to weigh; to weigh down, weigh heavily;","Subjuntivo","Subjunctive","Presente","Present","I weigh, am weighing","pese","peses","pese","pesemos","peséis","pesen","pesando","weighing","pesado","weighed"]
["pesar","to weigh; to weigh down, weigh heavily;","Subjuntivo","Subjunctive","Imperfecto","Imperfect","I weighed, was weighing","pesara","pesaras","pesara","pesáramos","pesarais","pesaran","pesando","weighing","pesado","weighed"]
["pesar","to weigh; to weigh down, weigh heavily;","Subjuntivo","Subjunctive","Futuro","Future","I will weigh","pesare","pesares","pesare","pesáremos","pesareis","pesaren","pesando","weighing","pesado","weighed"]
["pesar","to weigh; to weigh down, weigh heavily;","Subjuntivo","Subjunctive","Presente perfecto","Present Perfect","I have weighed, weighed","haya pesado","hayas pesado","haya pesado","hayamos pesado","hayáis pesado","hayan pesado","pesando","weighing","pesado","weighed"]
["pesar","to weigh; to weigh down, weigh heavily;","Subjuntivo","Subjunctive","Futuro perfecto","Future Perfect","I will have weighed","hubiere pesado","hubieres pesado","hubiere pesado","hubiéremos pesado","hubiereis pesado","hubieren pesado","pesando","weighing","pesado","weighed"]
["pesar","to weigh; to weigh down, weigh heavily;","Subjuntivo","Subjunctive","Pluscuamperfecto","Past Perfect","I had weighed","hubiera pesado","hubieras pesado","hubiera pesado","hubiéramos pesado","hubierais pesado","hubieran pesado","pesando","weighing","pesado","weighed"]
["poder","to be able, can","Imperativo Afirmativo","Imperative Affirmative","Presente","Present","Be able! Don't be able!",null,"puede","poded",null,"pueda","puedan","pudiendo","being able","podido","been able"]
["poder","to be able, can","Imperativo Negativo","Imperative Negative","Presente","Present","Be able! Don't be able!",null,"no puedas","no podáis",null,"no pueda","no puedan","pudiendo","being able","podido","been able"]
["poder","to be able, can","Indicativo","Indicative","Presente","Present","I am able, can","puedo","puedes","puede","podemos","podéis","pueden","pudiendo","being able","podido","been able"]
["poder","to be able, can","Indicativo","Indicative","Futuro","Future","I will be able","podré","podrás","podrá","podremos","podréis","podrán","pudiendo","being able","podido","been able"]
["poder","to be able, can","Indicativo","Indicative","Imperfecto","Imperfect","I used to be able, was able, could","podía","podías","podía","podíamos","podíais","podían","pudiendo","being able","podido","been able"]
["poder","to be able, can","Indicativo","Indicative","Pretérito","Preterite","I was able, could","pude","pudiste","pudo","pudimos","pudisteis","pudieron","pudiendo","being able","podido","been able"]
["poder","to be able, can","Indicativo","Indicative","Condicional","Conditional","I would be able","podría","podrías","podría","podríamos","podríais","podrían","pudiendo","being able","podido","been able"]
["poder","to be able, can","Indicativo","Indicative","Presente perfecto","Present Perfect","I have been able","he podido","has podido","ha podido","hemos podido","habéis podido","han podido","pudiendo","being able","podido","been able"]
["poder","to be able, can","Indicativo","Indicative","Futuro perfecto","Future Perfect","I will have been able","habré podido","habrás podido","habrá podido","habremos podido","habréis podido","habrán podido","pudiendo","being able","podido","been able"]
["poder","to be able, can","Indicativo","Indicative","Pluscuamperfecto","Past Perfect","I had been able","había podido","habías podido","había podido","habíamos podido","habíais podido","habían podido","pudiendo","being able","podido","been able"]
["poder","to be able, can","Indicativo","Indicative","Pretérito anterior","Preterite (Archaic)","I had been able","hube podido","hubiste podido","hubo podido","hubimos podido","hubisteis podido","hubieron podido","pudiendo","being able","podido","been able"]
["poder","to be able, can","Indicativo","Indicative","Condicional perfecto","Conditional Perfect","I would have been able","habría podido","habrías podido","habría podido","habríamos podido","habríais podido","habrían podido","pudiendo","being able","podido","been able"]
["poder","to be able, can","Subjuntivo","Subjunctive","Presente","Present","I am able, can","pueda","puedas","pueda","podamos","podáis","puedan","pudiendo","being able","podido","been able"]
["poder","to be able, can","Subjuntivo","Subjunctive","Imperfecto","Imperfect","I was able, could","pudiera","pudieras","pudiera","pudiéramos","pudierais","pudieran","pudiendo","being able","podido","been able"]
["poder","to be able, can","Subjuntivo","Subjunctive","Futuro","Future","I will be able","pudiere","pudieres","pudiere","pudiéremos","pudiereis","pudieren","pudiendo","being able","podido","been able"]
["poder","to be able, can","Subjuntivo","Subjunctive","Presente perfecto","Present Perfect","I have been able, was able","haya podido","hayas podido","haya podido","hayamos podido","hayáis podido","hayan podido","pudiendo","being able","podido","been able"]
["poder","to be able, can","Subjuntivo","Subjunctive","Futuro perfecto","Future Perfect","I will have been able","hubiere podido","hubieres podido","hubiere podido","hubiéremos podido","hubiereis podido","hubieren podido","pudiendo","being able","podido","been able"]
["poder","to be able, can","Subjuntivo","Subjunctive","Pluscuamperfecto","Past Perfect","I had been able","hubiera podido","hubieras podido","hubiera podido","hubiéramos podido","hubierais podido","hubieran podido","pudiendo","being able","podido","been able"]
["poner","to put, place, set","Imperativo Afirmativo","Imperative Affirmative","Presente","Present","Put! Don't put!",null,"pon","poned",null,"ponga","pongan","poniendo","puting","puesto","put"]
["poner","to put, place, set","Imperativo Negativo","Imperative Negative","Presente","Present","Put! Don't put!",null,"no pongas","no pongáis",null,"no ponga","no pongan","poniendo","puting","puesto","put"]
["poner","to put, place, set","Indicativo","Indicative","Presente","Present","I put, am puting","pongo","pones","pone","ponemos","ponéis","ponen","poniendo","puting","puesto","put"]
["poner","to put, place, set","Indicativo","Indicative","Futuro","Future","I will put","pondré","pondrás","pondrá","pondremos","pondréis","pondrán","poniendo","puting","puesto","put"]
["poner","to put, place, set","Indicativo","Indicative","Imperfecto","Imperfect","I was puting, used to put, put","ponía","ponías","ponía","poníamos","poníais","ponían","poniendo","puting","puesto","put"]
["poner","to put, place, set","Indicativo","Indicative","Pretérito","Preterite","I put","puse","pusiste","puso","pusimos","pusisteis","pusieron","poniendo","puting","puesto","put"]
["poner","to put, place, set","Indicativo","Indicative","Condicional","Conditional","I would put","pondría","pondrías","pondría","pondríamos","pondríais","pondrían","poniendo","puting","puesto","put"]
["poner","to put, place, set","Indicativo","Indicative","Presente perfecto","Present Perfect","I have put","he puesto","has puesto","ha puesto","hemos puesto","habéis puesto","han puesto","poniendo","puting","puesto","put"]
["poner","to put, place, set","Indicativo","Indicative","Futuro perfecto","Future Perfect","I will have put","habré puesto","habrás puesto","habrá puesto","habremos puesto","habréis puesto","habrán puesto","poniendo","puting","puesto","put"]
["poner","to put, place, set","Indicativo","Indicative","Pluscuamperfecto","Past Perfect","I had put","había puesto","habías puesto","había puesto","habíamos puesto","habíais puesto","habían puesto","poniendo","puting","puesto","put"]
["poner","to put, place, set","Indicativo","Indicative","Pretérito anterior","Preterite (Archaic)","I had put","hube puesto","hubiste puesto","hubo puesto","hubimos puesto","hubisteis puesto","hubieron puesto","poniendo","puting","puesto","put"]
["poner","to put, place, set","Indicativo","Indicative","Condicional perfecto","Conditional Perfect","I would have put","habría puesto","habrías puesto","habría puesto","habríamos puesto","habríais puesto","habrían puesto","poniendo","puting","puesto","put"]
["poner","to put, place, set","Subjuntivo","Subjunctive","Presente","Present","I put, am puting","ponga","pongas","ponga","pongamos","pongáis","pongan","poniendo","puting","puesto","put"]
["poner","to put, place, set","Subjuntivo","Subjunctive","Imperfecto","Imperfect","I put, was puting","pusiera","pusieras","pusiera","pusiéramos","pusierais","pusieran","poniendo","puting","puesto","put"]
["poner","to put, place, set","Subjuntivo","Subjunctive","Futuro","Future","I will put","pusiere","pusieres","pusiere","pusiéremos","pusiereis","pusieren","poniendo","puting","puesto","put"]
["poner","to put, place, set","Subjuntivo","Subjunctive","Presente perfecto","Present Perfect","I have put, put","haya puesto","hayas puesto","haya puesto","hayamos puesto","hayáis puesto","hayan puesto","poniendo","puting","puesto","put"]
["poner","to put, place, set","Subjuntivo","Subjunctive","Futuro perfecto","Future Perfect","I will have put","hubiere puesto","hubieres puesto","hubiere puesto","hubiéremos puesto","hubiereis puesto","hubieren puesto","poniendo","puting","puesto","put"]
["poner","to put, place, set","Subjuntivo","Subjunctive","Pluscuamperfecto","Past Perfect","I had put","hubiera puesto","hubieras puesto","hubiera puesto","hubiéramos puesto","hubierais puesto","hubieran puesto","poniendo","puting","puesto","put"]
["preferir","to prefer","Imperativo Afirmativo","Imperative Affirmative","Presente","Present","Prefer! Don't prefer!",null,"prefiere","preferid",null,"prefiera","prefieran","prefiriendo","preferring","preferido","preferred"]
["preferir","to prefer","Imperativo Negativo","Imperative Negative","Presente","Present","Prefer! Don't prefer!",null,"no prefieras","no prefiráis",null,"no prefiera","no prefieran","prefiriendo","preferring","preferido","preferred"]
["preferir","to prefer","Indicativo","Indicative","Presente","Present","I prefer, am preferring","prefiero","prefieres","prefiere","preferimos","preferís","prefieren","prefiriendo","preferring","preferido","preferred"]
["preferir","to prefer","Indicativo","Indicative","Futuro","Future","I will prefer","preferiré","preferirás","preferirá","preferiremos","preferiréis","preferirán","prefiriendo","preferring","preferido","preferred"]
["preferir","to prefer","Indicativo","Indicative","Imperfecto","Imperfect","I was preferring, used to prefer, preferred","prefería","preferías","prefería","preferíamos","preferíais","preferían","prefiriendo","preferring","preferido","preferred"]
["preferir","to prefer","Indicativo","Indicative","Pretérito","Preterite","I preferred","preferí","preferiste","prefirió","preferimos","preferisteis","prefirieron","prefiriendo","preferring","preferido","preferred"]
["preferir","to prefer","Indicativo","Indicative","Condicional","Conditional","I would prefer","preferiría","preferirías","preferiría","preferiríamos","preferiríais","preferirían","prefiriendo","preferring","preferido","preferred"]
["preferir","to prefer","Indicativo","Indicative","Presente perfecto","Present Perfect","I have preferred","he preferido","has preferido","ha preferido","hemos preferido","habéis preferido","han preferido","prefiriendo","preferring","preferido","preferred"]
["preferir","to prefer","Indicativo","Indicative","Futuro perfecto","Future Perfect","I will have preferred","habré preferido","habrás preferido","habrá preferido","habremos preferido","habréis preferido","habrán preferido","prefiriendo","preferring","preferido","preferred"]
["preferir","to prefer","Indicativo","Indicative","Pluscuamperfecto","Past Perfect","I had preferred","había preferido","habías preferido","había preferido","habíamos preferido","habíais preferido","habían preferido","prefiriendo","preferring","preferido","preferred"]
["preferir","to prefer","Indicativo","Indicative","Pretérito anterior","Preterite (Archaic)","I had preferred","hube preferido","hubiste preferido","hubo preferido","hubimos preferido","hubisteis preferido","hubieron preferido","prefiriendo","preferring","preferido","preferred"]
["preferir","to prefer","Indicativo","Indicative","Condicional perfecto","Conditional Perfect","I would have preferred","habría preferido","habrías preferido","habría preferido","habríamos preferido","habríais preferido","habrían preferido","prefiriendo","preferring","preferido","preferred"]
["preferir","to prefer","Subjuntivo","Subjunctive","Presente","Present","I prefer, am preferring","prefiera","prefieras","prefiera","prefiramos","prefiráis","prefieran","prefiriendo","preferring","preferido","preferred"]
["preferir","to prefer","Subjuntivo","Subjunctive","Imperfecto","Imperfect","I preferred, was preferring","prefiriera","prefirieras","prefiriera","prefiriéramos","prefirierais","prefirieran","prefiriendo","preferring","preferido","preferred"]
["preferir","to prefer","Subjuntivo","Subjunctive","Futuro","Future","I will prefer","prefiriere","prefirieres","prefiriere","prefiriéremos","prefiriereis","prefirieren","prefiriendo","preferring","preferido","preferred"]
["preferir","to prefer","Subjuntivo","Subjunctive","Presente perfecto","Present Perfect","I have preferred, preferred","haya preferido","hayas preferido","haya preferido","hayamos preferido","hayáis preferido","hayan preferido","prefiriendo","preferring","preferido","preferred"]
["preferir","to prefer","Subjuntivo","Subjunctive","Futuro perfecto","Future Perfect","I will have preferred","hubiere preferido","hubieres preferido","hubiere preferido","hubiéremos preferido","hubiereis preferido","hubieren preferido","prefiriendo","preferring","preferido","preferred"]
["preferir","to prefer","Subjuntivo","Subjunctive","Pluscuamperfecto","Past Perfect","I had preferred","hubiera preferido","hubieras preferido","hubiera preferido","hubiéramos preferido","hubierais preferido","hubieran preferido","prefiriendo","preferring","preferido","preferred"]
["preguntar","to ask, inquire","Imperativo Afirmativo","Imperative Affirmative","Presente","Present","Ask! Don't ask!",null,"pregunta","preguntad",null,"pregunte","pregunten","preguntando","asking","preguntado","asked"]
["preguntar","to ask, inquire","Imperativo Negativo","Imperative Negative","Presente","Present","Ask! Don't ask!",null,"no preguntes","no preguntéis",null,"no pregunte","no pregunten","preguntando","asking","preguntado","asked"]
["preguntar","to ask, inquire","Indicativo","Indicative","Presente","Present","I ask, am asking","pregunto","preguntas","pregunta","preguntamos","preguntáis","preguntan","preguntando","asking","preguntado","asked"]
["preguntar","to ask, inquire","Indicativo","Indicative","Futuro","Future","I will ask","preguntaré","preguntarás","preguntará","preguntaremos","preguntaréis","preguntarán","preguntando","asking","preguntado","asked"]
["preguntar","to ask, inquire","Indicativo","Indicative","Imperfecto","Imperfect","I was asking, used to ask, asked","preguntaba","preguntabas","preguntaba","preguntábamos","preguntabais","preguntaban","preguntando","asking","preguntado","asked"]
["preguntar","to ask, inquire","Indicativo","Indicative","Pretérito","Preterite","I asked","pregunté","preguntaste","preguntó","preguntamos","preguntasteis","preguntaron","preguntando","asking","preguntado","asked"]
["preguntar","to ask, inquire","Indicativo","Indicative","Condicional","Conditional","I would ask","preguntaría","preguntarías","preguntaría","preguntaríamos","preguntaríais","preguntarían","preguntando","asking","preguntado","asked"]
["preguntar","to ask, inquire","Indicativo","Indicative","Presente perfecto","Present Perfect","I have asked","he preguntado","has preguntado","ha preguntado","hemos preguntado","habéis preguntado","han preguntado","preguntando","asking","preguntado","asked"]
["preguntar","to ask, inquire","Indicativo","Indicative","Futuro perfecto","Future Perfect","I will have asked","habré preguntado","habrás preguntado","habrá preguntado","habremos preguntado","habréis preguntado","habrán preguntado","preguntando","asking","preguntado","asked"]
["preguntar","to ask, inquire","Indicativo","Indicative","Pluscuamperfecto","Past Perfect","I had asked","había preguntado","habías preguntado","había preguntado","habíamos preguntado","habíais preguntado","habían preguntado","preguntando","asking","preguntado","asked"]
["preguntar","to ask, inquire","Indicativo","Indicative","Pretérito anterior","Preterite (Archaic)","I had asked","hube preguntado","hubiste preguntado","hubo preguntado","hubimos preguntado","hubisteis preguntado","hubieron preguntado","preguntando","asking","preguntado","asked"]
["preguntar","to ask, inquire","Indicativo","Indicative","Condicional perfecto","Conditional Perfect","I would have asked","habría preguntado","habrías preguntado","habría preguntado","habríamos preguntado","habríais preguntado","habrían preguntado","preguntando","asking","preguntado","asked"]
["preguntar","to ask, inquire","Subjuntivo","Subjunctive","Presente","Present","I ask, am asking","pregunte","preguntes","pregunte","preguntemos","preguntéis","pregunten","preguntando","asking","preguntado","asked"]
["preguntar","to ask, inquire","Subjuntivo","Subjunctive","Imperfecto","Imperfect","I asked, was asking","preguntara","preguntaras","preguntara","preguntáramos","preguntarais","preguntaran","preguntando","asking","preguntado","asked"]
["preguntar","to ask, inquire","Subjuntivo","Subjunctive","Futuro","Future","I will ask","preguntare","preguntares","preguntare","preguntáremos","preguntareis","preguntaren","preguntando","asking","preguntado","asked"]
["preguntar","to ask, inquire","Subjuntivo","Subjunctive","Presente perfecto","Present Perfect","I have asked, asked","haya preguntado","hayas preguntado","haya preguntado","hayamos preguntado","hayáis preguntado","hayan preguntado","preguntando","asking","preguntado","asked"]
["preguntar","to ask, inquire","Subjuntivo","Subjunctive","Futuro perfecto","Future Perfect","I will have asked","hubiere preguntado","hubieres preguntado","hubiere preguntado","hubiéremos preguntado","hubiereis preguntado","hubieren preguntado","preguntando","asking","preguntado","asked"]
["preguntar","to ask, inquire","Subjuntivo","Subjunctive","Pluscuamperfecto","Past Perfect","I had asked","hubiera preguntado","hubieras preguntado","hubiera preguntado","hubiéramos preguntado","hubierais preguntado","hubieran preguntado","preguntando","asking","preguntado","asked"]
["preparar","to prepare, get","Imperativo Afirmativo","Imperative Affirmative","Presente","Present","Prepare! Don't prepare!",null,"prepara","preparad",null,"prepare","preparen","preparando","preparing","preparado","prepared"]
["preparar","to prepare, get","Imperativo Negativo","Imperative Negative","Presente","Present","Prepare! Don't prepare!",null,"no prepares","no preparéis",null,"no prepare","no preparen","preparando","preparing","preparado","prepared"]
["preparar","to prepare, get","Indicativo","Indicative","Presente","Present","I prepare, am preparing","preparo","preparas","prepara","preparamos","preparáis","preparan","preparando","preparing","preparado","prepared"]
["preparar","to prepare, get","Indicativo","Indicative","Futuro","Future","I will prepare","prepararé","prepararás","preparará","prepararemos","prepararéis","prepararán","preparando","preparing","preparado","prepared"]
["preparar","to prepare, get","Indicativo","Indicative","Imperfecto","Imperfect","I was preparing, used to prepare, prepared","preparaba","preparabas","preparaba","preparábamos","preparabais","preparaban","preparando","preparing","preparado","prepared"]
["preparar","to prepare, get","Indicativo","Indicative","Pretérito","Preterite","I prepared","preparé","preparaste","preparó","preparamos","preparasteis","prepararon","preparando","preparing","preparado","prepared"]
["preparar","to prepare, get","Indicativo","Indicative","Condicional","Conditional","I would prepare","prepararía","prepararías","prepararía","prepararíamos","prepararíais","prepararían","preparando","preparing","preparado","prepared"]
["preparar","to prepare, get","Indicativo","Indicative","Presente perfecto","Present Perfect","I have prepared","he preparado","has preparado","ha preparado","hemos preparado","habéis preparado","han preparado","preparando","preparing","preparado","prepared"]
["preparar","to prepare, get","Indicativo","Indicative","Futuro perfecto","Future Perfect","I will have prepared","habré preparado","habrás preparado","habrá preparado","habremos preparado","habréis preparado","habrán preparado","preparando","preparing","preparado","prepared"]
["preparar","to prepare, get","Indicativo","Indicative","Pluscuamperfecto","Past Perfect","I had prepared","había preparado","habías preparado","había preparado","habíamos preparado","habíais preparado","habían preparado","preparando","preparing","preparado","prepared"]
["preparar","to prepare, get","Indicativo","Indicative","Pretérito anterior","Preterite (Archaic)","I had prepared","hube preparado","hubiste preparado","hubo preparado","hubimos preparado","hubisteis preparado","hubieron preparado","preparando","preparing","preparado","prepared"]
["preparar","to prepare, get","Indicativo","Indicative","Condicional perfecto","Conditional Perfect","I would have prepared","habría preparado","habrías preparado","habría preparado","habríamos preparado","habríais preparado","habrían preparado","preparando","preparing","preparado","prepared"]
["preparar","to prepare, get","Subjuntivo","Subjunctive","Presente","Present","I prepare, am preparing","prepare","prepares","prepare","preparemos","preparéis","preparen","preparando","preparing","preparado","prepared"]
["preparar","to prepare, get","Subjuntivo","Subjunctive","Imperfecto","Imperfect","I prepared, was preparing","preparara","prepararas","preparara","preparáramos","prepararais","prepararan","preparando","preparing","preparado","prepared"]
["preparar","to prepare, get","Subjuntivo","Subjunctive","Futuro","Future","I will prepare","preparare","preparares","preparare","preparáremos","preparareis","prepararen","preparando","preparing","preparado","prepared"]
["preparar","to prepare, get","Subjuntivo","Subjunctive","Presente perfecto","Present Perfect","I have prepared, prepared","haya preparado","hayas preparado","haya preparado","hayamos preparado","hayáis preparado","hayan preparado","preparando","preparing","preparado","prepared"]
["preparar","to prepare, get","Subjuntivo","Subjunctive","Futuro perfecto","Future Perfect","I will have prepared","hubiere preparado","hubieres preparado","hubiere preparado","hubiéremos preparado","hubiereis preparado","hubieren preparado","preparando","preparing","preparado","prepared"]
["preparar","to prepare, get","Subjuntivo","Subjunctive","Pluscuamperfecto","Past Perfect","I had prepared","hubiera preparado","hubieras preparado","hubiera preparado","hubiéramos preparado","hubierais preparado","hubieran preparado","preparando","preparing","preparado","prepared"]
["presentar","to introduce","Imperativo Afirmativo","Imperative Affirmative","Presente","Present","Introduce! Don't introduce!",null,"presenta","presentad",null,"presente","presenten","presentando","introducing","presentado","introduced"]
["presentar","to introduce","Imperativo Negativo","Imperative Negative","Presente","Present","Introduce! Don't introduce!",null,"no presentes","no presentéis",null,"no presente","no presenten","presentando","introducing","presentado","introduced"]
["presentar","to introduce","Indicativo","Indicative","Presente","Present","I introduce, am introducing","presento","presentas","presenta","presentamos","presentáis","presentan","presentando","introducing","presentado","introduced"]
["presentar","to introduce","Indicativo","Indicative","Futuro","Future","I will introduce","presentaré","presentarás","presentará","presentaremos","presentaréis","presentarán","presentando","introducing","presentado","introduced"]
["presentar","to introduce","Indicativo","Indicative","Imperfecto","Imperfect","I was introducing, used to introduce, introduced","presentaba","presentabas","presentaba","presentábamos","presentabais","presentaban","presentando","introducing","presentado","introduced"]
["presentar","to introduce","Indicativo","Indicative","Pretérito","Preterite","I introduced","presenté","presentaste","presentó","presentamos","presentasteis","presentaron","presentando","introducing","presentado","introduced"]
["presentar","to introduce","Indicativo","Indicative","Condicional","Conditional","I would introduce","presentaría","presentarías","presentaría","presentaríamos","presentaríais","presentarían","presentando","introducing","presentado","introduced"]
["presentar","to introduce","Indicativo","Indicative","Presente perfecto","Present Perfect","I have introduced","he presentado","has presentado","ha presentado","hemos presentado","habéis presentado","han presentado","presentando","introducing","presentado","introduced"]
["presentar","to introduce","Indicativo","Indicative","Futuro perfecto","Future Perfect","I will have introduced","habré presentado","habrás presentado","habrá presentado","habremos presentado","habréis presentado","habrán presentado","presentando","introducing","presentado","introduced"]
["presentar","to introduce","Indicativo","Indicative","Pluscuamperfecto","Past Perfect","I had introduced","había presentado","habías presentado","había presentado","habíamos presentado","habíais presentado","habían presentado","presentando","introducing","presentado","introduced"]
["presentar","to introduce","Indicativo","Indicative","Pretérito anterior","Preterite (Archaic)","I had introduced","hube presentado","hubiste presentado","hubo presentado","hubimos presentado","hubisteis presentado","hubieron presentado","presentando","introducing","presentado","introduced"]
["presentar","to introduce","Indicativo","Indicative","Condicional perfecto","Conditional Perfect","I would have introduced","habría presentado","habrías presentado","habría presentado","habríamos presentado","habríais presentado","habrían presentado","presentando","introducing","presentado","introduced"]
["presentar","to introduce","Subjuntivo","Subjunctive","Presente","Present","I introduce, am introducing","presente","presentes","presente","presentemos","presentéis","presenten","presentando","introducing","presentado","introduced"]
["presentar","to introduce","Subjuntivo","Subjunctive","Imperfecto","Imperfect","I introduced, was introducing","presentara","presentaras","presentara","presentáramos","presentarais","presentaran","presentando","introducing","presentado","introduced"]
["presentar","to introduce","Subjuntivo","Subjunctive","Futuro","Future","I will introduce","presentare","presentares","presentare","presentáremos","presentareis","presentaren","presentando","introducing","presentado","introduced"]
["presentar","to introduce","Subjuntivo","Subjunctive","Presente perfecto","Present Perfect","I have introduced, introduced","haya presentado","hayas presentado","haya presentado","hayamos presentado","hayáis presentado","hayan presentado","presentando","introducing","presentado","introduced"]
["presentar","to introduce","Subjuntivo","Subjunctive","Futuro perfecto","Future Perfect","I will have introduced","hubiere presentado","hubieres presentado","hubiere presentado","hubiéremos presentado","hubiereis presentado","hubieren presentado","presentando","introducing","presentado","introduced"]
["presentar","to introduce","Subjuntivo","Subjunctive","Pluscuamperfecto","Past Perfect","I had introduced","hubiera presentado","hubieras presentado","hubiera presentado","hubiéramos presentado","hubierais presentado","hubieran presentado","presentando","introducing","presentado","introduced"]
["producir","to produce","Imperativo Afirmativo","Imperative Affirmative","Presente","Present","Produce! Don't produce!",null,"produce","producid",null,"produzca","produzcan","produciendo","producing","producido","produced"]
["producir","to produce","Imperativo Negativo","Imperative Negative","Presente","Present","Produce! Don't produce!",null,"no produzcas","no produzcáis",null,"no produzca","no produzcan","produciendo","producing","producido","produced"]
["producir","to produce","Indicativo","Indicative","Presente","Present","I produce, am producing","produzco","produces","produce","producimos","producís","producen","produciendo","producing","producido","produced"]
["producir","to produce","Indicativo","Indicative","Futuro","Future","I will produce","produciré","producirás","producirá","produciremos","produciréis","producirán","produciendo","producing","producido","produced"]
["producir","to produce","Indicativo","Indicative","Imperfecto","Imperfect","I was producing, used to produce, produced","producía","producías","producía","producíamos","producíais","producían","produciendo","producing","producido","produced"]
["producir","to produce","Indicativo","Indicative","Pretérito","Preterite","I produced","produje","produjiste","produjo","produjimos","produjisteis","produjeron","produciendo","producing","producido","produced"]
["producir","to produce","Indicativo","Indicative","Condicional","Conditional","I would produce","produciría","producirías","produciría","produciríamos","produciríais","producirían","produciendo","producing","producido","produced"]
["producir","to produce","Indicativo","Indicative","Presente perfecto","Present Perfect","I have produced","he producido","has producido","ha producido","hemos producido","habéis producido","han producido","produciendo","producing","producido","produced"]
["producir","to produce","Indicativo","Indicative","Futuro perfecto","Future Perfect","I will have produced","habré producido","habrás producido","habrá producido","habremos producido","habréis producido","habrán producido","produciendo","producing","producido","produced"]
["producir","to produce","Indicativo","Indicative","Pluscuamperfecto","Past Perfect","I had produced","había producido","habías producido","había producido","habíamos producido","habíais producido","habían producido","produciendo","producing","producido","produced"]
["producir","to produce","Indicativo","Indicative","Pretérito anterior","Preterite (Archaic)","I had produced","hube producido","hubiste producido","hubo producido","hubimos producido","hubisteis producido","hubieron producido","produciendo","producing","producido","produced"]
["producir","to produce","Indicativo","Indicative","Condicional perfecto","Conditional Perfect","I would have produced","habría producido","habrías producido","habría producido","habríamos producido","habríais producido","habrían producido","produciendo","producing","producido","produced"]
["producir","to produce","Subjuntivo","Subjunctive","Presente","Present","I produce, am producing","produzca","produzcas","produzca","produzcamos","produzcáis","produzcan","produciendo","producing","producido","produced"]
["producir","to produce","Subjuntivo","Subjunctive","Imperfecto","Imperfect","I produced, was producing","produjera","produjeras","produjera","produjéramos","produjerais","produjeran","produciendo","producing","producido","produced"]
["producir","to produce","Subjuntivo","Subjunctive","Futuro","Future","I will produce","produjere","produjeres","produjere","produjéremos","produjereis","produjeren","produciendo","producing","producido","produced"]
["producir","to produce","Subjuntivo","Subjunctive","Presente perfecto","Present Perfect","I have produced, produced","haya producido","hayas producido","haya producido","hayamos producido","hayáis producido","hayan producido","produciendo","producing","producido","produced"]
["producir","to produce","Subjuntivo","Subjunctive","Futuro perfecto","Future Perfect","I will have produced","hubiere producido","hubieres producido","hubiere producido","hubiéremos producido","hubiereis producido","hubieren producido","produciendo","producing","producido","produced"]
["producir","to produce","Subjuntivo","Subjunctive","Pluscuamperfecto","Past Perfect","I had produced","hubiera producido","hubieras producido","hubiera producido","hubiéramos producido","hubierais producido","hubieran producido","produciendo","producing","producido","produced"]
["proponer","to propose","Imperativo Afirmativo","Imperative Affirmative","Presente","Present","Propose! Don't propose!",null,"propón","proponed",null,"proponga","propongan","proponiendo","proposing","propuesto","proposed"]
["proponer","to propose","Imperativo Negativo","Imperative Negative","Presente","Present","Propose! Don't propose!",null,"no propongas","no propongáis",null,"no proponga","no propongan","proponiendo","proposing","propuesto","proposed"]
["proponer","to propose","Indicativo","Indicative","Presente","Present","I propose, am proposing","propongo","propones","propone","proponemos","proponéis","proponen","proponiendo","proposing","propuesto","proposed"]
["proponer","to propose","Indicativo","Indicative","Futuro","Future","I will propose","propondré","propondrás","propondrá","propondremos","propondréis","propondrán","proponiendo","proposing","propuesto","proposed"]
["proponer","to propose","Indicativo","Indicative","Imperfecto","Imperfect","I was proposing, used to propose, proposed","proponía","proponías","proponía","proponíamos","proponíais","proponían","proponiendo","proposing","propuesto","proposed"]
["proponer","to propose","Indicativo","Indicative","Pretérito","Preterite","I proposed","propuse","propusiste","propuso","propusimos","propusisteis","propusieron","proponiendo","proposing","propuesto","proposed"]
["proponer","to propose","Indicativo","Indicative","Condicional","Conditional","I would propose","propondría","propondrías","propondría","propondríamos","propondríais","propondrían","proponiendo","proposing","propuesto","proposed"]
["proponer","to propose","Indicativo","Indicative","Presente perfecto","Present Perfect","I have proposed","he propuesto","has propuesto","ha propuesto","hemos propuesto","habéis propuesto","han propuesto","proponiendo","proposing","propuesto","proposed"]
["proponer","to propose","Indicativo","Indicative","Futuro perfecto","Future Perfect","I will have proposed","habré propuesto","habrás propuesto","habrá propuesto","habremos propuesto","habréis propuesto","habrán propuesto","proponiendo","proposing","propuesto","proposed"]
["proponer","to propose","Indicativo","Indicative","Pluscuamperfecto","Past Perfect","I had proposed","había propuesto","habías propuesto","había propuesto","habíamos propuesto","habíais propuesto","habían propuesto","proponiendo","proposing","propuesto","proposed"]
["proponer","to propose","Indicativo","Indicative","Pretérito anterior","Preterite (Archaic)","I had proposed","hube propuesto","hubiste propuesto","hubo propuesto","hubimos propuesto","hubisteis propuesto","hubieron propuesto","proponiendo","proposing","propuesto","proposed"]
["proponer","to propose","Indicativo","Indicative","Condicional perfecto","Conditional Perfect","I would have proposed","habría propuesto","habrías propuesto","habría propuesto","habríamos propuesto","habríais propuesto","habrían propuesto","proponiendo","proposing","propuesto","proposed"]
["proponer","to propose","Subjuntivo","Subjunctive","Presente","Present","I propose, am proposing","proponga","propongas","proponga","propongamos","propongáis","propongan","proponiendo","proposing","propuesto","proposed"]
["proponer","to propose","Subjuntivo","Subjunctive","Imperfecto","Imperfect","I proposed, was proposing","propusiera","propusieras","propusiera","propusiéramos","propusierais","propusieran","proponiendo","proposing","propuesto","proposed"]
["proponer","to propose","Subjuntivo","Subjunctive","Futuro","Future","I will propose","propusiere","propusieres","propusiere","propusiéremos","propusiereis","propusieren","proponiendo","proposing","propuesto","proposed"]
["proponer","to propose","Subjuntivo","Subjunctive","Presente perfecto","Present Perfect","I have proposed, proposed","haya propuesto","hayas propuesto","haya propuesto","hayamos propuesto","hayáis propuesto","hayan propuesto","proponiendo","proposing","propuesto","proposed"]
["proponer","to propose","Subjuntivo","Subjunctive","Futuro perfecto","Future Perfect","I will have proposed","hubiere propuesto","hubieres propuesto","hubiere propuesto","hubiéremos propuesto","hubiereis propuesto","hubieren propuesto","proponiendo","proposing","propuesto","proposed"]
["proponer","to propose","Subjuntivo","Subjunctive","Pluscuamperfecto","Past Perfect","I had proposed","hubiera propuesto","hubieras propuesto","hubiera propuesto","hubiéramos propuesto","hubierais propuesto","hubieran propuesto","proponiendo","proposing","propuesto","proposed"]
["provocar","to provoke","Imperativo Afirmativo","Imperative Affirmative","Presente","Present","Provoke! Don't provoke!",null,"provoca","provocad",null,"provoque","provoquen","provocando","provoking","provocado","provoked"]
["provocar","to provoke","Imperativo Negativo","Imperative Negative","Presente","Present","Provoke! Don't provoke!",null,"no provoques","no provoquéis",null,"no provoque","no provoquen","provocando","provoking","provocado","provoked"]
["provocar","to provoke","Indicativo","Indicative","Presente","Present","I provoke, am provoking","provoco","provocas","provoca","provocamos","provocáis","provocan","provocando","provoking","provocado","provoked"]
["provocar","to provoke","Indicativo","Indicative","Futuro","Future","I will provoke","provocaré","provocarás","provocará","provocaremos","provocaréis","provocarán","provocando","provoking","provocado","provoked"]
["provocar","to provoke","Indicativo","Indicative","Imperfecto","Imperfect","I was provoking, used to provoke, provoked","provocaba","provocabas","provocaba","provocábamos","provocabais","provocaban","provocando","provoking","provocado","provoked"]
["provocar","to provoke","Indicativo","Indicative","Pretérito","Preterite","I provoked","provoqué","provocaste","provocó","provocamos","provocasteis","provocaron","provocando","provoking","provocado","provoked"]
["provocar","to provoke","Indicativo","Indicative","Condicional","Conditional","I would provoke","provocaría","provocarías","provocaría","provocaríamos","provocaríais","provocarían","provocando","provoking","provocado","provoked"]
["provocar","to provoke","Indicativo","Indicative","Presente perfecto","Present Perfect","I have provoked","he provocado","has provocado","ha provocado","hemos provocado","habéis provocado","han provocado","provocando","provoking","provocado","provoked"]
["provocar","to provoke","Indicativo","Indicative","Futuro perfecto","Future Perfect","I will have provoked","habré provocado","habrás provocado","habrá provocado","habremos provocado","habréis provocado","habrán provocado","provocando","provoking","provocado","provoked"]
["provocar","to provoke","Indicativo","Indicative","Pluscuamperfecto","Past Perfect","I had provoked","había provocado","habías provocado","había provocado","habíamos provocado","habíais provocado","habían provocado","provocando","provoking","provocado","provoked"]
["provocar","to provoke","Indicativo","Indicative","Pretérito anterior","Preterite (Archaic)","I had provoked","hube provocado","hubiste provocado","hubo provocado","hubimos provocado","hubisteis provocado","hubieron provocado","provocando","provoking","provocado","provoked"]
["provocar","to provoke","Indicativo","Indicative","Condicional perfecto","Conditional Perfect","I would have provoked","habría provocado","habrías provocado","habría provocado","habríamos provocado","habríais provocado","habrían provocado","provocando","provoking","provocado","provoked"]
["provocar","to provoke","Subjuntivo","Subjunctive","Presente","Present","I provoke, am provoking","provoque","provoques","provoque","provoquemos","provoquéis","provoquen","provocando","provoking","provocado","provoked"]
["provocar","to provoke","Subjuntivo","Subjunctive","Imperfecto","Imperfect","I provoked, was provoking","provocara","provocaras","provocara","provocáramos","provocarais","provocaran","provocando","provoking","provocado","provoked"]
["provocar","to provoke","Subjuntivo","Subjunctive","Futuro","Future","I will provoke","provocare","provocares","provocare","provocáremos","provocareis","provocaren","provocando","provoking","provocado","provoked"]
["provocar","to provoke","Subjuntivo","Subjunctive","Presente perfecto","Present Perfect","I have provoked, provoked","haya provocado","hayas provocado","haya provocado","hayamos provocado","hayáis provocado","hayan provocado","provocando","provoking","provocado","provoked"]
["provocar","to provoke","Subjuntivo","Subjunctive","Futuro perfecto","Future Perfect","I will have provoked","hubiere provocado","hubieres provocado","hubiere provocado","hubiéremos provocado","hubiereis provocado","hubieren provocado","provocando","provoking","provocado","provoked"]
["provocar","to provoke","Subjuntivo","Subjunctive","Pluscuamperfecto","Past Perfect","I had provoked","hubiera provocado","hubieras provocado","hubiera provocado","hubiéramos provocado","hubierais provocado","hubieran provocado","provocando","provoking","provocado","provoked"]
["publicar","to publish","Imperativo Afirmativo","Imperative Affirmative","Presente","Present","Publish! Don't publish!",null,"publica","publicad",null,"publique","publiquen","publicando","publishing","publicado","published"]
["publicar","to publish","Imperativo Negativo","Imperative Negative","Presente","Present","Publish! Don't publish!",null,"no publiques","no publiquéis",null,"no publique","no publiquen","publicando","publishing","publicado","published"]
["publicar","to publish","Indicativo","Indicative","Presente","Present","I publish, am publishing","publico","publicas","publica","publicamos","publicáis","publican","publicando","publishing","publicado","published"]
["publicar","to publish","Indicativo","Indicative","Futuro","Future","I will publish","publicaré","publicarás","publicará","publicaremos","publicaréis","publicarán","publicando","publishing","publicado","published"]
["publicar","to publish","Indicativo","Indicative","Imperfecto","Imperfect","I was publishing, used to publish, published","publicaba","publicabas","publicaba","publicábamos","publicabais","publicaban","publicando","publishing","publicado","published"]
["publicar","to publish","Indicativo","Indicative","Pretérito","Preterite","I published","publiqué","publicaste","publicó","publicamos","publicasteis","publicaron","publicando","publishing","publicado","published"]
["publicar","to publish","Indicativo","Indicative","Condicional","Conditional","I would publish","publicaría","publicarías","publicaría","publicaríamos","publicaríais","publicarían","publicando","publishing","publicado","published"]
["publicar","to publish","Indicativo","Indicative","Presente perfecto","Present Perfect","I have published","he publicado","has publicado","ha publicado","hemos publicado","habéis publicado","han publicado","publicando","publishing","publicado","published"]
["publicar","to publish","Indicativo","Indicative","Futuro perfecto","Future Perfect","I will have published","habré publicado","habrás publicado","habrá publicado","habremos publicado","habréis publicado","habrán publicado","publicando","publishing","publicado","published"]
["publicar","to publish","Indicativo","Indicative","Pluscuamperfecto","Past Perfect","I had published","había publicado","habías publicado","había publicado","habíamos publicado","habíais publicado","habían publicado","publicando","publishing","publicado","published"]
["publicar","to publish","Indicativo","Indicative","Pretérito anterior","Preterite (Archaic)","I had published","hube publicado","hubiste publicado","hubo publicado","hubimos publicado","hubisteis publicado","hubieron publicado","publicando","publishing","publicado","published"]
["publicar","to publish","Indicativo","Indicative","Condicional perfecto","Conditional Perfect","I would have published","habría publicado","habrías publicado","habría publicado","habríamos publicado","habríais publicado","habrían publicado","publicando","publishing","publicado","published"]
["publicar","to publish","Subjuntivo","Subjunctive","Presente","Present","I publish, am publishing","publique","publiques","publique","publiquemos","publiquéis","publiquen","publicando","publishing","publicado","published"]
["publicar","to publish","Subjuntivo","Subjunctive","Imperfecto","Imperfect","I published, was publishing","publicara","publicaras","publicara","publicáramos","publicarais","publicaran","publicando","publishing","publicado","published"]
["publicar","to publish","Subjuntivo","Subjunctive","Futuro","Future","I will publish","publicare","publicares","publicare","publicáremos","publicareis","publicaren","publicando","publishing","publicado","published"]
["publicar","to publish","Subjuntivo","Subjunctive","Presente perfecto","Present Perfect","I have published, published","haya publicado","hayas publicado","haya publicado","hayamos publicado","hayáis publicado","hayan publicado","publicando","publishing","publicado","published"]
["publicar","to publish","Subjuntivo","Subjunctive","Futuro perfecto","Future Perfect","I will have published","hubiere publicado","hubieres publicado","hubiere publicado","hubiéremos publicado","hubiereis publicado","hubieren publicado","publicando","publishing","publicado","published"]
["publicar","to publish","Subjuntivo","Subjunctive","Pluscuamperfecto","Past Perfect","I had published","hubiera publicado","hubieras publicado","hubiera publicado","hubiéramos publicado","hubierais publicado","hubieran publicado","publicando","publishing","publicado","published"]
["quedar","to stay, remain, be left; to be [indicating location]","Imperativo Afirmativo","Imperative Affirmative","Presente","Present","stay! Don't stay!",null,"queda","quedad",null,"quede","queden","quedando","staying","quedado","stayed"]
["quedar","to stay, remain, be left; to be [indicating location]","Imperativo Negativo","Imperative Negative","Presente","Present","stay! Don't stay!",null,"no quedes","no quedéis",null,"no quede","no queden","quedando","staying","quedado","stayed"]
["quedar","to stay, remain, be left; to be [indicating location]","Indicativo","Indicative","Presente","Present","I stay, am staying","quedo","quedas","queda","quedamos","quedáis","quedan","quedando","staying","quedado","stayed"]
["quedar","to stay, remain, be left; to be [indicating location]","Indicativo","Indicative","Futuro","Future","I will stay","quedaré","quedarás","quedará","quedaremos","quedaréis","quedarán","quedando","staying","quedado","stayed"]
["quedar","to stay, remain, be left; to be [indicating location]","Indicativo","Indicative","Imperfecto","Imperfect","I was staying, used to stay, stayed","quedaba","quedabas","quedaba","quedábamos","quedabais","quedaban","quedando","staying","quedado","stayed"]
["quedar","to stay, remain, be left; to be [indicating location]","Indicativo","Indicative","Pretérito","Preterite","I stayed","quedé","quedaste","quedó","quedamos","quedasteis","quedaron","quedando","staying","quedado","stayed"]
["quedar","to stay, remain, be left; to be [indicating location]","Indicativo","Indicative","Condicional","Conditional","I would stay","quedaría","quedarías","quedaría","quedaríamos","quedaríais","quedarían","quedando","staying","quedado","stayed"]
["quedar","to stay, remain, be left; to be [indicating location]","Indicativo","Indicative","Presente perfecto","Present Perfect","I have stayed","he quedado","has quedado","ha quedado","hemos quedado","habéis quedado","han quedado","quedando","staying","quedado","stayed"]
["quedar","to stay, remain, be left; to be [indicating location]","Indicativo","Indicative","Futuro perfecto","Future Perfect","I will have stayed","habré quedado","habrás quedado","habrá quedado","habremos quedado","habréis quedado","habrán quedado","quedando","staying","quedado","stayed"]
["quedar","to stay, remain, be left; to be [indicating location]","Indicativo","Indicative","Pluscuamperfecto","Past Perfect","I had stayed","había quedado","habías quedado","había quedado","habíamos quedado","habíais quedado","habían quedado","quedando","staying","quedado","stayed"]
["quedar","to stay, remain, be left; to be [indicating location]","Indicativo","Indicative","Pretérito anterior","Preterite (Archaic)","I had stayed","hube quedado","hubiste quedado","hubo quedado","hubimos quedado","hubisteis quedado","hubieron quedado","quedando","staying","quedado","stayed"]
["quedar","to stay, remain, be left; to be [indicating location]","Indicativo","Indicative","Condicional perfecto","Conditional Perfect","I would have stayed","habría quedado","habrías quedado","habría quedado","habríamos quedado","habríais quedado","habrían quedado","quedando","staying","quedado","stayed"]
["quedar","to stay, remain, be left; to be [indicating location]","Subjuntivo","Subjunctive","Presente","Present","I stay, am staying","quede","quedes","quede","quedemos","quedéis","queden","quedando","staying","quedado","stayed"]
["quedar","to stay, remain, be left; to be [indicating location]","Subjuntivo","Subjunctive","Imperfecto","Imperfect","I stayed, was staying","quedara","quedaras","quedara","quedáramos","quedarais","quedaran","quedando","staying","quedado","stayed"]
["quedar","to stay, remain, be left; to be [indicating location]","Subjuntivo","Subjunctive","Futuro","Future","I will stay","quedare","quedares","quedare","quedáremos","quedareis","quedaren","quedando","staying","quedado","stayed"]
["quedar","to stay, remain, be left; to be [indicating location]","Subjuntivo","Subjunctive","Presente perfecto","Present Perfect","I have stayed, stayed","haya quedado","hayas quedado","haya quedado","hayamos quedado","hayáis quedado","hayan quedado","quedando","staying","quedado","stayed"]
["quedar","to stay, remain, be left; to be [indicating location]","Subjuntivo","Subjunctive","Futuro perfecto","Future Perfect","I will have stayed","hubiere quedado","hubieres quedado","hubiere quedado","hubiéremos quedado","hubiereis quedado","hubieren quedado","quedando","staying","quedado","stayed"]
["quedar","to stay, remain, be left; to be [indicating location]","Subjuntivo","Subjunctive","Pluscuamperfecto","Past Perfect","I had stayed","hubiera quedado","hubieras quedado","hubiera quedado","hubiéramos quedado","hubierais quedado","hubieran quedado","quedando","staying","quedado","stayed"]
["querer","to want, love","Imperativo Afirmativo","Imperative Affirmative","Presente","Present","Want! Don't want!",null,"quiere","quered",null,"quiera","quieran","queriendo","wanting","querido","wanted"]
["querer","to want, love","Imperativo Negativo","Imperative Negative","Presente","Present","Want! Don't want!",null,"no quieras","no queráis",null,"no quiera","no quieran","queriendo","wanting","querido","wanted"]
["querer","to want, love","Indicativo","Indicative","Futuro","Future","I will want","querré","querrás","querrá","querremos","querréis","querrán","queriendo","wanting","querido","wanted"]
["querer","to want, love","Indicativo","Indicative","Presente","Present","I want, am wanting","quiero","quieres","quiere","queremos","queréis","quieren","queriendo","wanting","querido","wanted"]
["querer","to want, love","Indicativo","Indicative","Imperfecto","Imperfect","I was wanting, used to want, wanted","quería","querías","quería","queríamos","queríais","querían","queriendo","wanting","querido","wanted"]
["querer","to want, love","Indicativo","Indicative","Pretérito","Preterite","I wanted","quise","quisiste","quiso","quisimos","quisisteis","quisieron","queriendo","wanting","querido","wanted"]
["querer","to want, love","Indicativo","Indicative","Condicional","Conditional","I would want","querría","querrías","querría","querríamos","querríais","querrían","queriendo","wanting","querido","wanted"]
["querer","to want, love","Indicativo","Indicative","Presente perfecto","Present Perfect","I have wanted","he querido","has querido","ha querido","hemos querido","habéis querido","han querido","queriendo","wanting","querido","wanted"]
["querer","to want, love","Indicativo","Indicative","Futuro perfecto","Future Perfect","I will have wanted","habré querido","habrás querido","habrá querido","habremos querido","habréis querido","habrán querido","queriendo","wanting","querido","wanted"]
["querer","to want, love","Indicativo","Indicative","Pluscuamperfecto","Past Perfect","I had wanted","había querido","habías querido","había querido","habíamos querido","habíais querido","habían querido","queriendo","wanting","querido","wanted"]
["querer","to want, love","Indicativo","Indicative","Pretérito anterior","Preterite (Archaic)","I had wanted","hube querido","hubiste querido","hubo querido","hubimos querido","hubisteis querido","hubieron querido","queriendo","wanting","querido","wanted"]
["querer","to want, love","Indicativo","Indicative","Condicional perfecto","Conditional Perfect","I would have wanted","habría querido","habrías querido","habría querido","habríamos querido","habríais querido","habrían querido","queriendo","wanting","querido","wanted"]
["querer","to want, love","Subjuntivo","Subjunctive","Presente","Present","I want, am wanting","quiera","quieras","quiera","queramos","queráis","quieran","queriendo","wanting","querido","wanted"]
["querer","to want, love","Subjuntivo","Subjunctive","Imperfecto","Imperfect","I wanted, was wanting","quisiera","quisieras","quisiera","quisiéramos","quisierais","quisieran","queriendo","wanting","querido","wanted"]
["querer","to want, love","Subjuntivo","Subjunctive","Futuro","Future","I will want","quisiere","quisieres","quisiere","quisiéremos","quisiereis","quisieren","queriendo","wanting","querido","wanted"]
["querer","to want, love","Subjuntivo","Subjunctive","Presente perfecto","Present Perfect","I have wanted, wanted","haya querido","hayas querido","haya querido","hayamos querido","hayáis querido","hayan querido","queriendo","wanting","querido","wanted"]
["querer","to want, love","Subjuntivo","Subjunctive","Futuro perfecto","Future Perfect","I will have wanted","hubiere querido","hubieres querido","hubiere querido","hubiéremos querido","hubiereis querido","hubieren querido","queriendo","wanting","querido","wanted"]
["querer","to want, love","Subjuntivo","Subjunctive","Pluscuamperfecto","Past Perfect","I had wanted","hubiera querido","hubieras querido","hubiera querido","hubiéramos querido","hubierais querido","hubieran querido","queriendo","wanting","querido","wanted"]
["realizar","to achieve, attain, accomplish, realize","Imperativo Afirmativo","Imperative Affirmative","Presente","Present","Achieve! Don't achieve!",null,"realiza","realizad",null,"realice","realicen","realizando","achieving","realizado","achieved"]
["realizar","to achieve, attain, accomplish, realize","Imperativo Negativo","Imperative Negative","Presente","Present","Achieve! Don't achieve!",null,"no realices","no realicéis",null,"no realice","no realicen","realizando","achieving","realizado","achieved"]
["realizar","to achieve, attain, accomplish, realize","Indicativo","Indicative","Presente","Present","I achieve, am achieving","realizo","realizas","realiza","realizamos","realizáis","realizan","realizando","achieving","realizado","achieved"]
["realizar","to achieve, attain, accomplish, realize","Indicativo","Indicative","Futuro","Future","I will achieve","realizaré","realizarás","realizará","realizaremos","realizaréis","realizarán","realizando","achieving","realizado","achieved"]
["realizar","to achieve, attain, accomplish, realize","Indicativo","Indicative","Imperfecto","Imperfect","I was achieving, used to achieve, achieved","realizaba","realizabas","realizaba","realizábamos","realizabais","realizaban","realizando","achieving","realizado","achieved"]
["realizar","to achieve, attain, accomplish, realize","Indicativo","Indicative","Pretérito","Preterite","I achieved","realicé","realizaste","realizó","realizamos","realizasteis","realizaron","realizando","achieving","realizado","achieved"]
["realizar","to achieve, attain, accomplish, realize","Indicativo","Indicative","Condicional","Conditional","I would achieve","realizaría","realizarías","realizaría","realizaríamos","realizaríais","realizarían","realizando","achieving","realizado","achieved"]
["realizar","to achieve, attain, accomplish, realize","Indicativo","Indicative","Presente perfecto","Present Perfect","I have achieved","he realizado","has realizado","ha realizado","hemos realizado","habéis realizado","han realizado","realizando","achieving","realizado","achieved"]
["realizar","to achieve, attain, accomplish, realize","Indicativo","Indicative","Futuro perfecto","Future Perfect","I will have achieved","habré realizado","habrás realizado","habrá realizado","habremos realizado","habréis realizado","habrán realizado","realizando","achieving","realizado","achieved"]
["realizar","to achieve, attain, accomplish, realize","Indicativo","Indicative","Pluscuamperfecto","Past Perfect","I had achieved","había realizado","habías realizado","había realizado","habíamos realizado","habíais realizado","habían realizado","realizando","achieving","realizado","achieved"]
["realizar","to achieve, attain, accomplish, realize","Indicativo","Indicative","Pretérito anterior","Preterite (Archaic)","I had achieved","hube realizado","hubiste realizado","hubo realizado","hubimos realizado","hubisteis realizado","hubieron realizado","realizando","achieving","realizado","achieved"]
["realizar","to achieve, attain, accomplish, realize","Indicativo","Indicative","Condicional perfecto","Conditional Perfect","I would have achieved","habría realizado","habrías realizado","habría realizado","habríamos realizado","habríais realizado","habrían realizado","realizando","achieving","realizado","achieved"]
["realizar","to achieve, attain, accomplish, realize","Subjuntivo","Subjunctive","Presente","Present","I achieve, am achieving","realice","realices","realice","realicemos","realicéis","realicen","realizando","achieving","realizado","achieved"]
["realizar","to achieve, attain, accomplish, realize","Subjuntivo","Subjunctive","Imperfecto","Imperfect","I achieved, was achieving","realizara","realizaras","realizara","realizáramos","realizarais","realizaran","realizando","achieving","realizado","achieved"]
["realizar","to achieve, attain, accomplish, realize","Subjuntivo","Subjunctive","Futuro","Future","I will achieve","realizare","realizares","realizare","realizáremos","realizareis","realizaren","realizando","achieving","realizado","achieved"]
["realizar","to achieve, attain, accomplish, realize","Subjuntivo","Subjunctive","Presente perfecto","Present Perfect","I have achieved, achieved","haya realizado","hayas realizado","haya realizado","hayamos realizado","hayáis realizado","hayan realizado","realizando","achieving","realizado","achieved"]
["realizar","to achieve, attain, accomplish, realize","Subjuntivo","Subjunctive","Futuro perfecto","Future Perfect","I will have achieved","hubiere realizado","hubieres realizado","hubiere realizado","hubiéremos realizado","hubiereis realizado","hubieren realizado","realizando","achieving","realizado","achieved"]
["realizar","to achieve, attain, accomplish, realize","Subjuntivo","Subjunctive","Pluscuamperfecto","Past Perfect","I had achieved","hubiera realizado","hubieras realizado","hubiera realizado","hubiéramos realizado","hubierais realizado","hubieran realizado","realizando","achieving","realizado","achieved"]
["recibir","to receive; to welcome, greet","Imperativo Afirmativo","Imperative Affirmative","Presente","Present","Receive! Don't receive!",null,"recibe","recibid",null,"reciba","reciban","recibiendo","receiving","recibido","received"]
["recibir","to receive; to welcome, greet","Imperativo Negativo","Imperative Negative","Presente","Present","Receive! Don't receive!",null,"no recibas","no recibáis",null,"no reciba","no reciban","recibiendo","receiving","recibido","received"]
["recibir","to receive; to welcome, greet","Indicativo","Indicative","Presente","Present","I receive, am receiving","recibo","recibes","recibe","recibimos","recibís","reciben","recibiendo","receiving","recibido","received"]
["recibir","to receive; to welcome, greet","Indicativo","Indicative","Futuro","Future","I will receive","recibiré","recibirás","recibirá","recibiremos","recibiréis","recibirán","recibiendo","receiving","recibido","received"]
["recibir","to receive; to welcome, greet","Indicativo","Indicative","Imperfecto","Imperfect","I was receiving, used to receive, received","recibía","recibías","recibía","recibíamos","recibíais","recibían","recibiendo","receiving","recibido","received"]
["recibir","to receive; to welcome, greet","Indicativo","Indicative","Pretérito","Preterite","I received","recibí","recibiste","recibió","recibimos","recibisteis","recibieron","recibiendo","receiving","recibido","received"]
["recibir","to receive; to welcome, greet","Indicativo","Indicative","Condicional","Conditional","I would receive","recibiría","recibirías","recibiría","recibiríamos","recibiríais","recibirían","recibiendo","receiving","recibido","received"]
["recibir","to receive; to welcome, greet","Indicativo","Indicative","Presente perfecto","Present Perfect","I have received","he recibido","has recibido","ha recibido","hemos recibido","habéis recibido","han recibido","recibiendo","receiving","recibido","received"]
["recibir","to receive; to welcome, greet","Indicativo","Indicative","Futuro perfecto","Future Perfect","I will have received","habré recibido","habrás recibido","habrá recibido","habremos recibido","habréis recibido","habrán recibido","recibiendo","receiving","recibido","received"]
["recibir","to receive; to welcome, greet","Indicativo","Indicative","Pluscuamperfecto","Past Perfect","I had received","había recibido","habías recibido","había recibido","habíamos recibido","habíais recibido","habían recibido","recibiendo","receiving","recibido","received"]
["recibir","to receive; to welcome, greet","Indicativo","Indicative","Pretérito anterior","Preterite (Archaic)","I had received","hube recibido","hubiste recibido","hubo recibido","hubimos recibido","hubisteis recibido","hubieron recibido","recibiendo","receiving","recibido","received"]
["recibir","to receive; to welcome, greet","Indicativo","Indicative","Condicional perfecto","Conditional Perfect","I would have received","habría recibido","habrías recibido","habría recibido","habríamos recibido","habríais recibido","habrían recibido","recibiendo","receiving","recibido","received"]
["recibir","to receive; to welcome, greet","Subjuntivo","Subjunctive","Presente","Present","I receive, am receiving","reciba","recibas","reciba","recibamos","recibáis","reciban","recibiendo","receiving","recibido","received"]
["recibir","to receive; to welcome, greet","Subjuntivo","Subjunctive","Imperfecto","Imperfect","I received, was receiving","recibiera","recibieras","recibiera","recibiéramos","recibierais","recibieran","recibiendo","receiving","recibido","received"]
["recibir","to receive; to welcome, greet","Subjuntivo","Subjunctive","Futuro","Future","I will receive","recibiere","recibieres","recibiere","recibiéremos","recibiereis","recibieren","recibiendo","receiving","recibido","received"]
["recibir","to receive; to welcome, greet","Subjuntivo","Subjunctive","Presente perfecto","Present Perfect","I have received, received","haya recibido","hayas recibido","haya recibido","hayamos recibido","hayáis recibido","hayan recibido","recibiendo","receiving","recibido","received"]
["recibir","to receive; to welcome, greet","Subjuntivo","Subjunctive","Futuro perfecto","Future Perfect","I will have received","hubiere recibido","hubieres recibido","hubiere recibido","hubiéremos recibido","hubiereis recibido","hubieren recibido","recibiendo","receiving","recibido","received"]
["recibir","to receive; to welcome, greet","Subjuntivo","Subjunctive","Pluscuamperfecto","Past Perfect","I had received","hubiera recibido","hubieras recibido","hubiera recibido","hubiéramos recibido","hubierais recibido","hubieran recibido","recibiendo","receiving","recibido","received"]
["recoger","to pick up","Imperativo Afirmativo","Imperative Affirmative","Presente","Present","Pick up! Don't pick up!",null,"recoge","recoged",null,"recoja","recojan","recogiendo","picking up","recogido","picked up"]
["recoger","to pick up","Imperativo Negativo","Imperative Negative","Presente","Present","Pick up! Don't pick up!",null,"no recojas","no recojáis",null,"no recoja","no recojan","recogiendo","picking up","recogido","picked up"]
["recoger","to pick up","Indicativo","Indicative","Presente","Present","I pick up, am picking up","recojo","recoges","recoge","recogemos","recogéis","recogen","recogiendo","picking up","recogido","picked up"]
["recoger","to pick up","Indicativo","Indicative","Futuro","Future","I will pick up","recogeré","recogerás","recogerá","recogeremos","recogeréis","recogerán","recogiendo","picking up","recogido","picked up"]
["recoger","to pick up","Indicativo","Indicative","Imperfecto","Imperfect","I was picking up, used to pick up, picked up","recogía","recogías","recogía","recogíamos","recogíais","recogían","recogiendo","picking up","recogido","picked up"]
["recoger","to pick up","Indicativo","Indicative","Pretérito","Preterite","I picked up","recogí","recogiste","recogió","recogimos","recogisteis","recogieron","recogiendo","picking up","recogido","picked up"]
["recoger","to pick up","Indicativo","Indicative","Condicional","Conditional","I would pick up","recogería","recogerías","recogería","recogeríamos","recogeríais","recogerían","recogiendo","picking up","recogido","picked up"]
["recoger","to pick up","Indicativo","Indicative","Presente perfecto","Present Perfect","I have picked up","he recogido","has recogido","ha recogido","hemos recogido","habéis recogido","han recogido","recogiendo","picking up","recogido","picked up"]
["recoger","to pick up","Indicativo","Indicative","Futuro perfecto","Future Perfect","I will have picked up","habré recogido","habrás recogido","habrá recogido","habremos recogido","habréis recogido","habrán recogido","recogiendo","picking up","recogido","picked up"]
["recoger","to pick up","Indicativo","Indicative","Pluscuamperfecto","Past Perfect","I had picked up","había recogido","habías recogido","había recogido","habíamos recogido","habíais recogido","habían recogido","recogiendo","picking up","recogido","picked up"]
["recoger","to pick up","Indicativo","Indicative","Pretérito anterior","Preterite (Archaic)","I had picked up","hube recogido","hubiste recogido","hubo recogido","hubimos recogido","hubisteis recogido","hubieron recogido","recogiendo","picking up","recogido","picked up"]
["recoger","to pick up","Indicativo","Indicative","Condicional perfecto","Conditional Perfect","I would have picked up","habría recogido","habrías recogido","habría recogido","habríamos recogido","habríais recogido","habrían recogido","recogiendo","picking up","recogido","picked up"]
["recoger","to pick up","Subjuntivo","Subjunctive","Presente","Present","I pick up, am picking up","recoja","recojas","recoja","recojamos","recojáis","recojan","recogiendo","picking up","recogido","picked up"]
["recoger","to pick up","Subjuntivo","Subjunctive","Imperfecto","Imperfect","I picked up, was picking up","recogiera","recogieras","recogiera","recogiéramos","recogierais","recogieran","recogiendo","picking up","recogido","picked up"]
["recoger","to pick up","Subjuntivo","Subjunctive","Futuro","Future","I will pick up","recogiere","recogieres","recogiere","recogiéremos","recogiereis","recogieren","recogiendo","picking up","recogido","picked up"]
["recoger","to pick up","Subjuntivo","Subjunctive","Presente perfecto","Present Perfect","I have picked up, picked up","haya recogido","hayas recogido","haya recogido","hayamos recogido","hayáis recogido","hayan recogido","recogiendo","picking up","recogido","picked up"]
["recoger","to pick up","Subjuntivo","Subjunctive","Futuro perfecto","Future Perfect","I will have picked up","hubiere recogido","hubieres recogido","hubiere recogido","hubiéremos recogido","hubiereis recogido","hubieren recogido","recogiendo","picking up","recogido","picked up"]
["recoger","to pick up","Subjuntivo","Subjunctive","Pluscuamperfecto","Past Perfect","I had picked up","hubiera recogido","hubieras recogido","hubiera recogido","hubiéramos recogido","hubierais recogido","hubieran recogido","recogiendo","picking up","recogido","picked up"]
["reconocer","to recognize","Imperativo Afirmativo","Imperative Affirmative","Presente","Present","Recognize! Don't recognize!",null,"reconoce","reconoced",null,"reconozca","reconozcan","reconociendo","recognizing","reconocido","recognized"]
["reconocer","to recognize","Imperativo Negativo","Imperative Negative","Presente","Present","Recognize! Don't recognize!",null,"no reconozcas","no reconozcáis",null,"no reconozca","no reconozcan","reconociendo","recognizing","reconocido","recognized"]
["reconocer","to recognize","Indicativo","Indicative","Presente","Present","I recognize, am recognizing","reconozco","reconoces","reconoce","reconocemos","reconocéis","reconocen","reconociendo","recognizing","reconocido","recognized"]
["reconocer","to recognize","Indicativo","Indicative","Futuro","Future","I will recognize","reconoceré","reconocerás","reconocerá","reconoceremos","reconoceréis","reconocerán","reconociendo","recognizing","reconocido","recognized"]
["reconocer","to recognize","Indicativo","Indicative","Imperfecto","Imperfect","I was recognizing, used to recognize, recognized","reconocía","reconocías","reconocía","reconocíamos","reconocíais","reconocían","reconociendo","recognizing","reconocido","recognized"]
["reconocer","to recognize","Indicativo","Indicative","Pretérito","Preterite","I recognized","reconocí","reconociste","reconoció","reconocimos","reconocisteis","reconocieron","reconociendo","recognizing","reconocido","recognized"]
["reconocer","to recognize","Indicativo","Indicative","Condicional","Conditional","I would recognize","reconocería","reconocerías","reconocería","reconoceríamos","reconoceríais","reconocerían","reconociendo","recognizing","reconocido","recognized"]
["reconocer","to recognize","Indicativo","Indicative","Presente perfecto","Present Perfect","I have recognized","he reconocido","has reconocido","ha reconocido","hemos reconocido","habéis reconocido","han reconocido","reconociendo","recognizing","reconocido","recognized"]
["reconocer","to recognize","Indicativo","Indicative","Futuro perfecto","Future Perfect","I will have recognized","habré reconocido","habrás reconocido","habrá reconocido","habremos reconocido","habréis reconocido","habrán reconocido","reconociendo","recognizing","reconocido","recognized"]
["reconocer","to recognize","Indicativo","Indicative","Pluscuamperfecto","Past Perfect","I had recognized","había reconocido","habías reconocido","había reconocido","habíamos reconocido","habíais reconocido","habían reconocido","reconociendo","recognizing","reconocido","recognized"]
["reconocer","to recognize","Indicativo","Indicative","Pretérito anterior","Preterite (Archaic)","I had recognized","hube reconocido","hubiste reconocido","hubo reconocido","hubimos reconocido","hubisteis reconocido","hubieron reconocido","reconociendo","recognizing","reconocido","recognized"]
["reconocer","to recognize","Indicativo","Indicative","Condicional perfecto","Conditional Perfect","I would have recognized","habría reconocido","habrías reconocido","habría reconocido","habríamos reconocido","habríais reconocido","habrían reconocido","reconociendo","recognizing","reconocido","recognized"]
["reconocer","to recognize","Subjuntivo","Subjunctive","Presente","Present","I recognize, am recognizing","reconozca","reconozcas","reconozca","reconozcamos","reconozcáis","reconozcan","reconociendo","recognizing","reconocido","recognized"]
["reconocer","to recognize","Subjuntivo","Subjunctive","Imperfecto","Imperfect","I recognized, was recognizing","reconociera","reconocieras","reconociera","reconociéramos","reconocierais","reconocieran","reconociendo","recognizing","reconocido","recognized"]
["reconocer","to recognize","Subjuntivo","Subjunctive","Futuro","Future","I will recognize","reconociere","reconocieres","reconociere","reconociéremos","reconociereis","reconocieren","reconociendo","recognizing","reconocido","recognized"]
["reconocer","to recognize","Subjuntivo","Subjunctive","Presente perfecto","Present Perfect","I have recognized, recognized","haya reconocido","hayas reconocido","haya reconocido","hayamos reconocido","hayáis reconocido","hayan reconocido","reconociendo","recognizing","reconocido","recognized"]
["reconocer","to recognize","Subjuntivo","Subjunctive","Futuro perfecto","Future Perfect","I will have recognized","hubiere reconocido","hubieres reconocido","hubiere reconocido","hubiéremos reconocido","hubiereis reconocido","hubieren reconocido","reconociendo","recognizing","reconocido","recognized"]
["reconocer","to recognize","Subjuntivo","Subjunctive","Pluscuamperfecto","Past Perfect","I had recognized","hubiera reconocido","hubieras reconocido","hubiera reconocido","hubiéramos reconocido","hubierais reconocido","hubieran reconocido","reconociendo","recognizing","reconocido","recognized"]
["recordar","to remember, remind","Imperativo Afirmativo","Imperative Affirmative","Presente","Present","Remember! Don't remember!",null,"recuerda","recordad",null,"recuerde","recuerden","recordando","remembering","recordado","remembered"]
["recordar","to remember, remind","Imperativo Negativo","Imperative Negative","Presente","Present","Remember! Don't remember!",null,"no recuerdes","no recordéis",null,"no recuerde","no recuerden","recordando","remembering","recordado","remembered"]
["recordar","to remember, remind","Indicativo","Indicative","Presente","Present","I remember, am remembering","recuerdo","recuerdas","recuerda","recordamos","recordáis","recuerdan","recordando","remembering","recordado","remembered"]
["recordar","to remember, remind","Indicativo","Indicative","Futuro","Future","I will remember","recordaré","recordarás","recordará","recordaremos","recordaréis","recordarán","recordando","remembering","recordado","remembered"]
["recordar","to remember, remind","Indicativo","Indicative","Imperfecto","Imperfect","I was remembering, used to remember, remembered","recordaba","recordabas","recordaba","recordábamos","recordabais","recordaban","recordando","remembering","recordado","remembered"]
["recordar","to remember, remind","Indicativo","Indicative","Pretérito","Preterite","I remembered","recordé","recordaste","recordó","recordamos","recordasteis","recordaron","recordando","remembering","recordado","remembered"]
["recordar","to remember, remind","Indicativo","Indicative","Condicional","Conditional","I would remember","recordaría","recordarías","recordaría","recordaríamos","recordaríais","recordarían","recordando","remembering","recordado","remembered"]
["recordar","to remember, remind","Indicativo","Indicative","Presente perfecto","Present Perfect","I have remembered","he recordado","has recordado","ha recordado","hemos recordado","habéis recordado","han recordado","recordando","remembering","recordado","remembered"]
["recordar","to remember, remind","Indicativo","Indicative","Futuro perfecto","Future Perfect","I will have remembered","habré recordado","habrás recordado","habrá recordado","habremos recordado","habréis recordado","habrán recordado","recordando","remembering","recordado","remembered"]
["recordar","to remember, remind","Indicativo","Indicative","Pluscuamperfecto","Past Perfect","I had remembered","había recordado","habías recordado","había recordado","habíamos recordado","habíais recordado","habían recordado","recordando","remembering","recordado","remembered"]
["recordar","to remember, remind","Indicativo","Indicative","Pretérito anterior","Preterite (Archaic)","I had remembered","hube recordado","hubiste recordado","hubo recordado","hubimos recordado","hubisteis recordado","hubieron recordado","recordando","remembering","recordado","remembered"]
["recordar","to remember, remind","Indicativo","Indicative","Condicional perfecto","Conditional Perfect","I would have remembered","habría recordado","habrías recordado","habría recordado","habríamos recordado","habríais recordado","habrían recordado","recordando","remembering","recordado","remembered"]
["recordar","to remember, remind","Subjuntivo","Subjunctive","Presente","Present","I remember, am remembering","recuerde","recuerdes","recuerde","recordemos","recordéis","recuerden","recordando","remembering","recordado","remembered"]
["recordar","to remember, remind","Subjuntivo","Subjunctive","Imperfecto","Imperfect","I remembered, was remembering","recordara","recordaras","recordara","recordáramos","recordarais","recordaran","recordando","remembering","recordado","remembered"]
["recordar","to remember, remind","Subjuntivo","Subjunctive","Futuro","Future","I will remember","recordare","recordares","recordare","recordáremos","recordareis","recordaren","recordando","remembering","recordado","remembered"]
["recordar","to remember, remind","Subjuntivo","Subjunctive","Presente perfecto","Present Perfect","I have remembered, remembered","haya recordado","hayas recordado","haya recordado","hayamos recordado","hayáis recordado","hayan recordado","recordando","remembering","recordado","remembered"]
["recordar","to remember, remind","Subjuntivo","Subjunctive","Futuro perfecto","Future Perfect","I will have remembered","hubiere recordado","hubieres recordado","hubiere recordado","hubiéremos recordado","hubiereis recordado","hubieren recordado","recordando","remembering","recordado","remembered"]
["recordar","to remember, remind","Subjuntivo","Subjunctive","Pluscuamperfecto","Past Perfect","I had remembered","hubiera recordado","hubieras recordado","hubiera recordado","hubiéramos recordado","hubierais recordado","hubieran recordado","recordando","remembering","recordado","remembered"]
["regresar","to return, go back","Imperativo Afirmativo","Imperative Affirmative","Presente","Present","Return! Don't return!",null,"regresa","regresad",null,"regrese","regresen","regresando","returning","regresado","returned"]
["regresar","to return, go back","Imperativo Negativo","Imperative Negative","Presente","Present","Return! Don't return!",null,"no regreses","no regreséis",null,"no regrese","no regresen","regresando","returning","regresado","returned"]
["regresar","to return, go back","Indicativo","Indicative","Presente","Present","I return, am returning","regreso","regresas","regresa","regresamos","regresáis","regresan","regresando","returning","regresado","returned"]
["regresar","to return, go back","Indicativo","Indicative","Futuro","Future","I will return","regresaré","regresarás","regresará","regresaremos","regresaréis","regresarán","regresando","returning","regresado","returned"]
["regresar","to return, go back","Indicativo","Indicative","Imperfecto","Imperfect","I was returning, used to return, returned","regresaba","regresabas","regresaba","regresábamos","regresabais","regresaban","regresando","returning","regresado","returned"]
["regresar","to return, go back","Indicativo","Indicative","Pretérito","Preterite","I returned","regresé","regresaste","regresó","regresamos","regresasteis","regresaron","regresando","returning","regresado","returned"]
["regresar","to return, go back","Indicativo","Indicative","Condicional","Conditional","I would return","regresaría","regresarías","regresaría","regresaríamos","regresaríais","regresarían","regresando","returning","regresado","returned"]
["regresar","to return, go back","Indicativo","Indicative","Presente perfecto","Present Perfect","I have returned","he regresado","has regresado","ha regresado","hemos regresado","habéis regresado","han regresado","regresando","returning","regresado","returned"]
["regresar","to return, go back","Indicativo","Indicative","Futuro perfecto","Future Perfect","I will have returned","habré regresado","habrás regresado","habrá regresado","habremos regresado","habréis regresado","habrán regresado","regresando","returning","regresado","returned"]
["regresar","to return, go back","Indicativo","Indicative","Pluscuamperfecto","Past Perfect","I had returned","había regresado","habías regresado","había regresado","habíamos regresado","habíais regresado","habían regresado","regresando","returning","regresado","returned"]
["regresar","to return, go back","Indicativo","Indicative","Pretérito anterior","Preterite (Archaic)","I had returned","hube regresado","hubiste regresado","hubo regresado","hubimos regresado","hubisteis regresado","hubieron regresado","regresando","returning","regresado","returned"]
["regresar","to return, go back","Indicativo","Indicative","Condicional perfecto","Conditional Perfect","I would have returned","habría regresado","habrías regresado","habría regresado","habríamos regresado","habríais regresado","habrían regresado","regresando","returning","regresado","returned"]
["regresar","to return, go back","Subjuntivo","Subjunctive","Presente","Present","I return, am returning","regrese","regreses","regrese","regresemos","regreséis","regresen","regresando","returning","regresado","returned"]
["regresar","to return, go back","Subjuntivo","Subjunctive","Imperfecto","Imperfect","I returned, was returning","regresara","regresaras","regresara","regresáramos","regresarais","regresaran","regresando","returning","regresado","returned"]
["regresar","to return, go back","Subjuntivo","Subjunctive","Futuro","Future","I will return","regresare","regresares","regresare","regresáremos","regresareis","regresaren","regresando","returning","regresado","returned"]
["regresar","to return, go back","Subjuntivo","Subjunctive","Presente perfecto","Present Perfect","I have returned, returned","haya regresado","hayas regresado","haya regresado","hayamos regresado","hayáis regresado","hayan regresado","regresando","returning","regresado","returned"]
["regresar","to return, go back","Subjuntivo","Subjunctive","Futuro perfecto","Future Perfect","I will have returned","hubiere regresado","hubieres regresado","hubiere regresado","hubiéremos regresado","hubiereis regresado","hubieren regresado","regresando","returning","regresado","returned"]
["regresar","to return, go back","Subjuntivo","Subjunctive","Pluscuamperfecto","Past Perfect","I had returned","hubiera regresado","hubieras regresado","hubiera regresado","hubiéramos regresado","hubierais regresado","hubieran regresado","regresando","returning","regresado","returned"]
["repetir","to repeat","Imperativo Afirmativo","Imperative Affirmative","Presente","Present","Repeat! Don't repeat!",null,"repite","repetid",null,"repita","repitan","repitiendo","repeating","repetido","repeated"]
["repetir","to repeat","Imperativo Negativo","Imperative Negative","Presente","Present","Repeat! Don't repeat!",null,"no repitas","no repitáis",null,"no repita","no repitan","repitiendo","repeating","repetido","repeated"]
["repetir","to repeat","Indicativo","Indicative","Presente","Present","I repeat, am repeating","repito","repites","repite","repetimos","repetís","repiten","repitiendo","repeating","repetido","repeated"]
["repetir","to repeat","Indicativo","Indicative","Futuro","Future","I will repeat","repetiré","repetirás","repetirá","repetiremos","repetiréis","repetirán","repitiendo","repeating","repetido","repeated"]
["repetir","to repeat","Indicativo","Indicative","Imperfecto","Imperfect","I was repeating, used to repeat, repeated","repetía","repetías","repetía","repetíamos","repetíais","repetían","repitiendo","repeating","repetido","repeated"]
["repetir","to repeat","Indicativo","Indicative","Pretérito","Preterite","I repeated","repetí","repetiste","repitió","repetimos","repetisteis","repitieron","repitiendo","repeating","repetido","repeated"]
["repetir","to repeat","Indicativo","Indicative","Condicional","Conditional","I would repeat","repetiría","repetirías","repetiría","repetiríamos","repetiríais","repetirían","repitiendo","repeating","repetido","repeated"]
["repetir","to repeat","Indicativo","Indicative","Presente perfecto","Present Perfect","I have repeated","he repetido","has repetido","ha repetido","hemos repetido","habéis repetido","han repetido","repitiendo","repeating","repetido","repeated"]
["repetir","to repeat","Indicativo","Indicative","Futuro perfecto","Future Perfect","I will have repeated","habré repetido","habrás repetido","habrá repetido","habremos repetido","habréis repetido","habrán repetido","repitiendo","repeating","repetido","repeated"]
["repetir","to repeat","Indicativo","Indicative","Pluscuamperfecto","Past Perfect","I had repeated","había repetido","habías repetido","había repetido","habíamos repetido","habíais repetido","habían repetido","repitiendo","repeating","repetido","repeated"]
["repetir","to repeat","Indicativo","Indicative","Pretérito anterior","Preterite (Archaic)","I had repeated","hube repetido","hubiste repetido","hubo repetido","hubimos repetido","hubisteis repetido","hubieron repetido","repitiendo","repeating","repetido","repeated"]
["repetir","to repeat","Indicativo","Indicative","Condicional perfecto","Conditional Perfect","I would have repeated","habría repetido","habrías repetido","habría repetido","habríamos repetido","habríais repetido","habrían repetido","repitiendo","repeating","repetido","repeated"]
["repetir","to repeat","Subjuntivo","Subjunctive","Presente","Present","I repeat, am repeating","repita","repitas","repita","repitamos","repitáis","repitan","repitiendo","repeating","repetido","repeated"]
["repetir","to repeat","Subjuntivo","Subjunctive","Imperfecto","Imperfect","I repeated, was repeating","repitiera","repitieras","repitiera","repitiéramos","repitierais","repitieran","repitiendo","repeating","repetido","repeated"]
["repetir","to repeat","Subjuntivo","Subjunctive","Futuro","Future","I will repeat","repitiere","repitieres","repitiere","repitiéremos","repitiereis","repitieren","repitiendo","repeating","repetido","repeated"]
["repetir","to repeat","Subjuntivo","Subjunctive","Presente perfecto","Present Perfect","I have repeated, repeated","haya repetido","hayas repetido","haya repetido","hayamos repetido","hayáis repetido","hayan repetido","repitiendo","repeating","repetido","repeated"]
["repetir","to repeat","Subjuntivo","Subjunctive","Futuro perfecto","Future Perfect","I will have repeated","hubiere repetido","hubieres repetido","hubiere repetido","hubiéremos repetido","hubiereis repetido","hubieren repetido","repitiendo","repeating","repetido","repeated"]
["repetir","to repeat","Subjuntivo","Subjunctive","Pluscuamperfecto","Past Perfect","I had repeated","hubiera repetido","hubieras repetido","hubiera repetido","hubiéramos repetido","hubierais repetido","hubieran repetido","repitiendo","repeating","repetido","repeated"]
["resolver","to solve, resolve","Imperativo Afirmativo","Imperative Affirmative","Presente","Present","Solve! Don't solve!",null,"resuelve","resolved",null,"resuelva","resuelvan","resolviendo","solving","resuelto","solved"]
["resolver","to solve, resolve","Imperativo Negativo","Imperative Negative","Presente","Present","Solve! Don't solve!",null,"no resuelvas","no resolváis",null,"no resuelva","no resuelvan","resolviendo","solving","resuelto","solved"]
["resolver","to solve, resolve","Indicativo","Indicative","Presente","Present","I solve, am solving","resuelvo","resuelves","resuelve","resolvemos","resolvéis","resuelven","resolviendo","solving","resuelto","solved"]
["resolver","to solve, resolve","Indicativo","Indicative","Futuro","Future","I will solve","resolveré","resolverás","resolverá","resolveremos","resolveréis","resolverán","resolviendo","solving","resuelto","solved"]
["resolver","to solve, resolve","Indicativo","Indicative","Imperfecto","Imperfect","I was solving, used to solve, solved","resolvía","resolvías","resolvía","resolvíamos","resolvíais","resolvían","resolviendo","solving","resuelto","solved"]
["resolver","to solve, resolve","Indicativo","Indicative","Pretérito","Preterite","I solved","resolví","resolviste","resolvió","resolvimos","resolvisteis","resolvieron","resolviendo","solving","resuelto","solved"]
["resolver","to solve, resolve","Indicativo","Indicative","Condicional","Conditional","I would solve","resolvería","resolverías","resolvería","resolveríamos","resolveríais","resolverían","resolviendo","solving","resuelto","solved"]
["resolver","to solve, resolve","Indicativo","Indicative","Presente perfecto","Present Perfect","I have solved","he resuelto","has resuelto","ha resuelto","hemos resuelto","habéis resuelto","han resuelto","resolviendo","solving","resuelto","solved"]
["resolver","to solve, resolve","Indicativo","Indicative","Futuro perfecto","Future Perfect","I will have solved","habré resuelto","habrás resuelto","habrá resuelto","habremos resuelto","habréis resuelto","habrán resuelto","resolviendo","solving","resuelto","solved"]
["resolver","to solve, resolve","Indicativo","Indicative","Pluscuamperfecto","Past Perfect","I had solved","había resuelto","habías resuelto","había resuelto","habíamos resuelto","habíais resuelto","habían resuelto","resolviendo","solving","resuelto","solved"]
["resolver","to solve, resolve","Indicativo","Indicative","Pretérito anterior","Preterite (Archaic)","I had solved","hube resuelto","hubiste resuelto","hubo resuelto","hubimos resuelto","hubisteis resuelto","hubieron resuelto","resolviendo","solving","resuelto","solved"]
["resolver","to solve, resolve","Indicativo","Indicative","Condicional perfecto","Conditional Perfect","I would have solved","habría resuelto","habrías resuelto","habría resuelto","habríamos resuelto","habríais resuelto","habrían resuelto","resolviendo","solving","resuelto","solved"]
["resolver","to solve, resolve","Subjuntivo","Subjunctive","Presente","Present","I solve, am solving","resuelva","resuelvas","resuelva","resolvamos","resolváis","resuelvan","resolviendo","solving","resuelto","solved"]
["resolver","to solve, resolve","Subjuntivo","Subjunctive","Imperfecto","Imperfect","I solved, was solving","resolviera","resolvieras","resolviera","resolviéramos","resolvierais","resolvieran","resolviendo","solving","resuelto","solved"]
["resolver","to solve, resolve","Subjuntivo","Subjunctive","Futuro","Future","I will solve","resolviere","resolvieres","resolviere","resolviéremos","resolviereis","resolvieren","resolviendo","solving","resuelto","solved"]
["resolver","to solve, resolve","Subjuntivo","Subjunctive","Presente perfecto","Present Perfect","I have solved, solved","haya resuelto","hayas resuelto","haya resuelto","hayamos resuelto","hayáis resuelto","hayan resuelto","resolviendo","solving","resuelto","solved"]
["resolver","to solve, resolve","Subjuntivo","Subjunctive","Futuro perfecto","Future Perfect","I will have solved","hubiere resuelto","hubieres resuelto","hubiere resuelto","hubiéremos resuelto","hubiereis resuelto","hubieren resuelto","resolviendo","solving","resuelto","solved"]
["resolver","to solve, resolve","Subjuntivo","Subjunctive","Pluscuamperfecto","Past Perfect","I had solved","hubiera resuelto","hubieras resuelto","hubiera resuelto","hubiéramos resuelto","hubierais resuelto","hubieran resuelto","resolviendo","solving","resuelto","solved"]
["responder","to respond, answer, reply to","Imperativo Afirmativo","Imperative Affirmative","Presente","Present","Respond! Don't respond!",null,"responde","responded",null,"responda","respondan","respondiendo","responding","respondido","responded"]
["responder","to respond, answer, reply to","Imperativo Negativo","Imperative Negative","Presente","Present","Respond! Don't respond!",null,"no respondas","no respondáis",null,"no responda","no respondan","respondiendo","responding","respondido","responded"]
["responder","to respond, answer, reply to","Indicativo","Indicative","Presente","Present","I respond, am responding","respondo","respondes","responde","respondemos","respondéis","responden","respondiendo","responding","respondido","responded"]
["responder","to respond, answer, reply to","Indicativo","Indicative","Futuro","Future","I will respond","responderé","responderás","responderá","responderemos","responderéis","responderán","respondiendo","responding","respondido","responded"]
["responder","to respond, answer, reply to","Indicativo","Indicative","Imperfecto","Imperfect","I was responding, used to respond, responded","respondía","respondías","respondía","respondíamos","respondíais","respondían","respondiendo","responding","respondido","responded"]
["responder","to respond, answer, reply to","Indicativo","Indicative","Pretérito","Preterite","I responded","respondí","respondiste","respondió","respondimos","respondisteis","respondieron","respondiendo","responding","respondido","responded"]
["responder","to respond, answer, reply to","Indicativo","Indicative","Condicional","Conditional","I would respond","respondería","responderías","respondería","responderíamos","responderíais","responderían","respondiendo","responding","respondido","responded"]
["responder","to respond, answer, reply to","Indicativo","Indicative","Presente perfecto","Present Perfect","I have responded","he respondido","has respondido","ha respondido","hemos respondido","habéis respondido","han respondido","respondiendo","responding","respondido","responded"]
["responder","to respond, answer, reply to","Indicativo","Indicative","Futuro perfecto","Future Perfect","I will have responded","habré respondido","habrás respondido","habrá respondido","habremos respondido","habréis respondido","habrán respondido","respondiendo","responding","respondido","responded"]
["responder","to respond, answer, reply to","Indicativo","Indicative","Pluscuamperfecto","Past Perfect","I had responded","había respondido","habías respondido","había respondido","habíamos respondido","habíais respondido","habían respondido","respondiendo","responding","respondido","responded"]
["responder","to respond, answer, reply to","Indicativo","Indicative","Pretérito anterior","Preterite (Archaic)","I had responded","hube respondido","hubiste respondido","hubo respondido","hubimos respondido","hubisteis respondido","hubieron respondido","respondiendo","responding","respondido","responded"]
["responder","to respond, answer, reply to","Indicativo","Indicative","Condicional perfecto","Conditional Perfect","I would have responded","habría respondido","habrías respondido","habría respondido","habríamos respondido","habríais respondido","habrían respondido","respondiendo","responding","respondido","responded"]
["responder","to respond, answer, reply to","Subjuntivo","Subjunctive","Presente","Present","I respond, am responding","responda","respondas","responda","respondamos","respondáis","respondan","respondiendo","responding","respondido","responded"]
["responder","to respond, answer, reply to","Subjuntivo","Subjunctive","Imperfecto","Imperfect","I responded, was responding","respondiera","respondieras","respondiera","respondiéramos","respondierais","respondieran","respondiendo","responding","respondido","responded"]
["responder","to respond, answer, reply to","Subjuntivo","Subjunctive","Futuro","Future","I will respond","respondiere","respondieres","respondiere","respondiéremos","respondiereis","respondieren","respondiendo","responding","respondido","responded"]
["responder","to respond, answer, reply to","Subjuntivo","Subjunctive","Presente perfecto","Present Perfect","I have responded, responded","haya respondido","hayas respondido","haya respondido","hayamos respondido","hayáis respondido","hayan respondido","respondiendo","responding","respondido","responded"]
["responder","to respond, answer, reply to","Subjuntivo","Subjunctive","Futuro perfecto","Future Perfect","I will have responded","hubiere respondido","hubieres respondido","hubiere respondido","hubiéremos respondido","hubiereis respondido","hubieren respondido","respondiendo","responding","respondido","responded"]
["responder","to respond, answer, reply to","Subjuntivo","Subjunctive","Pluscuamperfecto","Past Perfect","I had responded","hubiera respondido","hubieras respondido","hubiera respondido","hubiéramos respondido","hubierais respondido","hubieran respondido","respondiendo","responding","respondido","responded"]
["resultar","to turn out (to be), prove [to be], ensue","Imperativo Afirmativo","Imperative Affirmative","Presente","Present","Yurn out! Don't turn out!",null,"resulta","resultad",null,"resulte","resulten","resultando","turning out","resultado","turned out"]
["resultar","to turn out (to be), prove [to be], ensue","Imperativo Negativo","Imperative Negative","Presente","Present","Yurn out! Don't turn out!",null,"no resultes","no resultéis",null,"no resulte","no resulten","resultando","turning out","resultado","turned out"]
["resultar","to turn out (to be), prove [to be], ensue","Indicativo","Indicative","Presente","Present","I turn out, am turning out","resulto","resultas","resulta","resultamos","resultáis","resultan","resultando","turning out","resultado","turned out"]
["resultar","to turn out (to be), prove [to be], ensue","Indicativo","Indicative","Futuro","Future","I will turn out","resultaré","resultarás","resultará","resultaremos","resultaréis","resultarán","resultando","turning out","resultado","turned out"]
["resultar","to turn out (to be), prove [to be], ensue","Indicativo","Indicative","Imperfecto","Imperfect","I was turning out, used to turn out, turned out","resultaba","resultabas","resultaba","resultábamos","resultabais","resultaban","resultando","turning out","resultado","turned out"]
["resultar","to turn out (to be), prove [to be], ensue","Indicativo","Indicative","Pretérito","Preterite","I turned out","resulté","resultaste","resultó","resultamos","resultasteis","resultaron","resultando","turning out","resultado","turned out"]
["resultar","to turn out (to be), prove [to be], ensue","Indicativo","Indicative","Condicional","Conditional","I would turn out","resultaría","resultarías","resultaría","resultaríamos","resultaríais","resultarían","resultando","turning out","resultado","turned out"]
["resultar","to turn out (to be), prove [to be], ensue","Indicativo","Indicative","Presente perfecto","Present Perfect","I have turned out","he resultado","has resultado","ha resultado","hemos resultado","habéis resultado","han resultado","resultando","turning out","resultado","turned out"]
["resultar","to turn out (to be), prove [to be], ensue","Indicativo","Indicative","Futuro perfecto","Future Perfect","I will have turned out","habré resultado","habrás resultado","habrá resultado","habremos resultado","habréis resultado","habrán resultado","resultando","turning out","resultado","turned out"]
["resultar","to turn out (to be), prove [to be], ensue","Indicativo","Indicative","Pluscuamperfecto","Past Perfect","I had turned out","había resultado","habías resultado","había resultado","habíamos resultado","habíais resultado","habían resultado","resultando","turning out","resultado","turned out"]
["resultar","to turn out (to be), prove [to be], ensue","Indicativo","Indicative","Pretérito anterior","Preterite (Archaic)","I had turned out","hube resultado","hubiste resultado","hubo resultado","hubimos resultado","hubisteis resultado","hubieron resultado","resultando","turning out","resultado","turned out"]
["resultar","to turn out (to be), prove [to be], ensue","Indicativo","Indicative","Condicional perfecto","Conditional Perfect","I would have turned out","habría resultado","habrías resultado","habría resultado","habríamos resultado","habríais resultado","habrían resultado","resultando","turning out","resultado","turned out"]
["resultar","to turn out (to be), prove [to be], ensue","Subjuntivo","Subjunctive","Presente","Present","I turn out, am turning out","resulte","resultes","resulte","resultemos","resultéis","resulten","resultando","turning out","resultado","turned out"]
["resultar","to turn out (to be), prove [to be], ensue","Subjuntivo","Subjunctive","Imperfecto","Imperfect","I turned out, was turning out","resultara","resultaras","resultara","resultáramos","resultarais","resultaran","resultando","turning out","resultado","turned out"]
["resultar","to turn out (to be), prove [to be], ensue","Subjuntivo","Subjunctive","Futuro","Future","I will turn out","resultare","resultares","resultare","resultáremos","resultareis","resultaren","resultando","turning out","resultado","turned out"]
["resultar","to turn out (to be), prove [to be], ensue","Subjuntivo","Subjunctive","Presente perfecto","Present Perfect","I have turned out, turned out","haya resultado","hayas resultado","haya resultado","hayamos resultado","hayáis resultado","hayan resultado","resultando","turning out","resultado","turned out"]
["resultar","to turn out (to be), prove [to be], ensue","Subjuntivo","Subjunctive","Futuro perfecto","Future Perfect","I will have turned out","hubiere resultado","hubieres resultado","hubiere resultado","hubiéremos resultado","hubiereis resultado","hubieren resultado","resultando","turning out","resultado","turned out"]
["resultar","to turn out (to be), prove [to be], ensue","Subjuntivo","Subjunctive","Pluscuamperfecto","Past Perfect","I had turned out","hubiera resultado","hubieras resultado","hubiera resultado","hubiéramos resultado","hubierais resultado","hubieran resultado","resultando","turning out","resultado","turned out"]
["romper","to break","Imperativo Afirmativo","Imperative Affirmative","Presente","Present","Break! Don't break!",null,"rompe","romped",null,"rompa","rompan","rompiendo","breaking","roto","broken"]
["romper","to break","Imperativo Negativo","Imperative Negative","Presente","Present","Break! Don't break!",null,"no rompas","no rompáis",null,"no rompa","no rompan","rompiendo","breaking","roto","broken"]
["romper","to break","Indicativo","Indicative","Presente","Present","I break, am breaking","rompo","rompes","rompe","rompemos","rompéis","rompen","rompiendo","breaking","roto","broken"]
["romper","to break","Indicativo","Indicative","Futuro","Future","I will break","romperé","romperás","romperá","romperemos","romperéis","romperán","rompiendo","breaking","roto","broken"]
["romper","to break","Indicativo","Indicative","Imperfecto","Imperfect","I was breaking, used to break, broke","rompía","rompías","rompía","rompíamos","rompíais","rompían","rompiendo","breaking","roto","broken"]
["romper","to break","Indicativo","Indicative","Pretérito","Preterite","I broke","rompí","rompiste","rompió","rompimos","rompisteis","rompieron","rompiendo","breaking","roto","broken"]
["romper","to break","Indicativo","Indicative","Condicional","Conditional","I would break","rompería","romperías","rompería","romperíamos","romperíais","romperían","rompiendo","breaking","roto","broken"]
["romper","to break","Indicativo","Indicative","Presente perfecto","Present Perfect","I have broken","he roto","has roto","ha roto","hemos roto","habéis roto","han roto","rompiendo","breaking","roto","broken"]
["romper","to break","Indicativo","Indicative","Futuro perfecto","Future Perfect","I will have broken","habré roto","habrás roto","habrá roto","habremos roto","habréis roto","habrán roto","rompiendo","breaking","roto","broken"]
["romper","to break","Indicativo","Indicative","Pluscuamperfecto","Past Perfect","I had broken","había roto","habías roto","había roto","habíamos roto","habíais roto","habían roto","rompiendo","breaking","roto","broken"]
["romper","to break","Indicativo","Indicative","Pretérito anterior","Preterite (Archaic)","I had broken","hube roto","hubiste roto","hubo roto","hubimos roto","hubisteis roto","hubieron roto","rompiendo","breaking","roto","broken"]
["romper","to break","Indicativo","Indicative","Condicional perfecto","Conditional Perfect","I would have broken","habría roto","habrías roto","habría roto","habríamos roto","habríais roto","habrían roto","rompiendo","breaking","roto","broken"]
["romper","to break","Subjuntivo","Subjunctive","Presente","Present","I break, am breaking","rompa","rompas","rompa","rompamos","rompáis","rompan","rompiendo","breaking","roto","broken"]
["romper","to break","Subjuntivo","Subjunctive","Imperfecto","Imperfect","I broke, was breaking","rompiera","rompieras","rompiera","rompiéramos","rompierais","rompieran","rompiendo","breaking","roto","broken"]
["romper","to break","Subjuntivo","Subjunctive","Futuro","Future","I will break","rompiere","rompieres","rompiere","rompiéremos","rompiereis","rompieren","rompiendo","breaking","roto","broken"]
["romper","to break","Subjuntivo","Subjunctive","Presente perfecto","Present Perfect","I have broken, broke","haya roto","hayas roto","haya roto","hayamos roto","hayáis roto","hayan roto","rompiendo","breaking","roto","broken"]
["romper","to break","Subjuntivo","Subjunctive","Futuro perfecto","Future Perfect","I will have broken","hubiere roto","hubieres roto","hubiere roto","hubiéremos roto","hubiereis roto","hubieren roto","rompiendo","breaking","roto","broken"]
["romper","to break","Subjuntivo","Subjunctive","Pluscuamperfecto","Past Perfect","I had broken","hubiera roto","hubieras roto","hubiera roto","hubiéramos roto","hubierais roto","hubieran roto","rompiendo","breaking","roto","broken"]
["saber","to know","Imperativo Afirmativo","Imperative Affirmative","Presente","Present","Know! Don't know!",null,"sabe","sabed",null,"sepa","sepan","sabiendo","knowing","sabido","known"]
["saber","to know","Imperativo Negativo","Imperative Negative","Presente","Present","Know! Don't know!",null,"no sepas","no sepáis",null,"no sepa","no sepan","sabiendo","knowing","sabido","known"]
["saber","to know","Indicativo","Indicative","Presente","Present","I know","sé","sabes","sabe","sabemos","sabéis","saben","sabiendo","knowing","sabido","known"]
["saber","to know","Indicativo","Indicative","Futuro","Future","I will know","sabré","sabrás","sabrá","sabremos","sabréis","sabrán","sabiendo","knowing","sabido","known"]
["saber","to know","Indicativo","Indicative","Imperfecto","Imperfect","I used to know, knew","sabía","sabías","sabía","sabíamos","sabíais","sabían","sabiendo","knowing","sabido","known"]
["saber","to know","Indicativo","Indicative","Pretérito","Preterite","I knew","supe","supiste","supo","supimos","supisteis","supieron","sabiendo","knowing","sabido","known"]
["saber","to know","Indicativo","Indicative","Condicional","Conditional","I would know","sabría","sabrías","sabría","sabríamos","sabríais","sabrían","sabiendo","knowing","sabido","known"]
["saber","to know","Indicativo","Indicative","Presente perfecto","Present Perfect","I have known","he sabido","has sabido","ha sabido","hemos sabido","habéis sabido","han sabido","sabiendo","knowing","sabido","known"]
["saber","to know","Indicativo","Indicative","Futuro perfecto","Future Perfect","I will have known","habré sabido","habrás sabido","habrá sabido","habremos sabido","habréis sabido","habrán sabido","sabiendo","knowing","sabido","known"]
["saber","to know","Indicativo","Indicative","Pluscuamperfecto","Past Perfect","I had known","había sabido","habías sabido","había sabido","habíamos sabido","habíais sabido","habían sabido","sabiendo","knowing","sabido","known"]
["saber","to know","Indicativo","Indicative","Pretérito anterior","Preterite (Archaic)","I had known","hube sabido","hubiste sabido","hubo sabido","hubimos sabido","hubisteis sabido","hubieron sabido","sabiendo","knowing","sabido","known"]
["saber","to know","Indicativo","Indicative","Condicional perfecto","Conditional Perfect","I would have known","habría sabido","habrías sabido","habría sabido","habríamos sabido","habríais sabido","habrían sabido","sabiendo","knowing","sabido","known"]
["saber","to know","Subjuntivo","Subjunctive","Presente","Present","I know","sepa","sepas","sepa","sepamos","sepáis","sepan","sabiendo","knowing","sabido","known"]
["saber","to know","Subjuntivo","Subjunctive","Imperfecto","Imperfect","I knew","supiera","supieras","supiera","supiéramos","supierais","supieran","sabiendo","knowing","sabido","known"]
["saber","to know","Subjuntivo","Subjunctive","Futuro","Future","I will know","supiere","supieres","supiere","supiéremos","supiereis","supieren","sabiendo","knowing","sabido","known"]
["saber","to know","Subjuntivo","Subjunctive","Presente perfecto","Present Perfect","I have known, knew","haya sabido","hayas sabido","haya sabido","hayamos sabido","hayáis sabido","hayan sabido","sabiendo","knowing","sabido","known"]
["saber","to know","Subjuntivo","Subjunctive","Futuro perfecto","Future Perfect","I will have known","hubiere sabido","hubieres sabido","hubiere sabido","hubiéremos sabido","hubiereis sabido","hubieren sabido","sabiendo","knowing","sabido","known"]
["saber","to know","Subjuntivo","Subjunctive","Pluscuamperfecto","Past Perfect","I had known","hubiera sabido","hubieras sabido","hubiera sabido","hubiéramos sabido","hubierais sabido","hubieran sabido","sabiendo","knowing","sabido","known"]
["sacar","to take out, stick out","Imperativo Afirmativo","Imperative Affirmative","Presente","Present","Take out! Don't take out!",null,"saca","sacad",null,"saque","saquen","sacando","taking out","sacado","taken out"]
["sacar","to take out, stick out","Imperativo Negativo","Imperative Negative","Presente","Present","Take out! Don't take out!",null,"no saques","no saquéis",null,"no saque","no saquen","sacando","taking out","sacado","taken out"]
["sacar","to take out, stick out","Indicativo","Indicative","Presente","Present","I take out, am taking out","saco","sacas","saca","sacamos","sacáis","sacan","sacando","taking out","sacado","taken out"]
["sacar","to take out, stick out","Indicativo","Indicative","Futuro","Future","I will take out","sacaré","sacarás","sacará","sacaremos","sacaréis","sacarán","sacando","taking out","sacado","taken out"]
["sacar","to take out, stick out","Indicativo","Indicative","Imperfecto","Imperfect","I was taking out, used to take out, took out","sacaba","sacabas","sacaba","sacábamos","sacabais","sacaban","sacando","taking out","sacado","taken out"]
["sacar","to take out, stick out","Indicativo","Indicative","Pretérito","Preterite","I took out","saqué","sacaste","sacó","sacamos","sacasteis","sacaron","sacando","taking out","sacado","taken out"]
["sacar","to take out, stick out","Indicativo","Indicative","Condicional","Conditional","I would take out","sacaría","sacarías","sacaría","sacaríamos","sacaríais","sacarían","sacando","taking out","sacado","taken out"]
["sacar","to take out, stick out","Indicativo","Indicative","Presente perfecto","Present Perfect","I have taken out","he sacado","has sacado","ha sacado","hemos sacado","habéis sacado","han sacado","sacando","taking out","sacado","taken out"]
["sacar","to take out, stick out","Indicativo","Indicative","Futuro perfecto","Future Perfect","I will have taken out","habré sacado","habrás sacado","habrá sacado","habremos sacado","habréis sacado","habrán sacado","sacando","taking out","sacado","taken out"]
["sacar","to take out, stick out","Indicativo","Indicative","Pluscuamperfecto","Past Perfect","I had taken out","había sacado","habías sacado","había sacado","habíamos sacado","habíais sacado","habían sacado","sacando","taking out","sacado","taken out"]
["sacar","to take out, stick out","Indicativo","Indicative","Pretérito anterior","Preterite (Archaic)","I had taken out","hube sacado","hubiste sacado","hubo sacado","hubimos sacado","hubisteis sacado","hubieron sacado","sacando","taking out","sacado","taken out"]
["sacar","to take out, stick out","Indicativo","Indicative","Condicional perfecto","Conditional Perfect","I would have taken out","habría sacado","habrías sacado","habría sacado","habríamos sacado","habríais sacado","habrían sacado","sacando","taking out","sacado","taken out"]
["sacar","to take out, stick out","Subjuntivo","Subjunctive","Presente","Present","I take out, am taking out","saque","saques","saque","saquemos","saquéis","saquen","sacando","taking out","sacado","taken out"]
["sacar","to take out, stick out","Subjuntivo","Subjunctive","Imperfecto","Imperfect","I took out, was taking out","sacara","sacaras","sacara","sacáramos","sacarais","sacaran","sacando","taking out","sacado","taken out"]
["sacar","to take out, stick out","Subjuntivo","Subjunctive","Futuro","Future","I will take out","sacare","sacares","sacare","sacáremos","sacareis","sacaren","sacando","taking out","sacado","taken out"]
["sacar","to take out, stick out","Subjuntivo","Subjunctive","Presente perfecto","Present Perfect","I have taken out, took out","haya sacado","hayas sacado","haya sacado","hayamos sacado","hayáis sacado","hayan sacado","sacando","taking out","sacado","taken out"]
["sacar","to take out, stick out","Subjuntivo","Subjunctive","Futuro perfecto","Future Perfect","I will have taken out","hubiere sacado","hubieres sacado","hubiere sacado","hubiéremos sacado","hubiereis sacado","hubieren sacado","sacando","taking out","sacado","taken out"]
["sacar","to take out, stick out","Subjuntivo","Subjunctive","Pluscuamperfecto","Past Perfect","I had taken out","hubiera sacado","hubieras sacado","hubiera sacado","hubiéramos sacado","hubierais sacado","hubieran sacado","sacando","taking out","sacado","taken out"]
["salir","to leave, go out","Imperativo Afirmativo","Imperative Affirmative","Presente","Present","Leave! Don't leave!",null,"sal","salid",null,"salga","salgan","saliendo","leaving","salido","left"]
["salir","to leave, go out","Imperativo Negativo","Imperative Negative","Presente","Present","Leave! Don't leave!",null,"no salgas","no salgáis",null,"no salga","no salgan","saliendo","leaving","salido","left"]
["salir","to leave, go out","Indicativo","Indicative","Presente","Present","I leave, am leaving","salgo","sales","sale","salimos","salís","salen","saliendo","leaving","salido","left"]
["salir","to leave, go out","Indicativo","Indicative","Futuro","Future","I will leave","saldré","saldrás","saldrá","saldremos","saldréis","saldrán","saliendo","leaving","salido","left"]
["salir","to leave, go out","Indicativo","Indicative","Imperfecto","Imperfect","I was leaving, used to leave, left","salía","salías","salía","salíamos","salíais","salían","saliendo","leaving","salido","left"]
["salir","to leave, go out","Indicativo","Indicative","Pretérito","Preterite","I left","salí","saliste","salió","salimos","salisteis","salieron","saliendo","leaving","salido","left"]
["salir","to leave, go out","Indicativo","Indicative","Condicional","Conditional","I would leave","saldría","saldrías","saldría","saldríamos","saldríais","saldrían","saliendo","leaving","salido","left"]
["salir","to leave, go out","Indicativo","Indicative","Presente perfecto","Present Perfect","I have left, left","he salido","has salido","ha salido","hemos salido","habéis salido","han salido","saliendo","leaving","salido","left"]
["salir","to leave, go out","Indicativo","Indicative","Futuro perfecto","Future Perfect","I will have left","habré salido","habrás salido","habrá salido","habremos salido","habréis salido","habrán salido","saliendo","leaving","salido","left"]
["salir","to leave, go out","Indicativo","Indicative","Pluscuamperfecto","Past Perfect","I had left","había salido","habías salido","había salido","habíamos salido","habíais salido","habían salido","saliendo","leaving","salido","left"]
["salir","to leave, go out","Indicativo","Indicative","Pretérito anterior","Preterite (Archaic)","I had left","hube salido","hubiste salido","hubo salido","hubimos salido","hubisteis salido","hubieron salido","saliendo","leaving","salido","left"]
["salir","to leave, go out","Indicativo","Indicative","Condicional perfecto","Conditional Perfect","I would have left","habría salido","habrías salido","habría salido","habríamos salido","habríais salido","habrían salido","saliendo","leaving","salido","left"]
["salir","to leave, go out","Subjuntivo","Subjunctive","Presente","Present","I leave, am leaving","salga","salgas","salga","salgamos","salgáis","salgan","saliendo","leaving","salido","left"]
["salir","to leave, go out","Subjuntivo","Subjunctive","Imperfecto","Imperfect","I left, was leaving","saliera","salieras","saliera","saliéramos","salierais","salieran","saliendo","leaving","salido","left"]
["salir","to leave, go out","Subjuntivo","Subjunctive","Futuro","Future","I will leave","saliere","salieres","saliere","saliéremos","saliereis","salieren","saliendo","leaving","salido","left"]
["salir","to leave, go out","Subjuntivo","Subjunctive","Presente perfecto","Present Perfect","I have left, left","haya salido","hayas salido","haya salido","hayamos salido","hayáis salido","hayan salido","saliendo","leaving","salido","left"]
["salir","to leave, go out","Subjuntivo","Subjunctive","Futuro perfecto","Future Perfect","I will have left","hubiere salido","hubieres salido","hubiere salido","hubiéremos salido","hubiereis salido","hubieren salido","saliendo","leaving","salido","left"]
["salir","to leave, go out","Subjuntivo","Subjunctive","Pluscuamperfecto","Past Perfect","I had left","hubiera salido","hubieras salido","hubiera salido","hubiéramos salido","hubierais salido","hubieran salido","saliendo","leaving","salido","left"]
["salvar","to save, rescue; to except, exclude","Imperativo Afirmativo","Imperative Affirmative","Presente","Present","Save! Don't save!",null,"salva","salvad",null,"salve","salven","salvando","saving","salvado","saved"]
["salvar","to save, rescue; to except, exclude","Imperativo Negativo","Imperative Negative","Presente","Present","Save! Don't save!",null,"no salves","no salvéis",null,"no salve","no salven","salvando","saving","salvado","saved"]
["salvar","to save, rescue; to except, exclude","Indicativo","Indicative","Presente","Present","I save, am saving","salvo","salvas","salva","salvamos","salváis","salvan","salvando","saving","salvado","saved"]
["salvar","to save, rescue; to except, exclude","Indicativo","Indicative","Futuro","Future","I will save","salvaré","salvarás","salvará","salvaremos","salvaréis","salvarán","salvando","saving","salvado","saved"]
["salvar","to save, rescue; to except, exclude","Indicativo","Indicative","Imperfecto","Imperfect","I was saving, used to save, saved","salvaba","salvabas","salvaba","salvábamos","salvabais","salvaban","salvando","saving","salvado","saved"]
["salvar","to save, rescue; to except, exclude","Indicativo","Indicative","Pretérito","Preterite","I saved","salvé","salvaste","salvó","salvamos","salvasteis","salvaron","salvando","saving","salvado","saved"]
["salvar","to save, rescue; to except, exclude","Indicativo","Indicative","Condicional","Conditional","I would save","salvaría","salvarías","salvaría","salvaríamos","salvaríais","salvarían","salvando","saving","salvado","saved"]
["salvar","to save, rescue; to except, exclude","Indicativo","Indicative","Presente perfecto","Present Perfect","I have saved","he salvado","has salvado","ha salvado","hemos salvado","habéis salvado","han salvado","salvando","saving","salvado","saved"]
["salvar","to save, rescue; to except, exclude","Indicativo","Indicative","Futuro perfecto","Future Perfect","I will have saved","habré salvado","habrás salvado","habrá salvado","habremos salvado","habréis salvado","habrán salvado","salvando","saving","salvado","saved"]
["salvar","to save, rescue; to except, exclude","Indicativo","Indicative","Pluscuamperfecto","Past Perfect","I had saved","había salvado","habías salvado","había salvado","habíamos salvado","habíais salvado","habían salvado","salvando","saving","salvado","saved"]
["salvar","to save, rescue; to except, exclude","Indicativo","Indicative","Pretérito anterior","Preterite (Archaic)","I had saved","hube salvado","hubiste salvado","hubo salvado","hubimos salvado","hubisteis salvado","hubieron salvado","salvando","saving","salvado","saved"]
["salvar","to save, rescue; to except, exclude","Indicativo","Indicative","Condicional perfecto","Conditional Perfect","I would have saved","habría salvado","habrías salvado","habría salvado","habríamos salvado","habríais salvado","habrían salvado","salvando","saving","salvado","saved"]
["salvar","to save, rescue; to except, exclude","Subjuntivo","Subjunctive","Presente","Present","I save, am saving","salve","salves","salve","salvemos","salvéis","salven","salvando","saving","salvado","saved"]
["salvar","to save, rescue; to except, exclude","Subjuntivo","Subjunctive","Imperfecto","Imperfect","I saved, was saving","salvara","salvaras","salvara","salváramos","salvarais","salvaran","salvando","saving","salvado","saved"]
["salvar","to save, rescue; to except, exclude","Subjuntivo","Subjunctive","Futuro","Future","I will save","salvare","salvares","salvare","salváremos","salvareis","salvaren","salvando","saving","salvado","saved"]
["salvar","to save, rescue; to except, exclude","Subjuntivo","Subjunctive","Presente perfecto","Present Perfect","I have saved, saved","haya salvado","hayas salvado","haya salvado","hayamos salvado","hayáis salvado","hayan salvado","salvando","saving","salvado","saved"]
["salvar","to save, rescue; to except, exclude","Subjuntivo","Subjunctive","Futuro perfecto","Future Perfect","I will have saved","hubiere salvado","hubieres salvado","hubiere salvado","hubiéremos salvado","hubiereis salvado","hubieren salvado","salvando","saving","salvado","saved"]
["salvar","to save, rescue; to except, exclude","Subjuntivo","Subjunctive","Pluscuamperfecto","Past Perfect","I had saved","hubiera salvado","hubieras salvado","hubiera salvado","hubiéramos salvado","hubierais salvado","hubieran salvado","salvando","saving","salvado","saved"]
["seguir","to follow, continue","Imperativo Afirmativo","Imperative Affirmative","Presente","Present","Follow! Don't follow!",null,"sigue","seguid",null,"siga","sigan","siguiendo","following","seguido","followed"]
["seguir","to follow, continue","Imperativo Negativo","Imperative Negative","Presente","Present","Follow! Don't follow!",null,"no sigas","no sigáis",null,"no siga","no sigan","siguiendo","following","seguido","followed"]
["seguir","to follow, continue","Indicativo","Indicative","Presente","Present","I follow, am following","sigo","sigues","sigue","seguimos","seguís","siguen","siguiendo","following","seguido","followed"]
["seguir","to follow, continue","Indicativo","Indicative","Futuro","Future","I will follow","seguiré","seguirás","seguirá","seguiremos","seguiréis","seguirán","siguiendo","following","seguido","followed"]
["seguir","to follow, continue","Indicativo","Indicative","Imperfecto","Imperfect","I was following, used to follow, followed","seguía","seguías","seguía","seguíamos","seguíais","seguían","siguiendo","following","seguido","followed"]
["seguir","to follow, continue","Indicativo","Indicative","Pretérito","Preterite","I followed","seguí","seguiste","siguió","seguimos","seguisteis","siguieron","siguiendo","following","seguido","followed"]
["seguir","to follow, continue","Indicativo","Indicative","Condicional","Conditional","I would follow","seguiría","seguirías","seguiría","seguiríamos","seguiríais","seguirían","siguiendo","following","seguido","followed"]
["seguir","to follow, continue","Indicativo","Indicative","Presente perfecto","Present Perfect","I have followed","he seguido","has seguido","ha seguido","hemos seguido","habéis seguido","han seguido","siguiendo","following","seguido","followed"]
["seguir","to follow, continue","Indicativo","Indicative","Futuro perfecto","Future Perfect","I will have followed","habré seguido","habrás seguido","habrá seguido","habremos seguido","habréis seguido","habrán seguido","siguiendo","following","seguido","followed"]
["seguir","to follow, continue","Indicativo","Indicative","Pluscuamperfecto","Past Perfect","I had followed","había seguido","habías seguido","había seguido","habíamos seguido","habíais seguido","habían seguido","siguiendo","following","seguido","followed"]
["seguir","to follow, continue","Indicativo","Indicative","Pretérito anterior","Preterite (Archaic)","I had followed","hube seguido","hubiste seguido","hubo seguido","hubimos seguido","hubisteis seguido","hubieron seguido","siguiendo","following","seguido","followed"]
["seguir","to follow, continue","Indicativo","Indicative","Condicional perfecto","Conditional Perfect","I would have followed","habría seguido","habrías seguido","habría seguido","habríamos seguido","habríais seguido","habrían seguido","siguiendo","following","seguido","followed"]
["seguir","to follow, continue","Subjuntivo","Subjunctive","Presente","Present","I follow, am following","siga","sigas","siga","sigamos","sigáis","sigan","siguiendo","following","seguido","followed"]
["seguir","to follow, continue","Subjuntivo","Subjunctive","Imperfecto","Imperfect","I followed, was following","siguiera","siguieras","siguiera","siguiéramos","siguierais","siguieran","siguiendo","following","seguido","followed"]
["seguir","to follow, continue","Subjuntivo","Subjunctive","Futuro","Future","I will follow","siguiere","siguieres","siguiere","siguiéremos","siguiereis","siguieren","siguiendo","following","seguido","followed"]
["seguir","to follow, continue","Subjuntivo","Subjunctive","Presente perfecto","Present Perfect","I have followed, followed","haya seguido","hayas seguido","haya seguido","hayamos seguido","hayáis seguido","hayan seguido","siguiendo","following","seguido","followed"]
["seguir","to follow, continue","Subjuntivo","Subjunctive","Futuro perfecto","Future Perfect","I will have followed","hubiere seguido","hubieres seguido","hubiere seguido","hubiéremos seguido","hubiereis seguido","hubieren seguido","siguiendo","following","seguido","followed"]
["seguir","to follow, continue","Subjuntivo","Subjunctive","Pluscuamperfecto","Past Perfect","I had followed","hubiera seguido","hubieras seguido","hubiera seguido","hubiéramos seguido","hubierais seguido","hubieran seguido","siguiendo","following","seguido","followed"]
["señalar","to point out, point to, indicate; to signal; to mark","Imperativo Afirmativo","Imperative Affirmative","Presente","Present","Point out! Don't point out!",null,"señala","señalad",null,"señale","señalen","señalando","pointing out","señalado","pointed out"]
["señalar","to point out, point to, indicate; to signal; to mark","Imperativo Negativo","Imperative Negative","Presente","Present","Point out! Don't point out!",null,"no señales","no señaléis",null,"no señale","no señalen","señalando","pointing out","señalado","pointed out"]
["señalar","to point out, point to, indicate; to signal; to mark","Indicativo","Indicative","Presente","Present","I point out, am pointing out","señalo","señalas","señala","señalamos","señaláis","señalan","señalando","pointing out","señalado","pointed out"]
["señalar","to point out, point to, indicate; to signal; to mark","Indicativo","Indicative","Futuro","Future","I will point out","señalaré","señalarás","señalará","señalaremos","señalaréis","señalarán","señalando","pointing out","señalado","pointed out"]
["señalar","to point out, point to, indicate; to signal; to mark","Indicativo","Indicative","Imperfecto","Imperfect","I was pointing out, used to point out, pointed out","señalaba","señalabas","señalaba","señalábamos","señalabais","señalaban","señalando","pointing out","señalado","pointed out"]
["señalar","to point out, point to, indicate; to signal; to mark","Indicativo","Indicative","Pretérito","Preterite","I pointed out","señalé","señalaste","señaló","señalamos","señalasteis","señalaron","señalando","pointing out","señalado","pointed out"]
["señalar","to point out, point to, indicate; to signal; to mark","Indicativo","Indicative","Condicional","Conditional","I would point out","señalaría","señalarías","señalaría","señalaríamos","señalaríais","señalarían","señalando","pointing out","señalado","pointed out"]
["señalar","to point out, point to, indicate; to signal; to mark","Indicativo","Indicative","Presente perfecto","Present Perfect","I have pointed out","he señalado","has señalado","ha señalado","hemos señalado","habéis señalado","han señalado","señalando","pointing out","señalado","pointed out"]
["señalar","to point out, point to, indicate; to signal; to mark","Indicativo","Indicative","Futuro perfecto","Future Perfect","I will have pointed out","habré señalado","habrás señalado","habrá señalado","habremos señalado","habréis señalado","habrán señalado","señalando","pointing out","señalado","pointed out"]
["señalar","to point out, point to, indicate; to signal; to mark","Indicativo","Indicative","Pluscuamperfecto","Past Perfect","I had pointed out","había señalado","habías señalado","había señalado","habíamos señalado","habíais señalado","habían señalado","señalando","pointing out","señalado","pointed out"]
["señalar","to point out, point to, indicate; to signal; to mark","Indicativo","Indicative","Pretérito anterior","Preterite (Archaic)","I had pointed out","hube señalado","hubiste señalado","hubo señalado","hubimos señalado","hubisteis señalado","hubieron señalado","señalando","pointing out","señalado","pointed out"]
["señalar","to point out, point to, indicate; to signal; to mark","Indicativo","Indicative","Condicional perfecto","Conditional Perfect","I would have pointed out","habría señalado","habrías señalado","habría señalado","habríamos señalado","habríais señalado","habrían señalado","señalando","pointing out","señalado","pointed out"]
["señalar","to point out, point to, indicate; to signal; to mark","Subjuntivo","Subjunctive","Presente","Present","I point out, am pointing out","señale","señales","señale","señalemos","señaléis","señalen","señalando","pointing out","señalado","pointed out"]
["señalar","to point out, point to, indicate; to signal; to mark","Subjuntivo","Subjunctive","Imperfecto","Imperfect","I pointed out, was pointing out","señalara","señalaras","señalara","señaláramos","señalarais","señalaran","señalando","pointing out","señalado","pointed out"]
["señalar","to point out, point to, indicate; to signal; to mark","Subjuntivo","Subjunctive","Futuro","Future","I will point out","señalare","señalares","señalare","señaláremos","señalareis","señalaren","señalando","pointing out","señalado","pointed out"]
["señalar","to point out, point to, indicate; to signal; to mark","Subjuntivo","Subjunctive","Presente perfecto","Present Perfect","I have pointed out, pointed out","haya señalado","hayas señalado","haya señalado","hayamos señalado","hayáis señalado","hayan señalado","señalando","pointing out","señalado","pointed out"]
["señalar","to point out, point to, indicate; to signal; to mark","Subjuntivo","Subjunctive","Futuro perfecto","Future Perfect","I will have pointed out","hubiere señalado","hubieres señalado","hubiere señalado","hubiéremos señalado","hubiereis señalado","hubieren señalado","señalando","pointing out","señalado","pointed out"]
["señalar","to point out, point to, indicate; to signal; to mark","Subjuntivo","Subjunctive","Pluscuamperfecto","Past Perfect","I had pointed out","hubiera señalado","hubieras señalado","hubiera señalado","hubiéramos señalado","hubierais señalado","hubieran señalado","señalando","pointing out","señalado","pointed out"]
["sentar","to seat, sit","Imperativo Afirmativo","Imperative Affirmative","Presente","Present","Seat! Don't seat!",null,"sienta","sentad",null,"siente","sienten","sentando","seating","sentado","seated"]
["sentar","to seat, sit","Imperativo Negativo","Imperative Negative","Presente","Present","Seat! Don't seat!",null,"no sientes","no sentéis",null,"no siente","no sienten","sentando","seating","sentado","seated"]
["sentar","to seat, sit","Indicativo","Indicative","Presente","Present","I seat, am seating","siento","sientas","sienta","sentamos","sentáis","sientan","sentando","seating","sentado","seated"]
["sentar","to seat, sit","Indicativo","Indicative","Futuro","Future","I will seat","sentaré","sentarás","sentará","sentaremos","sentaréis","sentarán","sentando","seating","sentado","seated"]
["sentar","to seat, sit","Indicativo","Indicative","Imperfecto","Imperfect","I was seating, used to seat, seat","sentaba","sentabas","sentaba","sentábamos","sentabais","sentaban","sentando","seating","sentado","seated"]
["sentar","to seat, sit","Indicativo","Indicative","Pretérito","Preterite","I seat","senté","sentaste","sentó","sentamos","sentasteis","sentaron","sentando","seating","sentado","seated"]
["sentar","to seat, sit","Indicativo","Indicative","Condicional","Conditional","I would seat","sentaría","sentarías","sentaría","sentaríamos","sentaríais","sentarían","sentando","seating","sentado","seated"]
["sentar","to seat, sit","Indicativo","Indicative","Presente perfecto","Present Perfect","I have seated","he sentado","has sentado","ha sentado","hemos sentado","habéis sentado","han sentado","sentando","seating","sentado","seated"]
["sentar","to seat, sit","Indicativo","Indicative","Futuro perfecto","Future Perfect","I will have seated","habré sentado","habrás sentado","habrá sentado","habremos sentado","habréis sentado","habrán sentado","sentando","seating","sentado","seated"]
["sentar","to seat, sit","Indicativo","Indicative","Pluscuamperfecto","Past Perfect","I had seated","había sentado","habías sentado","había sentado","habíamos sentado","habíais sentado","habían sentado","sentando","seating","sentado","seated"]
["sentar","to seat, sit","Indicativo","Indicative","Pretérito anterior","Preterite (Archaic)","I had seated","hube sentado","hubiste sentado","hubo sentado","hubimos sentado","hubisteis sentado","hubieron sentado","sentando","seating","sentado","seated"]
["sentar","to seat, sit","Indicativo","Indicative","Condicional perfecto","Conditional Perfect","I would have seated","habría sentado","habrías sentado","habría sentado","habríamos sentado","habríais sentado","habrían sentado","sentando","seating","sentado","seated"]
["sentar","to seat, sit","Subjuntivo","Subjunctive","Presente","Present","I seat, am seating","siente","sientes","siente","sentemos","sentéis","sienten","sentando","seating","sentado","seated"]
["sentar","to seat, sit","Subjuntivo","Subjunctive","Imperfecto","Imperfect","I seat, was seating","sentara","sentaras","sentara","sentáramos","sentarais","sentaran","sentando","seating","sentado","seated"]
["sentar","to seat, sit","Subjuntivo","Subjunctive","Futuro","Future","I will seat","sentare","sentares","sentare","sentáremos","sentareis","sentaren","sentando","seating","sentado","seated"]
["sentar","to seat, sit","Subjuntivo","Subjunctive","Presente perfecto","Present Perfect","I have seated, seated","haya sentado","hayas sentado","haya sentado","hayamos sentado","hayáis sentado","hayan sentado","sentando","seating","sentado","seated"]
["sentar","to seat, sit","Subjuntivo","Subjunctive","Futuro perfecto","Future Perfect","I will have seated","hubiere sentado","hubieres sentado","hubiere sentado","hubiéremos sentado","hubiereis sentado","hubieren sentado","sentando","seating","sentado","seated"]
["sentar","to seat, sit","Subjuntivo","Subjunctive","Pluscuamperfecto","Past Perfect","I had seated","hubiera sentado","hubieras sentado","hubiera sentado","hubiéramos sentado","hubierais sentado","hubieran sentado","sentando","seating","sentado","seated"]
["sentir","to feel, regret","Imperativo Afirmativo","Imperative Affirmative","Presente","Present","Feel! Don't feel!",null,"siente","sentid",null,"sienta","sientan","sintiendo","feeling","sentido","felt"]
["sentir","to feel, regret","Imperativo Negativo","Imperative Negative","Presente","Present","Feel! Don't feel!",null,"no sientas","no sintáis",null,"no sienta","no sientan","sintiendo","feeling","sentido","felt"]
["sentir","to feel, regret","Indicativo","Indicative","Presente","Present","I feel, am feeling","siento","sientes","siente","sentimos","sentís","sienten","sintiendo","feeling","sentido","felt"]
["sentir","to feel, regret","Indicativo","Indicative","Futuro","Future","I will feel","sentiré","sentirás","sentirá","sentiremos","sentiréis","sentirán","sintiendo","feeling","sentido","felt"]
["sentir","to feel, regret","Indicativo","Indicative","Imperfecto","Imperfect","I was feeling, used to feel, felt","sentía","sentías","sentía","sentíamos","sentíais","sentían","sintiendo","feeling","sentido","felt"]
["sentir","to feel, regret","Indicativo","Indicative","Pretérito","Preterite","I felt","sentí","sentiste","sintió","sentimos","sentisteis","sintieron","sintiendo","feeling","sentido","felt"]
["sentir","to feel, regret","Indicativo","Indicative","Condicional","Conditional","I would feel","sentiría","sentirías","sentiría","sentiríamos","sentiríais","sentirían","sintiendo","feeling","sentido","felt"]
["sentir","to feel, regret","Indicativo","Indicative","Presente perfecto","Present Perfect","I have felt","he sentido","has sentido","ha sentido","hemos sentido","habéis sentido","han sentido","sintiendo","feeling","sentido","felt"]
["sentir","to feel, regret","Indicativo","Indicative","Futuro perfecto","Future Perfect","I will have felt","habré sentido","habrás sentido","habrá sentido","habremos sentido","habréis sentido","habrán sentido","sintiendo","feeling","sentido","felt"]
["sentir","to feel, regret","Indicativo","Indicative","Pluscuamperfecto","Past Perfect","I had felt","había sentido","habías sentido","había sentido","habíamos sentido","habíais sentido","habían sentido","sintiendo","feeling","sentido","felt"]
["sentir","to feel, regret","Indicativo","Indicative","Pretérito anterior","Preterite (Archaic)","I had felt","hube sentido","hubiste sentido","hubo sentido","hubimos sentido","hubisteis sentido","hubieron sentido","sintiendo","feeling","sentido","felt"]
["sentir","to feel, regret","Indicativo","Indicative","Condicional perfecto","Conditional Perfect","I would have felt","habría sentido","habrías sentido","habría sentido","habríamos sentido","habríais sentido","habrían sentido","sintiendo","feeling","sentido","felt"]
["sentir","to feel, regret","Subjuntivo","Subjunctive","Presente","Present","I feel, am feeling","sienta","sientas","sienta","sintamos","sintáis","sientan","sintiendo","feeling","sentido","felt"]
["sentir","to feel, regret","Subjuntivo","Subjunctive","Imperfecto","Imperfect","I felt, was feeling","sintiera","sintieras","sintiera","sintiéramos","sintierais","sintieran","sintiendo","feeling","sentido","felt"]
["sentir","to feel, regret","Subjuntivo","Subjunctive","Futuro","Future","I will feel","sintiere","sintieres","sintiere","sintiéremos","sintiereis","sintieren","sintiendo","feeling","sentido","felt"]
["sentir","to feel, regret","Subjuntivo","Subjunctive","Presente perfecto","Present Perfect","I have felt, felt","haya sentido","hayas sentido","haya sentido","hayamos sentido","hayáis sentido","hayan sentido","sintiendo","feeling","sentido","felt"]
["sentir","to feel, regret","Subjuntivo","Subjunctive","Futuro perfecto","Future Perfect","I will have felt","hubiere sentido","hubieres sentido","hubiere sentido","hubiéremos sentido","hubiereis sentido","hubieren sentido","sintiendo","feeling","sentido","felt"]
["sentir","to feel, regret","Subjuntivo","Subjunctive","Pluscuamperfecto","Past Perfect","I had felt","hubiera sentido","hubieras sentido","hubiera sentido","hubiéramos sentido","hubierais sentido","hubieran sentido","sintiendo","feeling","sentido","felt"]
["ser","to be","Imperativo Afirmativo","Imperative Affirmative","Presente","Present","Be! Don't be!",null,"sé","sed",null,"sea","sean","siendo","being","sido","been"]
["ser","to be","Imperativo Negativo","Imperative Negative","Presente","Present","Be! Don't be!",null,"no seas","no seais",null,"no sea","no sean","siendo","being","sido","been"]
["ser","to be","Indicativo","Indicative","Presente","Present","I am","soy","eres","es","somos","sois","son","siendo","being","sido","been"]
["ser","to be","Indicativo","Indicative","Futuro","Future","I will be","seré","serás","será","seremos","seréis","serán","siendo","being","sido","been"]
["ser","to be","Indicativo","Indicative","Imperfecto","Imperfect","I used to be, was","era","eras","era","éramos","erais","eran","siendo","being","sido","been"]
["ser","to be","Indicativo","Indicative","Pretérito","Preterite","I was","fui","fuiste","fue","fuimos","fuisteis","fueron","siendo","being","sido","been"]
["ser","to be","Indicativo","Indicative","Condicional","Conditional","I would be","sería","serías","sería","seríamos","seríais","serían","siendo","being","sido","been"]
["ser","to be","Indicativo","Indicative","Presente perfecto","Present Perfect","I have been","he sido","has sido","ha sido","hemos sido","habéis sido","han sido","siendo","being","sido","been"]
["ser","to be","Indicativo","Indicative","Futuro perfecto","Future Perfect","I will have been","habré sido","habrás sido","habrá sido","habremos sido","habréis sido","habrán sido","siendo","being","sido","been"]
["ser","to be","Indicativo","Indicative","Pluscuamperfecto","Past Perfect","I had been","había sido","habías sido","había sido","habíamos sido","habíais sido","habían sido","siendo","being","sido","been"]
["ser","to be","Indicativo","Indicative","Pretérito anterior","Preterite (Archaic)","I had been","hube sido","hubiste sido","hubo sido","hubimos sido","hubisteis sido","hubieron sido","siendo","being","sido","been"]
["ser","to be","Indicativo","Indicative","Condicional perfecto","Conditional Perfect","I would have been","habría sido","habrías sido","habría sido","habríamos sido","habríais sido","habrían sido","siendo","being","sido","been"]
["ser","to be","Subjuntivo","Subjunctive","Presente","Present","I am","sea","seas","sea","seamos","seáis","sean","siendo","being","sido","been"]
["ser","to be","Subjuntivo","Subjunctive","Imperfecto","Imperfect","I was, was being, were","fuera","fueras","fuera","fuéramos","fuerais","fueran","siendo","being","sido","been"]
["ser","to be","Subjuntivo","Subjunctive","Futuro","Future","I will be","fuere","fueres","fuere","fuéremos","fuereis","fueren","siendo","being","sido","been"]
["ser","to be","Subjuntivo","Subjunctive","Presente perfecto","Present Perfect","I have been, was","haya sido","hayas sido","haya sido","hayamos sido","hayáis sido","hayan sido","siendo","being","sido","been"]
["ser","to be","Subjuntivo","Subjunctive","Futuro perfecto","Future Perfect","I will have been","hubiere sido","hubieres sido","hubiere sido","hubiéremos sido","hubiereis sido","hubieren sido","siendo","being","sido","been"]
["ser","to be","Subjuntivo","Subjunctive","Pluscuamperfecto","Past Perfect","I had been","hubiera sido","hubieras sido","hubiera sido","hubiéramos sido","hubierais sido","hubieran sido","siendo","being","sido","been"]
["servir","to serve","Imperativo Afirmativo","Imperative Affirmative","Presente","Present","Serve! Don't serve!",null,"sirve","servid",null,"sirva","sirvan","sirviendo","serving","servido","served"]
["servir","to serve","Imperativo Negativo","Imperative Negative","Presente","Present","Serve! Don't serve!",null,"no sirvas","no sirváis",null,"no sirva","no sirvan","sirviendo","serving","servido","served"]
["servir","to serve","Indicativo","Indicative","Presente","Present","I serve, am serving","sirvo","sirves","sirve","servimos","servís","sirven","sirviendo","serving","servido","served"]
["servir","to serve","Indicativo","Indicative","Futuro","Future","I will serve","serviré","servirás","servirá","serviremos","serviréis","servirán","sirviendo","serving","servido","served"]
["servir","to serve","Indicativo","Indicative","Imperfecto","Imperfect","I was serving, used to serve, served","servía","servías","servía","servíamos","servíais","servían","sirviendo","serving","servido","served"]
["servir","to serve","Indicativo","Indicative","Pretérito","Preterite","I served","serví","serviste","sirvió","servimos","servisteis","sirvieron","sirviendo","serving","servido","served"]
["servir","to serve","Indicativo","Indicative","Condicional","Conditional","I would serve","serviría","servirías","serviría","serviríamos","serviríais","servirían","sirviendo","serving","servido","served"]
["servir","to serve","Indicativo","Indicative","Presente perfecto","Present Perfect","I have served","he servido","has servido","ha servido","hemos servido","habéis servido","han servido","sirviendo","serving","servido","served"]
["servir","to serve","Indicativo","Indicative","Futuro perfecto","Future Perfect","I will have served","habré servido","habrás servido","habrá servido","habremos servido","habréis servido","habrán servido","sirviendo","serving","servido","served"]
["servir","to serve","Indicativo","Indicative","Pluscuamperfecto","Past Perfect","I had served","había servido","habías servido","había servido","habíamos servido","habíais servido","habían servido","sirviendo","serving","servido","served"]
["servir","to serve","Indicativo","Indicative","Pretérito anterior","Preterite (Archaic)","I had served","hube servido","hubiste servido","hubo servido","hubimos servido","hubisteis servido","hubieron servido","sirviendo","serving","servido","served"]
["servir","to serve","Indicativo","Indicative","Condicional perfecto","Conditional Perfect","I would have served","habría servido","habrías servido","habría servido","habríamos servido","habríais servido","habrían servido","sirviendo","serving","servido","served"]
["servir","to serve","Subjuntivo","Subjunctive","Presente","Present","I serve, am serving","sirva","sirvas","sirva","sirvamos","sirváis","sirvan","sirviendo","serving","servido","served"]
["servir","to serve","Subjuntivo","Subjunctive","Imperfecto","Imperfect","I served, was serving","sirviera","sirvieras","sirviera","sirviéramos","sirvierais","sirvieran","sirviendo","serving","servido","served"]
["servir","to serve","Subjuntivo","Subjunctive","Futuro","Future","I will serve","sirviere","sirvieres","sirviere","sirviéremos","sirviereis","sirvieren","sirviendo","serving","servido","served"]
["servir","to serve","Subjuntivo","Subjunctive","Presente perfecto","Present Perfect","I have served, served","haya servido","hayas servido","haya servido","hayamos servido","hayáis servido","hayan servido","sirviendo","serving","servido","served"]
["servir","to serve","Subjuntivo","Subjunctive","Futuro perfecto","Future Perfect","I will have served","hubiere servido","hubieres servido","hubiere servido","hubiéremos servido","hubiereis servido","hubieren servido","sirviendo","serving","servido","served"]
["servir","to serve","Subjuntivo","Subjunctive","Pluscuamperfecto","Past Perfect","I had served","hubiera servido","hubieras servido","hubiera servido","hubiéramos servido","hubierais servido","hubieran servido","sirviendo","serving","servido","served"]
["significar","to signify, mean","Imperativo Afirmativo","Imperative Affirmative","Presente","Present","Signify! Don't signify!",null,"significa","significad",null,"signifique","signifiquen","significando","signifying","significado","signified"]
["significar","to signify, mean","Imperativo Negativo","Imperative Negative","Presente","Present","Signify! Don't signify!",null,"no signifiques","no signifiquéis",null,"no signifique","no signifiquen","significando","signifying","significado","signified"]
["significar","to signify, mean","Indicativo","Indicative","Presente","Present","I signify, am signifying","significo","significas","significa","significamos","significáis","significan","significando","signifying","significado","signified"]
["significar","to signify, mean","Indicativo","Indicative","Futuro","Future","I will signify","significaré","significarás","significará","significaremos","significaréis","significarán","significando","signifying","significado","signified"]
["significar","to signify, mean","Indicativo","Indicative","Imperfecto","Imperfect","I was signifying, used to signify, signified","significaba","significabas","significaba","significábamos","significabais","significaban","significando","signifying","significado","signified"]
["significar","to signify, mean","Indicativo","Indicative","Pretérito","Preterite","I signified","signifiqué","significaste","significó","significamos","significasteis","significaron","significando","signifying","significado","signified"]
["significar","to signify, mean","Indicativo","Indicative","Condicional","Conditional","I would signify","significaría","significarías","significaría","significaríamos","significaríais","significarían","significando","signifying","significado","signified"]
["significar","to signify, mean","Indicativo","Indicative","Presente perfecto","Present Perfect","I have signified","he significado","has significado","ha significado","hemos significado","habéis significado","han significado","significando","signifying","significado","signified"]
["significar","to signify, mean","Indicativo","Indicative","Futuro perfecto","Future Perfect","I will have signified","habré significado","habrás significado","habrá significado","habremos significado","habréis significado","habrán significado","significando","signifying","significado","signified"]
["significar","to signify, mean","Indicativo","Indicative","Pluscuamperfecto","Past Perfect","I had signified","había significado","habías significado","había significado","habíamos significado","habíais significado","habían significado","significando","signifying","significado","signified"]
["significar","to signify, mean","Indicativo","Indicative","Pretérito anterior","Preterite (Archaic)","I had signified","hube significado","hubiste significado","hubo significado","hubimos significado","hubisteis significado","hubieron significado","significando","signifying","significado","signified"]
["significar","to signify, mean","Indicativo","Indicative","Condicional perfecto","Conditional Perfect","I would have signified","habría significado","habrías significado","habría significado","habríamos significado","habríais significado","habrían significado","significando","signifying","significado","signified"]
["significar","to signify, mean","Subjuntivo","Subjunctive","Presente","Present","I signify, am signifying","signifique","signifiques","signifique","signifiquemos","signifiquéis","signifiquen","significando","signifying","significado","signified"]
["significar","to signify, mean","Subjuntivo","Subjunctive","Imperfecto","Imperfect","I signified, was signifying","significara","significaras","significara","significáramos","significarais","significaran","significando","signifying","significado","signified"]
["significar","to signify, mean","Subjuntivo","Subjunctive","Futuro","Future","I will signify","significare","significares","significare","significáremos","significareis","significaren","significando","signifying","significado","signified"]
["significar","to signify, mean","Subjuntivo","Subjunctive","Presente perfecto","Present Perfect","I have signified, signified","haya significado","hayas significado","haya significado","hayamos significado","hayáis significado","hayan significado","significando","signifying","significado","signified"]
["significar","to signify, mean","Subjuntivo","Subjunctive","Futuro perfecto","Future Perfect","I will have signified","hubiere significado","hubieres significado","hubiere significado","hubiéremos significado","hubiereis significado","hubieren significado","significando","signifying","significado","signified"]
["significar","to signify, mean","Subjuntivo","Subjunctive","Pluscuamperfecto","Past Perfect","I had signified","hubiera significado","hubieras significado","hubiera significado","hubiéramos significado","hubierais significado","hubieran significado","significando","signifying","significado","signified"]
["soler","to be accustomed to, be accustomed to","Imperativo Afirmativo","Imperative Affirmative","Presente","Present","Be accustomed to! Don't be accustomed to!",null,"suele","soled",null,"suela","suelan","soliendo","being accustomed to","solido","accustomed to"]
["soler","to be accustomed to, be accustomed to","Imperativo Negativo","Imperative Negative","Presente","Present","Be accustomed to! Don't be accustomed to!",null,"no suelas","no soláis",null,"no suela","no suelan","soliendo","being accustomed to","solido","accustomed to"]
["soler","to be accustomed to, be accustomed to","Indicativo","Indicative","Presente","Present","I am accustomed to","suelo","sueles","suele","solemos","soléis","suelen","soliendo","being accustomed to","solido","accustomed to"]
["soler","to be accustomed to, be accustomed to","Indicativo","Indicative","Futuro","Future","I will be accustomed to","soleré","solerás","solerá","soleremos","soleréis","solerán","soliendo","being accustomed to","solido","accustomed to"]
["soler","to be accustomed to, be accustomed to","Indicativo","Indicative","Imperfecto","Imperfect","I was accustomed to","solía","solías","solía","solíamos","solíais","solían","soliendo","being accustomed to","solido","accustomed to"]
["soler","to be accustomed to, be accustomed to","Indicativo","Indicative","Pretérito","Preterite","I was accustomed to","solí","soliste","solió","solimos","solisteis","solieron","soliendo","being accustomed to","solido","accustomed to"]
["soler","to be accustomed to, be accustomed to","Indicativo","Indicative","Condicional","Conditional","I would be accustomed to","solería","solerías","solería","soleríamos","soleríais","solerían","soliendo","being accustomed to","solido","accustomed to"]
["soler","to be accustomed to, be accustomed to","Indicativo","Indicative","Presente perfecto","Present Perfect","I have been accustomed to","he solido","has solido","ha solido","hemos solido","habéis solido","han solido","soliendo","being accustomed to","solido","accustomed to"]
["soler","to be accustomed to, be accustomed to","Indicativo","Indicative","Futuro perfecto","Future Perfect","I will have been accustomed to","habré solido","habrás solido","habrá solido","habremos solido","habréis solido","habrán solido","soliendo","being accustomed to","solido","accustomed to"]
["soler","to be accustomed to, be accustomed to","Indicativo","Indicative","Pluscuamperfecto","Past Perfect","I had been accustomed to","había solido","habías solido","había solido","habíamos solido","habíais solido","habían solido","soliendo","being accustomed to","solido","accustomed to"]
["soler","to be accustomed to, be accustomed to","Indicativo","Indicative","Pretérito anterior","Preterite (Archaic)","I had been accustomed to","hube solido","hubiste solido","hubo solido","hubimos solido","hubisteis solido","hubieron solido","soliendo","being accustomed to","solido","accustomed to"]
["soler","to be accustomed to, be accustomed to","Indicativo","Indicative","Condicional perfecto","Conditional Perfect","I would have been accustomed to","habría solido","habrías solido","habría solido","habríamos solido","habríais solido","habrían solido","soliendo","being accustomed to","solido","accustomed to"]
["soler","to be accustomed to, be accustomed to","Subjuntivo","Subjunctive","Futuro","Future","I will be accustomed to","soliere","solieres","soliere","soliéremos","soliereis","solieren","soliendo","being accustomed to","solido","accustomed to"]
["soler","to be accustomed to, be accustomed to","Subjuntivo","Subjunctive","Presente","Present","I am accustomed to","suela","suelas","suela","solamos","soláis","suelan","soliendo","being accustomed to","solido","accustomed to"]
["soler","to be accustomed to, be accustomed to","Subjuntivo","Subjunctive","Imperfecto","Imperfect","I was accustomed to","soliera","solieras","soliera","soliéramos","solierais","solieran","soliendo","being accustomed to","solido","accustomed to"]
["soler","to be accustomed to, be accustomed to","Subjuntivo","Subjunctive","Presente perfecto","Present Perfect","I have been accustomed to, was accustomed to","haya solido","hayas solido","haya solido","hayamos solido","hayáis solido","hayan solido","soliendo","being accustomed to","solido","accustomed to"]
["soler","to be accustomed to, be accustomed to","Subjuntivo","Subjunctive","Futuro perfecto","Future Perfect","I will have been accustomed to","hubiere solido","hubieres solido","hubiere solido","hubiéremos solido","hubiereis solido","hubieren solido","soliendo","being accustomed to","solido","accustomed to"]
["soler","to be accustomed to, be accustomed to","Subjuntivo","Subjunctive","Pluscuamperfecto","Past Perfect","I had been accustomed to","hubiera solido","hubieras solido","hubiera solido","hubiéramos solido","hubierais solido","hubieran solido","soliendo","being accustomed to","solido","accustomed to"]
["subir","to go up, rise, move up, climb; to lift up, raise up","Imperativo Afirmativo","Imperative Affirmative","Presente","Present","Go up! Don't go up!",null,"sube","subid",null,"suba","suban","subiendo","going up","subido","went up"]
["subir","to go up, rise, move up, climb; to lift up, raise up","Imperativo Negativo","Imperative Negative","Presente","Present","Go up! Don't go up!",null,"no subas","no subáis",null,"no suba","no suban","subiendo","going up","subido","went up"]
["subir","to go up, rise, move up, climb; to lift up, raise up","Indicativo","Indicative","Presente","Present","I go up, am going up","subo","subes","sube","subimos","subís","suben","subiendo","going up","subido","went up"]
["subir","to go up, rise, move up, climb; to lift up, raise up","Indicativo","Indicative","Futuro","Future","I will go up","subiré","subirás","subirá","subiremos","subiréis","subirán","subiendo","going up","subido","went up"]
["subir","to go up, rise, move up, climb; to lift up, raise up","Indicativo","Indicative","Imperfecto","Imperfect","I was going up, used to go up, went up","subía","subías","subía","subíamos","subíais","subían","subiendo","going up","subido","went up"]
["subir","to go up, rise, move up, climb; to lift up, raise up","Indicativo","Indicative","Pretérito","Preterite","I went up","subí","subiste","subió","subimos","subisteis","subieron","subiendo","going up","subido","went up"]
["subir","to go up, rise, move up, climb; to lift up, raise up","Indicativo","Indicative","Condicional","Conditional","I would go up","subiría","subirías","subiría","subiríamos","subiríais","subirían","subiendo","going up","subido","went up"]
["subir","to go up, rise, move up, climb; to lift up, raise up","Indicativo","Indicative","Presente perfecto","Present Perfect","I have gone up","he subido","has subido","ha subido","hemos subido","habéis subido","han subido","subiendo","going up","subido","went up"]
["subir","to go up, rise, move up, climb; to lift up, raise up","Indicativo","Indicative","Futuro perfecto","Future Perfect","I will have gone up","habré subido","habrás subido","habrá subido","habremos subido","habréis subido","habrán subido","subiendo","going up","subido","went up"]
["subir","to go up, rise, move up, climb; to lift up, raise up","Indicativo","Indicative","Pluscuamperfecto","Past Perfect","I had gone up","había subido","habías subido","había subido","habíamos subido","habíais subido","habían subido","subiendo","going up","subido","went up"]
["subir","to go up, rise, move up, climb; to lift up, raise up","Indicativo","Indicative","Pretérito anterior","Preterite (Archaic)","I had gone up","hube subido","hubiste subido","hubo subido","hubimos subido","hubisteis subido","hubieron subido","subiendo","going up","subido","went up"]
["subir","to go up, rise, move up, climb; to lift up, raise up","Indicativo","Indicative","Condicional perfecto","Conditional Perfect","I would have gone up","habría subido","habrías subido","habría subido","habríamos subido","habríais subido","habrían subido","subiendo","going up","subido","went up"]
["subir","to go up, rise, move up, climb; to lift up, raise up","Subjuntivo","Subjunctive","Presente","Present","I go up, am going up","suba","subas","suba","subamos","subáis","suban","subiendo","going up","subido","went up"]
["subir","to go up, rise, move up, climb; to lift up, raise up","Subjuntivo","Subjunctive","Imperfecto","Imperfect","I went up, was going up","subiera","subieras","subiera","subiéramos","subierais","subieran","subiendo","going up","subido","went up"]
["subir","to go up, rise, move up, climb; to lift up, raise up","Subjuntivo","Subjunctive","Futuro","Future","I will go up","subiere","subieres","subiere","subiéremos","subiereis","subieren","subiendo","going up","subido","went up"]
["subir","to go up, rise, move up, climb; to lift up, raise up","Subjuntivo","Subjunctive","Presente perfecto","Present Perfect","I have gone up, went up","haya subido","hayas subido","haya subido","hayamos subido","hayáis subido","hayan subido","subiendo","going up","subido","went up"]
["subir","to go up, rise, move up, climb; to lift up, raise up","Subjuntivo","Subjunctive","Futuro perfecto","Future Perfect","I will have gone up","hubiere subido","hubieres subido","hubiere subido","hubiéremos subido","hubiereis subido","hubieren subido","subiendo","going up","subido","went up"]
["subir","to go up, rise, move up, climb; to lift up, raise up","Subjuntivo","Subjunctive","Pluscuamperfecto","Past Perfect","I had gone up","hubiera subido","hubieras subido","hubiera subido","hubiéramos subido","hubierais subido","hubieran subido","subiendo","going up","subido","went up"]
["suceder","to happen; to succeed, follow","Imperativo Afirmativo","Imperative Affirmative","Presente","Present","Happen! Don't happen!",null,"sucede","suceded",null,"suceda","sucedan","sucediendo","happening","sucedido","happened"]
["suceder","to happen; to succeed, follow","Imperativo Negativo","Imperative Negative","Presente","Present","Happen! Don't happen!",null,"no sucedas","no sucedáis",null,"no suceda","no sucedan","sucediendo","happening","sucedido","happened"]
["suceder","to happen; to succeed, follow","Indicativo","Indicative","Presente","Present","I happen, am happening","sucedo","sucedes","sucede","sucedemos","sucedéis","suceden","sucediendo","happening","sucedido","happened"]
["suceder","to happen; to succeed, follow","Indicativo","Indicative","Futuro","Future","I will happen","sucederé","sucederás","sucederá","sucederemos","sucederéis","sucederán","sucediendo","happening","sucedido","happened"]
["suceder","to happen; to succeed, follow","Indicativo","Indicative","Imperfecto","Imperfect","I was happening, used to happen, happened","sucedía","sucedías","sucedía","sucedíamos","sucedíais","sucedían","sucediendo","happening","sucedido","happened"]
["suceder","to happen; to succeed, follow","Indicativo","Indicative","Pretérito","Preterite","I happened","sucedí","sucediste","sucedió","sucedimos","sucedisteis","sucedieron","sucediendo","happening","sucedido","happened"]
["suceder","to happen; to succeed, follow","Indicativo","Indicative","Condicional","Conditional","I would happen","sucedería","sucederías","sucedería","sucederíamos","sucederíais","sucederían","sucediendo","happening","sucedido","happened"]
["suceder","to happen; to succeed, follow","Indicativo","Indicative","Presente perfecto","Present Perfect","I have happened","he sucedido","has sucedido","ha sucedido","hemos sucedido","habéis sucedido","han sucedido","sucediendo","happening","sucedido","happened"]
["suceder","to happen; to succeed, follow","Indicativo","Indicative","Futuro perfecto","Future Perfect","I will have happened","habré sucedido","habrás sucedido","habrá sucedido","habremos sucedido","habréis sucedido","habrán sucedido","sucediendo","happening","sucedido","happened"]
["suceder","to happen; to succeed, follow","Indicativo","Indicative","Pluscuamperfecto","Past Perfect","I had happened","había sucedido","habías sucedido","había sucedido","habíamos sucedido","habíais sucedido","habían sucedido","sucediendo","happening","sucedido","happened"]
["suceder","to happen; to succeed, follow","Indicativo","Indicative","Pretérito anterior","Preterite (Archaic)","I had happened","hube sucedido","hubiste sucedido","hubo sucedido","hubimos sucedido","hubisteis sucedido","hubieron sucedido","sucediendo","happening","sucedido","happened"]
["suceder","to happen; to succeed, follow","Indicativo","Indicative","Condicional perfecto","Conditional Perfect","I would have happened","habría sucedido","habrías sucedido","habría sucedido","habríamos sucedido","habríais sucedido","habrían sucedido","sucediendo","happening","sucedido","happened"]
["suceder","to happen; to succeed, follow","Subjuntivo","Subjunctive","Presente","Present","I happen, am happening","suceda","sucedas","suceda","sucedamos","sucedáis","sucedan","sucediendo","happening","sucedido","happened"]
["suceder","to happen; to succeed, follow","Subjuntivo","Subjunctive","Imperfecto","Imperfect","I happened, was happening","sucediera","sucedieras","sucediera","sucediéramos","sucedierais","sucedieran","sucediendo","happening","sucedido","happened"]
["suceder","to happen; to succeed, follow","Subjuntivo","Subjunctive","Futuro","Future","I will happen","sucediere","sucedieres","sucediere","sucediéremos","sucediereis","sucedieren","sucediendo","happening","sucedido","happened"]
["suceder","to happen; to succeed, follow","Subjuntivo","Subjunctive","Presente perfecto","Present Perfect","I have happened, happened","haya sucedido","hayas sucedido","haya sucedido","hayamos sucedido","hayáis sucedido","hayan sucedido","sucediendo","happening","sucedido","happened"]
["suceder","to happen; to succeed, follow","Subjuntivo","Subjunctive","Futuro perfecto","Future Perfect","I will have happened","hubiere sucedido","hubieres sucedido","hubiere sucedido","hubiéremos sucedido","hubiereis sucedido","hubieren sucedido","sucediendo","happening","sucedido","happened"]
["suceder","to happen; to succeed, follow","Subjuntivo","Subjunctive","Pluscuamperfecto","Past Perfect","I had happened","hubiera sucedido","hubieras sucedido","hubiera sucedido","hubiéramos sucedido","hubierais sucedido","hubieran sucedido","sucediendo","happening","sucedido","happened"]
["sufrir","to suffer; to undergo, experience, put up with","Imperativo Afirmativo","Imperative Affirmative","Presente","Present","Suffer! Don't suffer!",null,"sufre","sufrid",null,"sufra","sufran","sufriendo","suffering","sufrido","suffered"]
["sufrir","to suffer; to undergo, experience, put up with","Imperativo Negativo","Imperative Negative","Presente","Present","Suffer! Don't suffer!",null,"no sufras","no sufráis",null,"no sufra","no sufran","sufriendo","suffering","sufrido","suffered"]
["sufrir","to suffer; to undergo, experience, put up with","Indicativo","Indicative","Presente","Present","I suffer, am suffering","sufro","sufres","sufre","sufrimos","sufrís","sufren","sufriendo","suffering","sufrido","suffered"]
["sufrir","to suffer; to undergo, experience, put up with","Indicativo","Indicative","Futuro","Future","I will suffer","sufriré","sufrirás","sufrirá","sufriremos","sufriréis","sufrirán","sufriendo","suffering","sufrido","suffered"]
["sufrir","to suffer; to undergo, experience, put up with","Indicativo","Indicative","Imperfecto","Imperfect","I was suffering, used to suffer, suffered","sufría","sufrías","sufría","sufríamos","sufríais","sufrían","sufriendo","suffering","sufrido","suffered"]
["sufrir","to suffer; to undergo, experience, put up with","Indicativo","Indicative","Pretérito","Preterite","I suffered","sufrí","sufriste","sufrió","sufrimos","sufristeis","sufrieron","sufriendo","suffering","sufrido","suffered"]
["sufrir","to suffer; to undergo, experience, put up with","Indicativo","Indicative","Condicional","Conditional","I would suffer","sufriría","sufrirías","sufriría","sufriríamos","sufriríais","sufrirían","sufriendo","suffering","sufrido","suffered"]
["sufrir","to suffer; to undergo, experience, put up with","Indicativo","Indicative","Presente perfecto","Present Perfect","I have suffered","he sufrido","has sufrido","ha sufrido","hemos sufrido","habéis sufrido","han sufrido","sufriendo","suffering","sufrido","suffered"]
["sufrir","to suffer; to undergo, experience, put up with","Indicativo","Indicative","Futuro perfecto","Future Perfect","I will have suffered","habré sufrido","habrás sufrido","habrá sufrido","habremos sufrido","habréis sufrido","habrán sufrido","sufriendo","suffering","sufrido","suffered"]
["sufrir","to suffer; to undergo, experience, put up with","Indicativo","Indicative","Pluscuamperfecto","Past Perfect","I had suffered","había sufrido","habías sufrido","había sufrido","habíamos sufrido","habíais sufrido","habían sufrido","sufriendo","suffering","sufrido","suffered"]
["sufrir","to suffer; to undergo, experience, put up with","Indicativo","Indicative","Pretérito anterior","Preterite (Archaic)","I had suffered","hube sufrido","hubiste sufrido","hubo sufrido","hubimos sufrido","hubisteis sufrido","hubieron sufrido","sufriendo","suffering","sufrido","suffered"]
["sufrir","to suffer; to undergo, experience, put up with","Indicativo","Indicative","Condicional perfecto","Conditional Perfect","I would have suffered","habría sufrido","habrías sufrido","habría sufrido","habríamos sufrido","habríais sufrido","habrían sufrido","sufriendo","suffering","sufrido","suffered"]
["sufrir","to suffer; to undergo, experience, put up with","Subjuntivo","Subjunctive","Presente","Present","I suffer, am suffering","sufra","sufras","sufra","suframos","sufráis","sufran","sufriendo","suffering","sufrido","suffered"]
["sufrir","to suffer; to undergo, experience, put up with","Subjuntivo","Subjunctive","Imperfecto","Imperfect","I suffered, was suffering","sufriera","sufrieras","sufriera","sufriéramos","sufrierais","sufrieran","sufriendo","suffering","sufrido","suffered"]
["sufrir","to suffer; to undergo, experience, put up with","Subjuntivo","Subjunctive","Futuro","Future","I will suffer","sufriere","sufrieres","sufriere","sufriéremos","sufriereis","sufrieren","sufriendo","suffering","sufrido","suffered"]
["sufrir","to suffer; to undergo, experience, put up with","Subjuntivo","Subjunctive","Presente perfecto","Present Perfect","I have suffered, suffered","haya sufrido","hayas sufrido","haya sufrido","hayamos sufrido","hayáis sufrido","hayan sufrido","sufriendo","suffering","sufrido","suffered"]
["sufrir","to suffer; to undergo, experience, put up with","Subjuntivo","Subjunctive","Futuro perfecto","Future Perfect","I will have suffered","hubiere sufrido","hubieres sufrido","hubiere sufrido","hubiéremos sufrido","hubiereis sufrido","hubieren sufrido","sufriendo","suffering","sufrido","suffered"]
["sufrir","to suffer; to undergo, experience, put up with","Subjuntivo","Subjunctive","Pluscuamperfecto","Past Perfect","I had suffered","hubiera sufrido","hubieras sufrido","hubiera sufrido","hubiéramos sufrido","hubierais sufrido","hubieran sufrido","sufriendo","suffering","sufrido","suffered"]
["suponer","to suppose","Imperativo Afirmativo","Imperative Affirmative","Presente","Present","Suppose! Don't suppose!",null,"supón","suponed",null,"suponga","supongan","suponiendo","supposing","supuesto","supposed"]
["suponer","to suppose","Imperativo Negativo","Imperative Negative","Presente","Present","Suppose! Don't suppose!",null,"no supongas","no supongáis",null,"no suponga","no supongan","suponiendo","supposing","supuesto","supposed"]
["suponer","to suppose","Indicativo","Indicative","Presente","Present","I suppose, am supposing","supongo","supones","supone","suponemos","suponéis","suponen","suponiendo","supposing","supuesto","supposed"]
["suponer","to suppose","Indicativo","Indicative","Futuro","Future","I will suppose","supondré","supondrás","supondrá","supondremos","supondréis","supondrán","suponiendo","supposing","supuesto","supposed"]
["suponer","to suppose","Indicativo","Indicative","Imperfecto","Imperfect","I was supposing, used to suppose, supposed","suponía","suponías","suponía","suponíamos","suponíais","suponían","suponiendo","supposing","supuesto","supposed"]
["suponer","to suppose","Indicativo","Indicative","Pretérito","Preterite","I supposed","supuse","supusiste","supuso","supusimos","supusisteis","supusieron","suponiendo","supposing","supuesto","supposed"]
["suponer","to suppose","Indicativo","Indicative","Condicional","Conditional","I would suppose","supondría","supondrías","supondría","supondríamos","supondríais","supondrían","suponiendo","supposing","supuesto","supposed"]
["suponer","to suppose","Indicativo","Indicative","Presente perfecto","Present Perfect","I have supposed","he supuesto","has supuesto","ha supuesto","hemos supuesto","habéis supuesto","han supuesto","suponiendo","supposing","supuesto","supposed"]
["suponer","to suppose","Indicativo","Indicative","Futuro perfecto","Future Perfect","I will have supposed","habré supuesto","habrás supuesto","habrá supuesto","habremos supuesto","habréis supuesto","habrán supuesto","suponiendo","supposing","supuesto","supposed"]
["suponer","to suppose","Indicativo","Indicative","Pluscuamperfecto","Past Perfect","I had supposed","había supuesto","habías supuesto","había supuesto","habíamos supuesto","habíais supuesto","habían supuesto","suponiendo","supposing","supuesto","supposed"]
["suponer","to suppose","Indicativo","Indicative","Pretérito anterior","Preterite (Archaic)","I had supposed","hube supuesto","hubiste supuesto","hubo supuesto","hubimos supuesto","hubisteis supuesto","hubieron supuesto","suponiendo","supposing","supuesto","supposed"]
["suponer","to suppose","Indicativo","Indicative","Condicional perfecto","Conditional Perfect","I would have supposed","habría supuesto","habrías supuesto","habría supuesto","habríamos supuesto","habríais supuesto","habrían supuesto","suponiendo","supposing","supuesto","supposed"]
["suponer","to suppose","Subjuntivo","Subjunctive","Presente","Present","I suppose, am supposing","suponga","supongas","suponga","supongamos","supongáis","supongan","suponiendo","supposing","supuesto","supposed"]
["suponer","to suppose","Subjuntivo","Subjunctive","Imperfecto","Imperfect","I supposed, was supposing","supusiera","supusieras","supusiera","supusiéramos","supusierais","supusieran","suponiendo","supposing","supuesto","supposed"]
["suponer","to suppose","Subjuntivo","Subjunctive","Futuro","Future","I will suppose","supusiere","supusieres","supusiere","supusiéremos","supusiereis","supusieren","suponiendo","supposing","supuesto","supposed"]
["suponer","to suppose","Subjuntivo","Subjunctive","Presente perfecto","Present Perfect","I have supposed, supposed","haya supuesto","hayas supuesto","haya supuesto","hayamos supuesto","hayáis supuesto","hayan supuesto","suponiendo","supposing","supuesto","supposed"]
["suponer","to suppose","Subjuntivo","Subjunctive","Futuro perfecto","Future Perfect","I will have supposed","hubiere supuesto","hubieres supuesto","hubiere supuesto","hubiéremos supuesto","hubiereis supuesto","hubieren supuesto","suponiendo","supposing","supuesto","supposed"]
["suponer","to suppose","Subjuntivo","Subjunctive","Pluscuamperfecto","Past Perfect","I had supposed","hubiera supuesto","hubieras supuesto","hubiera supuesto","hubiéramos supuesto","hubierais supuesto","hubieran supuesto","suponiendo","supposing","supuesto","supposed"]
["surgir","to arise, emerge, spring up, come out, appear","Imperativo Afirmativo","Imperative Affirmative","Presente","Present","Arise! Don't arise!",null,"surge","surgid",null,"surja","surjan","surgiendo","arising","surgido","arisen"]
["surgir","to arise, emerge, spring up, come out, appear","Imperativo Negativo","Imperative Negative","Presente","Present","Arise! Don't arise!",null,"no surjas","no surjáis",null,"no surja","no surjan","surgiendo","arising","surgido","arisen"]
["surgir","to arise, emerge, spring up, come out, appear","Indicativo","Indicative","Presente","Present","I arise, am arising","surjo","surges","surge","surgimos","surgís","surgen","surgiendo","arising","surgido","arisen"]
["surgir","to arise, emerge, spring up, come out, appear","Indicativo","Indicative","Futuro","Future","I will arise","surgiré","surgirás","surgirá","surgiremos","surgiréis","surgirán","surgiendo","arising","surgido","arisen"]
["surgir","to arise, emerge, spring up, come out, appear","Indicativo","Indicative","Imperfecto","Imperfect","I was arising, used to arise, arose","surgía","surgías","surgía","surgíamos","surgíais","surgían","surgiendo","arising","surgido","arisen"]
["surgir","to arise, emerge, spring up, come out, appear","Indicativo","Indicative","Pretérito","Preterite","I arose","surgí","surgiste","surgió","surgimos","surgisteis","surgieron","surgiendo","arising","surgido","arisen"]
["surgir","to arise, emerge, spring up, come out, appear","Indicativo","Indicative","Condicional","Conditional","I would arise","surgiría","surgirías","surgiría","surgiríamos","surgiríais","surgirían","surgiendo","arising","surgido","arisen"]
["surgir","to arise, emerge, spring up, come out, appear","Indicativo","Indicative","Presente perfecto","Present Perfect","I have arisen","he surgido","has surgido","ha surgido","hemos surgido","habéis surgido","han surgido","surgiendo","arising","surgido","arisen"]
["surgir","to arise, emerge, spring up, come out, appear","Indicativo","Indicative","Futuro perfecto","Future Perfect","I will have arisen","habré surgido","habrás surgido","habrá surgido","habremos surgido","habréis surgido","habrán surgido","surgiendo","arising","surgido","arisen"]
["surgir","to arise, emerge, spring up, come out, appear","Indicativo","Indicative","Pluscuamperfecto","Past Perfect","I had arisen","había surgido","habías surgido","había surgido","habíamos surgido","habíais surgido","habían surgido","surgiendo","arising","surgido","arisen"]
["surgir","to arise, emerge, spring up, come out, appear","Indicativo","Indicative","Pretérito anterior","Preterite (Archaic)","I had arisen","hube surgido","hubiste surgido","hubo surgido","hubimos surgido","hubisteis surgido","hubieron surgido","surgiendo","arising","surgido","arisen"]
["surgir","to arise, emerge, spring up, come out, appear","Indicativo","Indicative","Condicional perfecto","Conditional Perfect","I would have arisen","habría surgido","habrías surgido","habría surgido","habríamos surgido","habríais surgido","habrían surgido","surgiendo","arising","surgido","arisen"]
["surgir","to arise, emerge, spring up, come out, appear","Subjuntivo","Subjunctive","Presente","Present","I arise, am arising","surja","surjas","surja","surjamos","surjáis","surjan","surgiendo","arising","surgido","arisen"]
["surgir","to arise, emerge, spring up, come out, appear","Subjuntivo","Subjunctive","Imperfecto","Imperfect","I arose, was arising","surgiera","surgieras","surgiera","surgiéramos","surgierais","surgieran","surgiendo","arising","surgido","arisen"]
["surgir","to arise, emerge, spring up, come out, appear","Subjuntivo","Subjunctive","Futuro","Future","I will arise","surgiere","surgieres","surgiere","surgiéremos","surgiereis","surgieren","surgiendo","arising","surgido","arisen"]
["surgir","to arise, emerge, spring up, come out, appear","Subjuntivo","Subjunctive","Presente perfecto","Present Perfect","I have arisen, arose","haya surgido","hayas surgido","haya surgido","hayamos surgido","hayáis surgido","hayan surgido","surgiendo","arising","surgido","arisen"]
["surgir","to arise, emerge, spring up, come out, appear","Subjuntivo","Subjunctive","Futuro perfecto","Future Perfect","I will have arisen","hubiere surgido","hubieres surgido","hubiere surgido","hubiéremos surgido","hubiereis surgido","hubieren surgido","surgiendo","arising","surgido","arisen"]
["surgir","to arise, emerge, spring up, come out, appear","Subjuntivo","Subjunctive","Pluscuamperfecto","Past Perfect","I had arisen","hubiera surgido","hubieras surgido","hubiera surgido","hubiéramos surgido","hubierais surgido","hubieran surgido","surgiendo","arising","surgido","arisen"]
["tener","to have","Imperativo Afirmativo","Imperative Affirmative","Presente","Present","Have! Don't have!",null,"ten","tened",null,"tenga","tengan","teniendo","having","tenido","had"]
["tener","to have","Imperativo Negativo","Imperative Negative","Presente","Present","Have! Don't have!",null,"no tengas","no tengáis",null,"no tenga","no tengan","teniendo","having","tenido","had"]
["tener","to have","Indicativo","Indicative","Presente","Present","I have, am having","tengo","tienes","tiene","tenemos","tenéis","tienen","teniendo","having","tenido","had"]
["tener","to have","Indicativo","Indicative","Futuro","Future","I will have","tendré","tendrás","tendrá","tendremos","tendréis","tendrán","teniendo","having","tenido","had"]
["tener","to have","Indicativo","Indicative","Imperfecto","Imperfect","I was having, used to have, had","tenía","tenías","tenía","teníamos","teníais","tenían","teniendo","having","tenido","had"]
["tener","to have","Indicativo","Indicative","Pretérito","Preterite","I had","tuve","tuviste","tuvo","tuvimos","tuvisteis","tuvieron","teniendo","having","tenido","had"]
["tener","to have","Indicativo","Indicative","Condicional","Conditional","I would have","tendría","tendrías","tendría","tendríamos","tendríais","tendrían","teniendo","having","tenido","had"]
["tener","to have","Indicativo","Indicative","Presente perfecto","Present Perfect","I have had","he tenido","has tenido","ha tenido","hemos tenido","habéis tenido","han tenido","teniendo","having","tenido","had"]
["tener","to have","Indicativo","Indicative","Futuro perfecto","Future Perfect","I will have had","habré tenido","habrás tenido","habrá tenido","habremos tenido","habréis tenido","habrán tenido","teniendo","having","tenido","had"]
["tener","to have","Indicativo","Indicative","Pluscuamperfecto","Past Perfect","I had had","había tenido","habías tenido","había tenido","habíamos tenido","habíais tenido","habían tenido","teniendo","having","tenido","had"]
["tener","to have","Indicativo","Indicative","Pretérito anterior","Preterite (Archaic)","I had had","hube tenido","hubiste tenido","hubo tenido","hubimos tenido","hubisteis tenido","hubieron tenido","teniendo","having","tenido","had"]
["tener","to have","Indicativo","Indicative","Condicional perfecto","Conditional Perfect","I would have had","habría tenido","habrías tenido","habría tenido","habríamos tenido","habríais tenido","habrían tenido","teniendo","having","tenido","had"]
["tener","to have","Subjuntivo","Subjunctive","Presente","Present","I have, am having","tenga","tengas","tenga","tengamos","tengáis","tengan","teniendo","having","tenido","had"]
["tener","to have","Subjuntivo","Subjunctive","Imperfecto","Imperfect","I had, was having","tuviera","tuvieras","tuviera","tuviéramos","tuvierais","tuvieran","teniendo","having","tenido","had"]
["tener","to have","Subjuntivo","Subjunctive","Futuro","Future","I will have","tuviere","tuvieres","tuviere","tuviéremos","tuviereis","tuvieren","teniendo","having","tenido","had"]
["tener","to have","Subjuntivo","Subjunctive","Presente perfecto","Present Perfect","I have had, had","haya tenido","hayas tenido","haya tenido","hayamos tenido","hayáis tenido","hayan tenido","teniendo","having","tenido","had"]
["tener","to have","Subjuntivo","Subjunctive","Futuro perfecto","Future Perfect","I will have had","hubiere tenido","hubieres tenido","hubiere tenido","hubiéremos tenido","hubiereis tenido","hubieren tenido","teniendo","having","tenido","had"]
["tener","to have","Subjuntivo","Subjunctive","Pluscuamperfecto","Past Perfect","I had had","hubiera tenido","hubieras tenido","hubiera tenido","hubiéramos tenido","hubierais tenido","hubieran tenido","teniendo","having","tenido","had"]
["terminar","to finish, end","Imperativo Afirmativo","Imperative Affirmative","Presente","Present","Finish! Don't finish!",null,"termina","terminad",null,"termine","terminen","terminando","finishing","terminado","finished"]
["terminar","to finish, end","Imperativo Negativo","Imperative Negative","Presente","Present","Finish! Don't finish!",null,"no termines","no terminéis",null,"no termine","no terminen","terminando","finishing","terminado","finished"]
["terminar","to finish, end","Indicativo","Indicative","Presente","Present","I finish, am finishing","termino","terminas","termina","terminamos","termináis","terminan","terminando","finishing","terminado","finished"]
["terminar","to finish, end","Indicativo","Indicative","Futuro","Future","I will finish","terminaré","terminarás","terminará","terminaremos","terminaréis","terminarán","terminando","finishing","terminado","finished"]
["terminar","to finish, end","Indicativo","Indicative","Imperfecto","Imperfect","I was finishing, used to finish, finished","terminaba","terminabas","terminaba","terminábamos","terminabais","terminaban","terminando","finishing","terminado","finished"]
["terminar","to finish, end","Indicativo","Indicative","Pretérito","Preterite","I finished","terminé","terminaste","terminó","terminamos","terminasteis","terminaron","terminando","finishing","terminado","finished"]
["terminar","to finish, end","Indicativo","Indicative","Condicional","Conditional","I would finish","terminaría","terminarías","terminaría","terminaríamos","terminaríais","terminarían","terminando","finishing","terminado","finished"]
["terminar","to finish, end","Indicativo","Indicative","Presente perfecto","Present Perfect","I have finished","he terminado","has terminado","ha terminado","hemos terminado","habéis terminado","han terminado","terminando","finishing","terminado","finished"]
["terminar","to finish, end","Indicativo","Indicative","Futuro perfecto","Future Perfect","I will have finished","habré terminado","habrás terminado","habrá terminado","habremos terminado","habréis terminado","habrán terminado","terminando","finishing","terminado","finished"]
["terminar","to finish, end","Indicativo","Indicative","Pluscuamperfecto","Past Perfect","I had finished","había terminado","habías terminado","había terminado","habíamos terminado","habíais terminado","habían terminado","terminando","finishing","terminado","finished"]
["terminar","to finish, end","Indicativo","Indicative","Pretérito anterior","Preterite (Archaic)","I had finished","hube terminado","hubiste terminado","hubo terminado","hubimos terminado","hubisteis terminado","hubieron terminado","terminando","finishing","terminado","finished"]
["terminar","to finish, end","Indicativo","Indicative","Condicional perfecto","Conditional Perfect","I would have finished","habría terminado","habrías terminado","habría terminado","habríamos terminado","habríais terminado","habrían terminado","terminando","finishing","terminado","finished"]
["terminar","to finish, end","Subjuntivo","Subjunctive","Presente","Present","I finish, am finishing","termine","termines","termine","terminemos","terminéis","terminen","terminando","finishing","terminado","finished"]
["terminar","to finish, end","Subjuntivo","Subjunctive","Imperfecto","Imperfect","I finished, was finishing","terminara","terminaras","terminara","termináramos","terminarais","terminaran","terminando","finishing","terminado","finished"]
["terminar","to finish, end","Subjuntivo","Subjunctive","Futuro","Future","I will finish","terminare","terminares","terminare","termináremos","terminareis","terminaren","terminando","finishing","terminado","finished"]
["terminar","to finish, end","Subjuntivo","Subjunctive","Presente perfecto","Present Perfect","I have finished, finished","haya terminado","hayas terminado","haya terminado","hayamos terminado","hayáis terminado","hayan terminado","terminando","finishing","terminado","finished"]
["terminar","to finish, end","Subjuntivo","Subjunctive","Futuro perfecto","Future Perfect","I will have finished","hubiere terminado","hubieres terminado","hubiere terminado","hubiéremos terminado","hubiereis terminado","hubieren terminado","terminando","finishing","terminado","finished"]
["terminar","to finish, end","Subjuntivo","Subjunctive","Pluscuamperfecto","Past Perfect","I had finished","hubiera terminado","hubieras terminado","hubiera terminado","hubiéramos terminado","hubierais terminado","hubieran terminado","terminando","finishing","terminado","finished"]
["tirar","to throw, hurl; to shoot, fire; to throw away; to pull [out]","Imperativo Afirmativo","Imperative Affirmative","Presente","Present","Throw! Don't throw!",null,"tira","tirad",null,"tire","tiren","tirando","throwing","tirado","thrown"]
["tirar","to throw, hurl; to shoot, fire; to throw away; to pull [out]","Imperativo Negativo","Imperative Negative","Presente","Present","Throw! Don't throw!",null,"no tires","no tiréis",null,"no tire","no tiren","tirando","throwing","tirado","thrown"]
["tirar","to throw, hurl; to shoot, fire; to throw away; to pull [out]","Indicativo","Indicative","Presente","Present","I throw, am throwing","tiro","tiras","tira","tiramos","tiráis","tiran","tirando","throwing","tirado","thrown"]
["tirar","to throw, hurl; to shoot, fire; to throw away; to pull [out]","Indicativo","Indicative","Futuro","Future","I will throw","tiraré","tirarás","tirará","tiraremos","tiraréis","tirarán","tirando","throwing","tirado","thrown"]
["tirar","to throw, hurl; to shoot, fire; to throw away; to pull [out]","Indicativo","Indicative","Imperfecto","Imperfect","I was throwing, used to throw, threw","tiraba","tirabas","tiraba","tirábamos","tirabais","tiraban","tirando","throwing","tirado","thrown"]
["tirar","to throw, hurl; to shoot, fire; to throw away; to pull [out]","Indicativo","Indicative","Pretérito","Preterite","I threw","tiré","tiraste","tiró","tiramos","tirasteis","tiraron","tirando","throwing","tirado","thrown"]
["tirar","to throw, hurl; to shoot, fire; to throw away; to pull [out]","Indicativo","Indicative","Condicional","Conditional","I would throw","tiraría","tirarías","tiraría","tiraríamos","tiraríais","tirarían","tirando","throwing","tirado","thrown"]
["tirar","to throw, hurl; to shoot, fire; to throw away; to pull [out]","Indicativo","Indicative","Presente perfecto","Present Perfect","I have thrown","he tirado","has tirado","ha tirado","hemos tirado","habéis tirado","han tirado","tirando","throwing","tirado","thrown"]
["tirar","to throw, hurl; to shoot, fire; to throw away; to pull [out]","Indicativo","Indicative","Futuro perfecto","Future Perfect","I will have thrown","habré tirado","habrás tirado","habrá tirado","habremos tirado","habréis tirado","habrán tirado","tirando","throwing","tirado","thrown"]
["tirar","to throw, hurl; to shoot, fire; to throw away; to pull [out]","Indicativo","Indicative","Pluscuamperfecto","Past Perfect","I had thrown","había tirado","habías tirado","había tirado","habíamos tirado","habíais tirado","habían tirado","tirando","throwing","tirado","thrown"]
["tirar","to throw, hurl; to shoot, fire; to throw away; to pull [out]","Indicativo","Indicative","Pretérito anterior","Preterite (Archaic)","I had thrown","hube tirado","hubiste tirado","hubo tirado","hubimos tirado","hubisteis tirado","hubieron tirado","tirando","throwing","tirado","thrown"]
["tirar","to throw, hurl; to shoot, fire; to throw away; to pull [out]","Indicativo","Indicative","Condicional perfecto","Conditional Perfect","I would have thrown","habría tirado","habrías tirado","habría tirado","habríamos tirado","habríais tirado","habrían tirado","tirando","throwing","tirado","thrown"]
["tirar","to throw, hurl; to shoot, fire; to throw away; to pull [out]","Subjuntivo","Subjunctive","Presente","Present","I throw, am throwing","tire","tires","tire","tiremos","tiréis","tiren","tirando","throwing","tirado","thrown"]
["tirar","to throw, hurl; to shoot, fire; to throw away; to pull [out]","Subjuntivo","Subjunctive","Imperfecto","Imperfect","I threw, was throwing","tirara","tiraras","tirara","tiráramos","tirarais","tiraran","tirando","throwing","tirado","thrown"]
["tirar","to throw, hurl; to shoot, fire; to throw away; to pull [out]","Subjuntivo","Subjunctive","Futuro","Future","I will throw","tirare","tirares","tirare","tiráremos","tirareis","tiraren","tirando","throwing","tirado","thrown"]
["tirar","to throw, hurl; to shoot, fire; to throw away; to pull [out]","Subjuntivo","Subjunctive","Presente perfecto","Present Perfect","I have thrown, threw","haya tirado","hayas tirado","haya tirado","hayamos tirado","hayáis tirado","hayan tirado","tirando","throwing","tirado","thrown"]
["tirar","to throw, hurl; to shoot, fire; to throw away; to pull [out]","Subjuntivo","Subjunctive","Futuro perfecto","Future Perfect","I will have thrown","hubiere tirado","hubieres tirado","hubiere tirado","hubiéremos tirado","hubiereis tirado","hubieren tirado","tirando","throwing","tirado","thrown"]
["tirar","to throw, hurl; to shoot, fire; to throw away; to pull [out]","Subjuntivo","Subjunctive","Pluscuamperfecto","Past Perfect","I had thrown","hubiera tirado","hubieras tirado","hubiera tirado","hubiéramos tirado","hubierais tirado","hubieran tirado","tirando","throwing","tirado","thrown"]
["tocar","to touch; to play","Imperativo Afirmativo","Imperative Affirmative","Presente","Present","Touch! Don't touch!",null,"toca","tocad",null,"toque","toquen","tocando","touching","tocado","touched"]
["tocar","to touch; to play","Imperativo Negativo","Imperative Negative","Presente","Present","Touch! Don't touch!",null,"no toques","no toquéis",null,"no toque","no toquen","tocando","touching","tocado","touched"]
["tocar","to touch; to play","Indicativo","Indicative","Presente","Present","I touch, am touching","toco","tocas","toca","tocamos","tocáis","tocan","tocando","touching","tocado","touched"]
["tocar","to touch; to play","Indicativo","Indicative","Futuro","Future","I will touch","tocaré","tocarás","tocará","tocaremos","tocaréis","tocarán","tocando","touching","tocado","touched"]
["tocar","to touch; to play","Indicativo","Indicative","Imperfecto","Imperfect","I was touching, used to touch, touched","tocaba","tocabas","tocaba","tocábamos","tocabais","tocaban","tocando","touching","tocado","touched"]
["tocar","to touch; to play","Indicativo","Indicative","Pretérito","Preterite","I touched","toqué","tocaste","tocó","tocamos","tocasteis","tocaron","tocando","touching","tocado","touched"]
["tocar","to touch; to play","Indicativo","Indicative","Condicional","Conditional","I would touch","tocaría","tocarías","tocaría","tocaríamos","tocaríais","tocarían","tocando","touching","tocado","touched"]
["tocar","to touch; to play","Indicativo","Indicative","Presente perfecto","Present Perfect","I have touched","he tocado","has tocado","ha tocado","hemos tocado","habéis tocado","han tocado","tocando","touching","tocado","touched"]
["tocar","to touch; to play","Indicativo","Indicative","Futuro perfecto","Future Perfect","I will have touched","habré tocado","habrás tocado","habrá tocado","habremos tocado","habréis tocado","habrán tocado","tocando","touching","tocado","touched"]
["tocar","to touch; to play","Indicativo","Indicative","Pluscuamperfecto","Past Perfect","I had touched","había tocado","habías tocado","había tocado","habíamos tocado","habíais tocado","habían tocado","tocando","touching","tocado","touched"]
["tocar","to touch; to play","Indicativo","Indicative","Pretérito anterior","Preterite (Archaic)","I had touched","hube tocado","hubiste tocado","hubo tocado","hubimos tocado","hubisteis tocado","hubieron tocado","tocando","touching","tocado","touched"]
["tocar","to touch; to play","Indicativo","Indicative","Condicional perfecto","Conditional Perfect","I would have touched","habría tocado","habrías tocado","habría tocado","habríamos tocado","habríais tocado","habrían tocado","tocando","touching","tocado","touched"]
["tocar","to touch; to play","Subjuntivo","Subjunctive","Presente","Present","I touch, am touching","toque","toques","toque","toquemos","toquéis","toquen","tocando","touching","tocado","touched"]
["tocar","to touch; to play","Subjuntivo","Subjunctive","Imperfecto","Imperfect","I touched, was touching","tocara","tocaras","tocara","tocáramos","tocarais","tocaran","tocando","touching","tocado","touched"]
["tocar","to touch; to play","Subjuntivo","Subjunctive","Futuro","Future","I will touch","tocare","tocares","tocare","tocáremos","tocareis","tocaren","tocando","touching","tocado","touched"]
["tocar","to touch; to play","Subjuntivo","Subjunctive","Presente perfecto","Present Perfect","I have touched, touched","haya tocado","hayas tocado","haya tocado","hayamos tocado","hayáis tocado","hayan tocado","tocando","touching","tocado","touched"]
["tocar","to touch; to play","Subjuntivo","Subjunctive","Futuro perfecto","Future Perfect","I will have touched","hubiere tocado","hubieres tocado","hubiere tocado","hubiéremos tocado","hubiereis tocado","hubieren tocado","tocando","touching","tocado","touched"]
["tocar","to touch; to play","Subjuntivo","Subjunctive","Pluscuamperfecto","Past Perfect","I had touched","hubiera tocado","hubieras tocado","hubiera tocado","hubiéramos tocado","hubierais tocado","hubieran tocado","tocando","touching","tocado","touched"]
["tomar","to take, drink","Imperativo Afirmativo","Imperative Affirmative","Presente","Present","Take! Don't take!",null,"toma","tomad",null,"tome","tomen","tomando","taking","tomado","taken"]
["tomar","to take, drink","Imperativo Negativo","Imperative Negative","Presente","Present","Take! Don't take!",null,"no tomes","no toméis",null,"no tome","no tomen","tomando","taking","tomado","taken"]
["tomar","to take, drink","Indicativo","Indicative","Presente","Present","I take, am taking","tomo","tomas","toma","tomamos","tomáis","toman","tomando","taking","tomado","taken"]
["tomar","to take, drink","Indicativo","Indicative","Futuro","Future","I will take","tomaré","tomarás","tomará","tomaremos","tomaréis","tomarán","tomando","taking","tomado","taken"]
["tomar","to take, drink","Indicativo","Indicative","Imperfecto","Imperfect","I was taking, used to take, took","tomaba","tomabas","tomaba","tomábamos","tomabais","tomaban","tomando","taking","tomado","taken"]
["tomar","to take, drink","Indicativo","Indicative","Pretérito","Preterite","I took","tomé","tomaste","tomó","tomamos","tomasteis","tomaron","tomando","taking","tomado","taken"]
["tomar","to take, drink","Indicativo","Indicative","Condicional","Conditional","I would take","tomaría","tomarías","tomaría","tomaríamos","tomaríais","tomarían","tomando","taking","tomado","taken"]
["tomar","to take, drink","Indicativo","Indicative","Presente perfecto","Present Perfect","I have taken","he tomado","has tomado","ha tomado","hemos tomado","habéis tomado","han tomado","tomando","taking","tomado","taken"]
["tomar","to take, drink","Indicativo","Indicative","Futuro perfecto","Future Perfect","I will have taken","habré tomado","habrás tomado","habrá tomado","habremos tomado","habréis tomado","habrán tomado","tomando","taking","tomado","taken"]
["tomar","to take, drink","Indicativo","Indicative","Pluscuamperfecto","Past Perfect","I had taken","había tomado","habías tomado","había tomado","habíamos tomado","habíais tomado","habían tomado","tomando","taking","tomado","taken"]
["tomar","to take, drink","Indicativo","Indicative","Pretérito anterior","Preterite (Archaic)","I had taken","hube tomado","hubiste tomado","hubo tomado","hubimos tomado","hubisteis tomado","hubieron tomado","tomando","taking","tomado","taken"]
["tomar","to take, drink","Indicativo","Indicative","Condicional perfecto","Conditional Perfect","I would have taken","habría tomado","habrías tomado","habría tomado","habríamos tomado","habríais tomado","habrían tomado","tomando","taking","tomado","taken"]
["tomar","to take, drink","Subjuntivo","Subjunctive","Presente","Present","I take, am taking","tome","tomes","tome","tomemos","toméis","tomen","tomando","taking","tomado","taken"]
["tomar","to take, drink","Subjuntivo","Subjunctive","Imperfecto","Imperfect","I took, was taking","tomara","tomaras","tomara","tomáramos","tomarais","tomaran","tomando","taking","tomado","taken"]
["tomar","to take, drink","Subjuntivo","Subjunctive","Futuro","Future","I will take","tomare","tomares","tomare","tomáremos","tomareis","tomaren","tomando","taking","tomado","taken"]
["tomar","to take, drink","Subjuntivo","Subjunctive","Presente perfecto","Present Perfect","I have taken, took","haya tomado","hayas tomado","haya tomado","hayamos tomado","hayáis tomado","hayan tomado","tomando","taking","tomado","taken"]
["tomar","to take, drink","Subjuntivo","Subjunctive","Futuro perfecto","Future Perfect","I will have taken","hubiere tomado","hubieres tomado","hubiere tomado","hubiéremos tomado","hubiereis tomado","hubieren tomado","tomando","taking","tomado","taken"]
["tomar","to take, drink","Subjuntivo","Subjunctive","Pluscuamperfecto","Past Perfect","I had taken","hubiera tomado","hubieras tomado","hubiera tomado","hubiéramos tomado","hubierais tomado","hubieran tomado","tomando","taking","tomado","taken"]
["trabajar","to work","Imperativo Afirmativo","Imperative Affirmative","Presente","Present","Work! Don't work!",null,"trabaja","trabajad",null,"trabaje","trabajen","trabajando","working","trabajado","worked"]
["trabajar","to work","Imperativo Negativo","Imperative Negative","Presente","Present","Work! Don't work!",null,"no trabajes","no trabajéis",null,"no trabaje","no trabajen","trabajando","working","trabajado","worked"]
["trabajar","to work","Indicativo","Indicative","Presente","Present","I work, am working","trabajo","trabajas","trabaja","trabajamos","trabajáis","trabajan","trabajando","working","trabajado","worked"]
["trabajar","to work","Indicativo","Indicative","Futuro","Future","I will work","trabajaré","trabajarás","trabajará","trabajaremos","trabajaréis","trabajarán","trabajando","working","trabajado","worked"]
["trabajar","to work","Indicativo","Indicative","Imperfecto","Imperfect","I was working, used to work, worked","trabajaba","trabajabas","trabajaba","trabajábamos","trabajabais","trabajaban","trabajando","working","trabajado","worked"]
["trabajar","to work","Indicativo","Indicative","Pretérito","Preterite","I worked","trabajé","trabajaste","trabajó","trabajamos","trabajasteis","trabajaron","trabajando","working","trabajado","worked"]
["trabajar","to work","Indicativo","Indicative","Condicional","Conditional","I would work","trabajaría","trabajarías","trabajaría","trabajaríamos","trabajaríais","trabajarían","trabajando","working","trabajado","worked"]
["trabajar","to work","Indicativo","Indicative","Presente perfecto","Present Perfect","I have worked","he trabajado","has trabajado","ha trabajado","hemos trabajado","habéis trabajado","han trabajado","trabajando","working","trabajado","worked"]
["trabajar","to work","Indicativo","Indicative","Futuro perfecto","Future Perfect","I will have worked","habré trabajado","habrás trabajado","habrá trabajado","habremos trabajado","habréis trabajado","habrán trabajado","trabajando","working","trabajado","worked"]
["trabajar","to work","Indicativo","Indicative","Pluscuamperfecto","Past Perfect","I had worked","había trabajado","habías trabajado","había trabajado","habíamos trabajado","habíais trabajado","habían trabajado","trabajando","working","trabajado","worked"]
["trabajar","to work","Indicativo","Indicative","Pretérito anterior","Preterite (Archaic)","I had worked","hube trabajado","hubiste trabajado","hubo trabajado","hubimos trabajado","hubisteis trabajado","hubieron trabajado","trabajando","working","trabajado","worked"]
["trabajar","to work","Indicativo","Indicative","Condicional perfecto","Conditional Perfect","I would have worked","habría trabajado","habrías trabajado","habría trabajado","habríamos trabajado","habríais trabajado","habrían trabajado","trabajando","working","trabajado","worked"]
["trabajar","to work","Subjuntivo","Subjunctive","Presente","Present","I work, am working","trabaje","trabajes","trabaje","trabajemos","trabajéis","trabajen","trabajando","working","trabajado","worked"]
["trabajar","to work","Subjuntivo","Subjunctive","Imperfecto","Imperfect","I worked, was working","trabajara","trabajaras","trabajara","trabajáramos","trabajarais","trabajaran","trabajando","working","trabajado","worked"]
["trabajar","to work","Subjuntivo","Subjunctive","Futuro","Future","I will work","trabajare","trabajares","trabajare","trabajáremos","trabajareis","trabajaren","trabajando","working","trabajado","worked"]
["trabajar","to work","Subjuntivo","Subjunctive","Presente perfecto","Present Perfect","I have worked, worked","haya trabajado","hayas trabajado","haya trabajado","hayamos trabajado","hayáis trabajado","hayan trabajado","trabajando","working","trabajado","worked"]
["trabajar","to work","Subjuntivo","Subjunctive","Futuro perfecto","Future Perfect","I will have worked","hubiere trabajado","hubieres trabajado","hubiere trabajado","hubiéremos trabajado","hubiereis trabajado","hubieren trabajado","trabajando","working","trabajado","worked"]
["trabajar","to work","Subjuntivo","Subjunctive","Pluscuamperfecto","Past Perfect","I had worked","hubiera trabajado","hubieras trabajado","hubiera trabajado","hubiéramos trabajado","hubierais trabajado","hubieran trabajado","trabajando","working","trabajado","worked"]
["traer","to bring; to get, fetch; to carry","Imperativo Afirmativo","Imperative Affirmative","Presente","Present","Bring!, Don't bring!",null,"trae","traed",null,"traiga","traigan","trayendo","bringing","traído","brought"]
["traer","to bring; to get, fetch; to carry","Imperativo Negativo","Imperative Negative","Presente","Present","Bring!, Don't bring!",null,"no traigas","no traigáis",null,"no traiga","no traigan","trayendo","bringing","traído","brought"]
["traer","to bring; to get, fetch; to carry","Indicativo","Indicative","Presente","Present","I bring, am bringing","traigo","traes","trae","traemos","traéis","traen","trayendo","bringing","traído","brought"]
["traer","to bring; to get, fetch; to carry","Indicativo","Indicative","Futuro","Future","I will bring","traeré","traerás","traerá","traeremos","traeréis","traerán","trayendo","bringing","traído","brought"]
["traer","to bring; to get, fetch; to carry","Indicativo","Indicative","Imperfecto","Imperfect","I was bringing, used to bring, brought","traía","traías","traía","traíamos","traíais","traían","trayendo","bringing","traído","brought"]
["traer","to bring; to get, fetch; to carry","Indicativo","Indicative","Pretérito","Preterite","I brought","traje","trajiste","trajo","trajimos","trajisteis","trajeron","trayendo","bringing","traído","brought"]
["traer","to bring; to get, fetch; to carry","Indicativo","Indicative","Condicional","Conditional","I would bring","traería","traerías","traería","traeríamos","traeríais","traerían","trayendo","bringing","traído","brought"]
["traer","to bring; to get, fetch; to carry","Indicativo","Indicative","Presente perfecto","Present Perfect","I have brought","he traído","has traído","ha traído","hemos traído","habéis traído","han traído","trayendo","bringing","traído","brought"]
["traer","to bring; to get, fetch; to carry","Indicativo","Indicative","Futuro perfecto","Future Perfect","I will have brought","habré traído","habrás traído","habrá traído","habremos traído","habréis traído","habrán traído","trayendo","bringing","traído","brought"]
["traer","to bring; to get, fetch; to carry","Indicativo","Indicative","Pluscuamperfecto","Past Perfect","I had brought","había traído","habías traído","había traído","habíamos traído","habíais traído","habían traído","trayendo","bringing","traído","brought"]
["traer","to bring; to get, fetch; to carry","Indicativo","Indicative","Pretérito anterior","Preterite (Archaic)","I had brought","hube traído","hubiste traído","hubo traído","hubimos traído","hubisteis traído","hubieron traído","trayendo","bringing","traído","brought"]
["traer","to bring; to get, fetch; to carry","Indicativo","Indicative","Condicional perfecto","Conditional Perfect","I would have brought","habría traído","habrías traído","habría traído","habríamos traído","habríais traído","habrían traído","trayendo","bringing","traído","brought"]
["traer","to bring; to get, fetch; to carry","Subjuntivo","Subjunctive","Presente","Present","I bring, am bringing","traiga","traigas","traiga","traigamos","traigáis","traigan","trayendo","bringing","traído","brought"]
["traer","to bring; to get, fetch; to carry","Subjuntivo","Subjunctive","Imperfecto","Imperfect","I was bringing, brought","trajera","trajeras","trajera","trajéramos","trajerais","trajeran","trayendo","bringing","traído","brought"]
["traer","to bring; to get, fetch; to carry","Subjuntivo","Subjunctive","Futuro","Future","I will bring","trajere","trajeres","trajere","trajéremos","trajereis","trajeren","trayendo","bringing","traído","brought"]
["traer","to bring; to get, fetch; to carry","Subjuntivo","Subjunctive","Presente perfecto","Present Perfect","I have brought, brought","haya traído","hayas traído","haya traído","hayamos traído","hayáis traído","hayan traído","trayendo","bringing","traído","brought"]
["traer","to bring; to get, fetch; to carry","Subjuntivo","Subjunctive","Futuro perfecto","Future Perfect","I will have brought","hubiere traído","hubieres traído","hubiere traído","hubiéremos traído","hubiereis traído","hubieren traído","trayendo","bringing","traído","brought"]
["traer","to bring; to get, fetch; to carry","Subjuntivo","Subjunctive","Pluscuamperfecto","Past Perfect","I had brought","hubiera traído","hubieras traído","hubiera traído","hubiéramos traído","hubierais traído","hubieran traído","trayendo","bringing","traído","brought"]
["tratar","to treat, handle","Imperativo Afirmativo","Imperative Affirmative","Presente","Present","Treat! Don't treat!",null,"trata","tratad",null,"trate","traten","tratando","treating","tratado","treated"]
["tratar","to treat, handle","Imperativo Negativo","Imperative Negative","Presente","Present","Treat! Don't treat!",null,"no trates","no tratéis",null,"no trate","no traten","tratando","treating","tratado","treated"]
["tratar","to treat, handle","Indicativo","Indicative","Presente","Present","I treat, am treating","trato","tratas","trata","tratamos","tratáis","tratan","tratando","treating","tratado","treated"]
["tratar","to treat, handle","Indicativo","Indicative","Futuro","Future","I will treat","trataré","tratarás","tratará","trataremos","trataréis","tratarán","tratando","treating","tratado","treated"]
["tratar","to treat, handle","Indicativo","Indicative","Imperfecto","Imperfect","I was treating, used to treat, treated","trataba","tratabas","trataba","tratábamos","tratabais","trataban","tratando","treating","tratado","treated"]
["tratar","to treat, handle","Indicativo","Indicative","Pretérito","Preterite","I treated","traté","trataste","trató","tratamos","tratasteis","trataron","tratando","treating","tratado","treated"]
["tratar","to treat, handle","Indicativo","Indicative","Condicional","Conditional","I would treat","trataría","tratarías","trataría","trataríamos","trataríais","tratarían","tratando","treating","tratado","treated"]
["tratar","to treat, handle","Indicativo","Indicative","Presente perfecto","Present Perfect","I have treated","he tratado","has tratado","ha tratado","hemos tratado","habéis tratado","han tratado","tratando","treating","tratado","treated"]
["tratar","to treat, handle","Indicativo","Indicative","Futuro perfecto","Future Perfect","I will have treated","habré tratado","habrás tratado","habrá tratado","habremos tratado","habréis tratado","habrán tratado","tratando","treating","tratado","treated"]
["tratar","to treat, handle","Indicativo","Indicative","Pluscuamperfecto","Past Perfect","I had treated","había tratado","habías tratado","había tratado","habíamos tratado","habíais tratado","habían tratado","tratando","treating","tratado","treated"]
["tratar","to treat, handle","Indicativo","Indicative","Pretérito anterior","Preterite (Archaic)","I had treated","hube tratado","hubiste tratado","hubo tratado","hubimos tratado","hubisteis tratado","hubieron tratado","tratando","treating","tratado","treated"]
["tratar","to treat, handle","Indicativo","Indicative","Condicional perfecto","Conditional Perfect","I would have treated","habría tratado","habrías tratado","habría tratado","habríamos tratado","habríais tratado","habrían tratado","tratando","treating","tratado","treated"]
["tratar","to treat, handle","Subjuntivo","Subjunctive","Presente","Present","I treat, am treating","trate","trates","trate","tratemos","tratéis","traten","tratando","treating","tratado","treated"]
["tratar","to treat, handle","Subjuntivo","Subjunctive","Imperfecto","Imperfect","I treated, was treating","tratara","trataras","tratara","tratáramos","tratarais","trataran","tratando","treating","tratado","treated"]
["tratar","to treat, handle","Subjuntivo","Subjunctive","Futuro","Future","I will treat","tratare","tratares","tratare","tratáremos","tratareis","trataren","tratando","treating","tratado","treated"]
["tratar","to treat, handle","Subjuntivo","Subjunctive","Presente perfecto","Present Perfect","I have treated, treated","haya tratado","hayas tratado","haya tratado","hayamos tratado","hayáis tratado","hayan tratado","tratando","treating","tratado","treated"]
["tratar","to treat, handle","Subjuntivo","Subjunctive","Futuro perfecto","Future Perfect","I will have treated","hubiere tratado","hubieres tratado","hubiere tratado","hubiéremos tratado","hubiereis tratado","hubieren tratado","tratando","treating","tratado","treated"]
["tratar","to treat, handle","Subjuntivo","Subjunctive","Pluscuamperfecto","Past Perfect","I had treated","hubiera tratado","hubieras tratado","hubiera tratado","hubiéramos tratado","hubierais tratado","hubieran tratado","tratando","treating","tratado","treated"]
["usar","to use","Imperativo Afirmativo","Imperative Affirmative","Presente","Present","Use! Don't use!",null,"usa","usad",null,"use","usen","usando","using","usado","used"]
["usar","to use","Imperativo Negativo","Imperative Negative","Presente","Present","Use! Don't use!",null,"no uses","no uséis",null,"no use","no usen","usando","using","usado","used"]
["usar","to use","Indicativo","Indicative","Presente","Present","I use, am using","uso","usas","usa","usamos","usáis","usan","usando","using","usado","used"]
["usar","to use","Indicativo","Indicative","Futuro","Future","I will use","usaré","usarás","usará","usaremos","usaréis","usarán","usando","using","usado","used"]
["usar","to use","Indicativo","Indicative","Imperfecto","Imperfect","I was using, used to use, used","usaba","usabas","usaba","usábamos","usabais","usaban","usando","using","usado","used"]
["usar","to use","Indicativo","Indicative","Pretérito","Preterite","I used","usé","usaste","usó","usamos","usasteis","usaron","usando","using","usado","used"]
["usar","to use","Indicativo","Indicative","Condicional","Conditional","I would use","usaría","usarías","usaría","usaríamos","usaríais","usarían","usando","using","usado","used"]
["usar","to use","Indicativo","Indicative","Presente perfecto","Present Perfect","I have used","he usado","has usado","ha usado","hemos usado","habéis usado","han usado","usando","using","usado","used"]
["usar","to use","Indicativo","Indicative","Futuro perfecto","Future Perfect","I will have used","habré usado","habrás usado","habrá usado","habremos usado","habréis usado","habrán usado","usando","using","usado","used"]
["usar","to use","Indicativo","Indicative","Pluscuamperfecto","Past Perfect","I had used","había usado","habías usado","había usado","habíamos usado","habíais usado","habían usado","usando","using","usado","used"]
["usar","to use","Indicativo","Indicative","Pretérito anterior","Preterite (Archaic)","I had used","hube usado","hubiste usado","hubo usado","hubimos usado","hubisteis usado","hubieron usado","usando","using","usado","used"]
["usar","to use","Indicativo","Indicative","Condicional perfecto","Conditional Perfect","I would have used","habría usado","habrías usado","habría usado","habríamos usado","habríais usado","habrían usado","usando","using","usado","used"]
["usar","to use","Subjuntivo","Subjunctive","Presente","Present","I use, am using","use","uses","use","usemos","uséis","usen","usando","using","usado","used"]
["usar","to use","Subjuntivo","Subjunctive","Imperfecto","Imperfect","I used, was using","usara","usaras","usara","usáramos","usarais","usaran","usando","using","usado","used"]
["usar","to use","Subjuntivo","Subjunctive","Futuro","Future","I will use","usare","usares","usare","usáremos","usareis","usaren","usando","using","usado","used"]
["usar","to use","Subjuntivo","Subjunctive","Presente perfecto","Present Perfect","I have used, used","haya usado","hayas usado","haya usado","hayamos usado","hayáis usado","hayan usado","usando","using","usado","used"]
["usar","to use","Subjuntivo","Subjunctive","Futuro perfecto","Future Perfect","I will have used","hubiere usado","hubieres usado","hubiere usado","hubiéremos usado","hubiereis usado","hubieren usado","usando","using","usado","used"]
["usar","to use","Subjuntivo","Subjunctive","Pluscuamperfecto","Past Perfect","I had used","hubiera usado","hubieras usado","hubiera usado","hubiéramos usado","hubierais usado","hubieran usado","usando","using","usado","used"]
["utilizar","to use, utilize","Imperativo Afirmativo","Imperative Affirmative","Presente","Present","Use! Don't use!",null,"utiliza","utilizad",null,"utilice","utilicen","utilizando","using","utilizado","used"]
["utilizar","to use, utilize","Imperativo Negativo","Imperative Negative","Presente","Present","Use! Don't use!",null,"no utilices","no utilicéis",null,"no utilice","no utilicen","utilizando","using","utilizado","used"]
["utilizar","to use, utilize","Indicativo","Indicative","Presente","Present","I use, am using","utilizo","utilizas","utiliza","utilizamos","utilizáis","utilizan","utilizando","using","utilizado","used"]
["utilizar","to use, utilize","Indicativo","Indicative","Futuro","Future","I will use","utilizaré","utilizarás","utilizará","utilizaremos","utilizaréis","utilizarán","utilizando","using","utilizado","used"]
["utilizar","to use, utilize","Indicativo","Indicative","Imperfecto","Imperfect","I was using, used to use, used","utilizaba","utilizabas","utilizaba","utilizábamos","utilizabais","utilizaban","utilizando","using","utilizado","used"]
["utilizar","to use, utilize","Indicativo","Indicative","Pretérito","Preterite","I used","utilicé","utilizaste","utilizó","utilizamos","utilizasteis","utilizaron","utilizando","using","utilizado","used"]
["utilizar","to use, utilize","Indicativo","Indicative","Condicional","Conditional","I would use","utilizaría","utilizarías","utilizaría","utilizaríamos","utilizaríais","utilizarían","utilizando","using","utilizado","used"]
["utilizar","to use, utilize","Indicativo","Indicative","Presente perfecto","Present Perfect","I have used","he utilizado","has utilizado","ha utilizado","hemos utilizado","habéis utilizado","han utilizado","utilizando","using","utilizado","used"]
["utilizar","to use, utilize","Indicativo","Indicative","Futuro perfecto","Future Perfect","I will have used","habré utilizado","habrás utilizado","habrá utilizado","habremos utilizado","habréis utilizado","habrán utilizado","utilizando","using","utilizado","used"]
["utilizar","to use, utilize","Indicativo","Indicative","Pluscuamperfecto","Past Perfect","I had used","había utilizado","habías utilizado","había utilizado","habíamos utilizado","habíais utilizado","habían utilizado","utilizando","using","utilizado","used"]
["utilizar","to use, utilize","Indicativo","Indicative","Pretérito anterior","Preterite (Archaic)","I had used","hube utilizado","hubiste utilizado","hubo utilizado","hubimos utilizado","hubisteis utilizado","hubieron utilizado","utilizando","using","utilizado","used"]
["utilizar","to use, utilize","Indicativo","Indicative","Condicional perfecto","Conditional Perfect","I would have used","habría utilizado","habrías utilizado","habría utilizado","habríamos utilizado","habríais utilizado","habrían utilizado","utilizando","using","utilizado","used"]
["utilizar","to use, utilize","Subjuntivo","Subjunctive","Presente","Present","I use, am using","utilice","utilices","utilice","utilicemos","utilicéis","utilicen","utilizando","using","utilizado","used"]
["utilizar","to use, utilize","Subjuntivo","Subjunctive","Imperfecto","Imperfect","I used, was using","utilizara","utilizaras","utilizara","utilizáramos","utilizarais","utilizaran","utilizando","using","utilizado","used"]
["utilizar","to use, utilize","Subjuntivo","Subjunctive","Futuro","Future","I will use","utilizare","utilizares","utilizare","utilizáremos","utilizareis","utilizaren","utilizando","using","utilizado","used"]
["utilizar","to use, utilize","Subjuntivo","Subjunctive","Presente perfecto","Present Perfect","I have used, used","haya utilizado","hayas utilizado","haya utilizado","hayamos utilizado","hayáis utilizado","hayan utilizado","utilizando","using","utilizado","used"]
["utilizar","to use, utilize","Subjuntivo","Subjunctive","Futuro perfecto","Future Perfect","I will have used","hubiere utilizado","hubieres utilizado","hubiere utilizado","hubiéremos utilizado","hubiereis utilizado","hubieren utilizado","utilizando","using","utilizado","used"]
["utilizar","to use, utilize","Subjuntivo","Subjunctive","Pluscuamperfecto","Past Perfect","I had used","hubiera utilizado","hubieras utilizado","hubiera utilizado","hubiéramos utilizado","hubierais utilizado","hubieran utilizado","utilizando","using","utilizado","used"]
["valer","to be worth","Imperativo Afirmativo","Imperative Affirmative","Presente","Present","Be worth! Don't be worth!",null,"vale","valed",null,"valga","valgan","valiendo","being worth","valido","been worth"]
["valer","to be worth","Imperativo Negativo","Imperative Negative","Presente","Present","Be worth! Don't be worth!",null,"no valgas","no valgáis",null,"no valga","no valgan","valiendo","being worth","valido","been worth"]
["valer","to be worth","Indicativo","Indicative","Presente","Present","I am worth","valgo","vales","vale","valemos","valéis","valen","valiendo","being worth","valido","been worth"]
["valer","to be worth","Indicativo","Indicative","Futuro","Future","I will be worth","valdré","valdrás","valdrá","valdremos","valdréis","valdrán","valiendo","being worth","valido","been worth"]
["valer","to be worth","Indicativo","Indicative","Imperfecto","Imperfect","I used to be worth, was worth","valía","valías","valía","valíamos","valíais","valían","valiendo","being worth","valido","been worth"]
["valer","to be worth","Indicativo","Indicative","Pretérito","Preterite","I was worth","valí","valiste","valió","valimos","valisteis","valieron","valiendo","being worth","valido","been worth"]
["valer","to be worth","Indicativo","Indicative","Condicional","Conditional","I would be worth","valdría","valdrías","valdría","valdríamos","valdríais","valdrían","valiendo","being worth","valido","been worth"]
["valer","to be worth","Indicativo","Indicative","Presente perfecto","Present Perfect","I have been worth","he valido","has valido","ha valido","hemos valido","habéis valido","han valido","valiendo","being worth","valido","been worth"]
["valer","to be worth","Indicativo","Indicative","Futuro perfecto","Future Perfect","I will have been worth","habré valido","habrás valido","habrá valido","habremos valido","habréis valido","habrán valido","valiendo","being worth","valido","been worth"]
["valer","to be worth","Indicativo","Indicative","Pluscuamperfecto","Past Perfect","I had been worth","había valido","habías valido","había valido","habíamos valido","habíais valido","habían valido","valiendo","being worth","valido","been worth"]
["valer","to be worth","Indicativo","Indicative","Pretérito anterior","Preterite (Archaic)","I had been worth","hube valido","hubiste valido","hubo valido","hubimos valido","hubisteis valido","hubieron valido","valiendo","being worth","valido","been worth"]
["valer","to be worth","Indicativo","Indicative","Condicional perfecto","Conditional Perfect","I would have been worth","habría valido","habrías valido","habría valido","habríamos valido","habríais valido","habrían valido","valiendo","being worth","valido","been worth"]
["valer","to be worth","Subjuntivo","Subjunctive","Presente","Present","I am worth","valga","valgas","valga","valgamos","valgáis","valgan","valiendo","being worth","valido","been worth"]
["valer","to be worth","Subjuntivo","Subjunctive","Imperfecto","Imperfect","I was worth","valiera","valieras","valiera","valiéramos","valierais","valieran","valiendo","being worth","valido","been worth"]
["valer","to be worth","Subjuntivo","Subjunctive","Futuro","Future","I will be worth","valiere","valieres","valiere","valiéremos","valiereis","valieren","valiendo","being worth","valido","been worth"]
["valer","to be worth","Subjuntivo","Subjunctive","Presente perfecto","Present Perfect","I have been worth, was worth","haya valido","hayas valido","haya valido","hayamos valido","hayáis valido","hayan valido","valiendo","being worth","valido","been worth"]
["valer","to be worth","Subjuntivo","Subjunctive","Futuro perfecto","Future Perfect","I will have been worth","hubiere valido","hubieres valido","hubiere valido","hubiéremos valido","hubiereis valido","hubieren valido","valiendo","being worth","valido","been worth"]
["valer","to be worth","Subjuntivo","Subjunctive","Pluscuamperfecto","Past Perfect","I had been worth","hubiera valido","hubieras valido","hubiera valido","hubiéramos valido","hubierais valido","hubieran valido","valiendo","being worth","valido","been worth"]
["vender","to sell","Imperativo Afirmativo","Imperative Affirmative","Presente","Present","Sell! Don't sell!",null,"vende","vended",null,"venda","vendan","vendiendo","selling","vendido","sold"]
["vender","to sell","Imperativo Negativo","Imperative Negative","Presente","Present","Sell! Don't sell!",null,"no vendas","no vendáis",null,"no venda","no vendan","vendiendo","selling","vendido","sold"]
["vender","to sell","Indicativo","Indicative","Presente","Present","I sell, am selling","vendo","vendes","vende","vendemos","vendéis","venden","vendiendo","selling","vendido","sold"]
["vender","to sell","Indicativo","Indicative","Futuro","Future","I will sell","venderé","venderás","venderá","venderemos","venderéis","venderán","vendiendo","selling","vendido","sold"]
["vender","to sell","Indicativo","Indicative","Imperfecto","Imperfect","I was selling, used to sell, sold","vendía","vendías","vendía","vendíamos","vendíais","vendían","vendiendo","selling","vendido","sold"]
["vender","to sell","Indicativo","Indicative","Pretérito","Preterite","I sold","vendí","vendiste","vendió","vendimos","vendisteis","vendieron","vendiendo","selling","vendido","sold"]
["vender","to sell","Indicativo","Indicative","Condicional","Conditional","I would sell","vendería","venderías","vendería","venderíamos","venderíais","venderían","vendiendo","selling","vendido","sold"]
["vender","to sell","Indicativo","Indicative","Presente perfecto","Present Perfect","I have sold","he vendido","has vendido","ha vendido","hemos vendido","habéis vendido","han vendido","vendiendo","selling","vendido","sold"]
["vender","to sell","Indicativo","Indicative","Futuro perfecto","Future Perfect","I will have sold","habré vendido","habrás vendido","habrá vendido","habremos vendido","habréis vendido","habrán vendido","vendiendo","selling","vendido","sold"]
["vender","to sell","Indicativo","Indicative","Pluscuamperfecto","Past Perfect","I had sold","había vendido","habías vendido","había vendido","habíamos vendido","habíais vendido","habían vendido","vendiendo","selling","vendido","sold"]
["vender","to sell","Indicativo","Indicative","Pretérito anterior","Preterite (Archaic)","I had sold","hube vendido","hubiste vendido","hubo vendido","hubimos vendido","hubisteis vendido","hubieron vendido","vendiendo","selling","vendido","sold"]
["vender","to sell","Indicativo","Indicative","Condicional perfecto","Conditional Perfect","I would have sold","habría vendido","habrías vendido","habría vendido","habríamos vendido","habríais vendido","habrían vendido","vendiendo","selling","vendido","sold"]
["vender","to sell","Subjuntivo","Subjunctive","Presente","Present","I sell, am selling","venda","vendas","venda","vendamos","vendáis","vendan","vendiendo","selling","vendido","sold"]
["vender","to sell","Subjuntivo","Subjunctive","Imperfecto","Imperfect","I sold, was selling","vendiera","vendieras","vendiera","vendiéramos","vendierais","vendieran","vendiendo","selling","vendido","sold"]
["vender","to sell","Subjuntivo","Subjunctive","Futuro","Future","I will sell","vendiere","vendieres","vendiere","vendiéremos","vendiereis","vendieren","vendiendo","selling","vendido","sold"]
["vender","to sell","Subjuntivo","Subjunctive","Presente perfecto","Present Perfect","I have sold, sold","haya vendido","hayas vendido","haya vendido","hayamos vendido","hayáis vendido","hayan vendido","vendiendo","selling","vendido","sold"]
["vender","to sell","Subjuntivo","Subjunctive","Futuro perfecto","Future Perfect","I will have sold","hubiere vendido","hubieres vendido","hubiere vendido","hubiéremos vendido","hubiereis vendido","hubieren vendido","vendiendo","selling","vendido","sold"]
["vender","to sell","Subjuntivo","Subjunctive","Pluscuamperfecto","Past Perfect","I had sold","hubiera vendido","hubieras vendido","hubiera vendido","hubiéramos vendido","hubierais vendido","hubieran vendido","vendiendo","selling","vendido","sold"]
["venir","to come","Imperativo Afirmativo","Imperative Affirmative","Presente","Present","Come! Don't come!",null,"ven","venid",null,"venga","vengan","viniendo","coming","venido","come"]
["venir","to come","Imperativo Negativo","Imperative Negative","Presente","Present","Come! Don't come!",null,"no vengas","no vengáis",null,"no venga","no vengan","viniendo","coming","venido","come"]
["venir","to come","Indicativo","Indicative","Presente","Present","I come, am coming","vengo","vienes","viene","venimos","venís","vienen","viniendo","coming","venido","come"]
["venir","to come","Indicativo","Indicative","Futuro","Future","I will come","vendré","vendrás","vendrá","vendremos","vendréis","vendrán","viniendo","coming","venido","come"]
["venir","to come","Indicativo","Indicative","Imperfecto","Imperfect","I was coming, used to come, came","venía","venías","venía","veníamos","veníais","venían","viniendo","coming","venido","come"]
["venir","to come","Indicativo","Indicative","Pretérito","Preterite","I came","vine","viniste","vino","vinimos","vinisteis","vinieron","viniendo","coming","venido","come"]
["venir","to come","Indicativo","Indicative","Condicional","Conditional","I would come","vendría","vendrías","vendría","vendríamos","vendríais","vendrían","viniendo","coming","venido","come"]
["venir","to come","Indicativo","Indicative","Presente perfecto","Present Perfect","I have come","he venido","has venido","ha venido","hemos venido","habéis venido","han venido","viniendo","coming","venido","come"]
["venir","to come","Indicativo","Indicative","Futuro perfecto","Future Perfect","I will have come","habré venido","habrás venido","habrá venido","habremos venido","habréis venido","habrán venido","viniendo","coming","venido","come"]
["venir","to come","Indicativo","Indicative","Pluscuamperfecto","Past Perfect","I had come","había venido","habías venido","había venido","habíamos venido","habíais venido","habían venido","viniendo","coming","venido","come"]
["venir","to come","Indicativo","Indicative","Pretérito anterior","Preterite (Archaic)","I had come","hube venido","hubiste venido","hubo venido","hubimos venido","hubisteis venido","hubieron venido","viniendo","coming","venido","come"]
["venir","to come","Indicativo","Indicative","Condicional perfecto","Conditional Perfect","I would have come","habría venido","habrías venido","habría venido","habríamos venido","habríais venido","habrían venido","viniendo","coming","venido","come"]
["venir","to come","Subjuntivo","Subjunctive","Presente","Present","I come, am coming","venga","vengas","venga","vengamos","vengáis","vengan","viniendo","coming","venido","come"]
["venir","to come","Subjuntivo","Subjunctive","Imperfecto","Imperfect","I came, was coming","viniera","vinieras","viniera","viniéramos","vinierais","vinieran","viniendo","coming","venido","come"]
["venir","to come","Subjuntivo","Subjunctive","Futuro","Future","I will come","viniere","vinieres","viniere","viniéremos","viniereis","vinieren","viniendo","coming","venido","come"]
["venir","to come","Subjuntivo","Subjunctive","Presente perfecto","Present Perfect","I have come, came","haya venido","hayas venido","haya venido","hayamos venido","hayáis venido","hayan venido","viniendo","coming","venido","come"]
["venir","to come","Subjuntivo","Subjunctive","Futuro perfecto","Future Perfect","I will have come","hubiere venido","hubieres venido","hubiere venido","hubiéremos venido","hubiereis venido","hubieren venido","viniendo","coming","venido","come"]
["venir","to come","Subjuntivo","Subjunctive","Pluscuamperfecto","Past Perfect","I had come","hubiera venido","hubieras venido","hubiera venido","hubiéramos venido","hubierais venido","hubieran venido","viniendo","coming","venido","come"]
["ver","to see","Imperativo Afirmativo","Imperative Affirmative","Presente","Present","See! Don't see!",null,"ve","ved",null,"vea","vean","viendo","seeing","visto","seen"]
["ver","to see","Imperativo Negativo","Imperative Negative","Presente","Present","See! Don't see!",null,"no veas","no veáis",null,"no vea","no vean","viendo","seeing","visto","seen"]
["ver","to see","Indicativo","Indicative","Presente","Present","I see, am seeing","veo","ves","ve","vemos","veis","ven","viendo","seeing","visto","seen"]
["ver","to see","Indicativo","Indicative","Futuro","Future","I will see","veré","verás","verá","veremos","veréis","verán","viendo","seeing","visto","seen"]
["ver","to see","Indicativo","Indicative","Imperfecto","Imperfect","I was seeing, used to see, saw","veía","veías","veía","veíamos","veíais","veían","viendo","seeing","visto","seen"]
["ver","to see","Indicativo","Indicative","Pretérito","Preterite","I saw","vi","viste","vio","vimos","visteis","vieron","viendo","seeing","visto","seen"]
["ver","to see","Indicativo","Indicative","Condicional","Conditional","I would see","vería","verías","vería","veríamos","veríais","verían","viendo","seeing","visto","seen"]
["ver","to see","Indicativo","Indicative","Presente perfecto","Present Perfect","I have seen","he visto","has visto","ha visto","hemos visto","habéis visto","han visto","viendo","seeing","visto","seen"]
["ver","to see","Indicativo","Indicative","Futuro perfecto","Future Perfect","I will have seen","habré visto","habrás visto","habrá visto","habremos visto","habréis visto","habrán visto","viendo","seeing","visto","seen"]
["ver","to see","Indicativo","Indicative","Pluscuamperfecto","Past Perfect","I had seen","había visto","habías visto","había visto","habíamos visto","habíais visto","habían visto","viendo","seeing","visto","seen"]
["ver","to see","Indicativo","Indicative","Pretérito anterior","Preterite (Archaic)","I had seen","hube visto","hubiste visto","hubo visto","hubimos visto","hubisteis visto","hubieron visto","viendo","seeing","visto","seen"]
["ver","to see","Indicativo","Indicative","Condicional perfecto","Conditional Perfect","I would have seen","habría visto","habrías visto","habría visto","habríamos visto","habríais visto","habrían visto","viendo","seeing","visto","seen"]
["ver","to see","Subjuntivo","Subjunctive","Presente","Present","I see, am seeing","vea","veas","vea","veamos","veáis","vean","viendo","seeing","visto","seen"]
["ver","to see","Subjuntivo","Subjunctive","Imperfecto","Imperfect","I saw, was seeing","viera","vieras","viera","viéramos","vierais","vieran","viendo","seeing","visto","seen"]
["ver","to see","Subjuntivo","Subjunctive","Futuro","Future","I will see","viere","vieres","viere","viéremos","viereis","vieren","viendo","seeing","visto","seen"]
["ver","to see","Subjuntivo","Subjunctive","Presente perfecto","Present Perfect","I have seen, saw","haya visto","hayas visto","haya visto","hayamos visto","hayáis visto","hayan visto","viendo","seeing","visto","seen"]
["ver","to see","Subjuntivo","Subjunctive","Futuro perfecto","Future Perfect","I will have seen","hubiere visto","hubieres visto","hubiere visto","hubiéremos visto","hubiereis visto","hubieren visto","viendo","seeing","visto","seen"]
["ver","to see","Subjuntivo","Subjunctive","Pluscuamperfecto","Past Perfect","I had seen","hubiera visto","hubieras visto","hubiera visto","hubiéramos visto","hubierais visto","hubieran visto","viendo","seeing","visto","seen"]
["viajar","to travel, journey","Imperativo Afirmativo","Imperative Affirmative","Presente","Present","Travel! Don't travel!",null,"viaja","viajad",null,"viaje","viajen","viajando","traveling","viajado","traveled"]
["viajar","to travel, journey","Imperativo Negativo","Imperative Negative","Presente","Present","Travel! Don't travel!",null,"no viajes","no viajéis",null,"no viaje","no viajen","viajando","traveling","viajado","traveled"]
["viajar","to travel, journey","Indicativo","Indicative","Presente","Present","I travel, am traveling","viajo","viajas","viaja","viajamos","viajáis","viajan","viajando","traveling","viajado","traveled"]
["viajar","to travel, journey","Indicativo","Indicative","Futuro","Future","I will travel","viajaré","viajarás","viajará","viajaremos","viajaréis","viajarán","viajando","traveling","viajado","traveled"]
["viajar","to travel, journey","Indicativo","Indicative","Imperfecto","Imperfect","I was traveling, used to travel, traveled","viajaba","viajabas","viajaba","viajábamos","viajabais","viajaban","viajando","traveling","viajado","traveled"]
["viajar","to travel, journey","Indicativo","Indicative","Pretérito","Preterite","I traveled","viajé","viajaste","viajó","viajamos","viajasteis","viajaron","viajando","traveling","viajado","traveled"]
["viajar","to travel, journey","Indicativo","Indicative","Condicional","Conditional","I would travel","viajaría","viajarías","viajaría","viajaríamos","viajaríais","viajarían","viajando","traveling","viajado","traveled"]
["viajar","to travel, journey","Indicativo","Indicative","Presente perfecto","Present Perfect","I have traveled","he viajado","has viajado","ha viajado","hemos viajado","habéis viajado","han viajado","viajando","traveling","viajado","traveled"]
["viajar","to travel, journey","Indicativo","Indicative","Futuro perfecto","Future Perfect","I will have traveled","habré viajado","habrás viajado","habrá viajado","habremos viajado","habréis viajado","habrán viajado","viajando","traveling","viajado","traveled"]
["viajar","to travel, journey","Indicativo","Indicative","Pluscuamperfecto","Past Perfect","I had traveled","había viajado","habías viajado","había viajado","habíamos viajado","habíais viajado","habían viajado","viajando","traveling","viajado","traveled"]
["viajar","to travel, journey","Indicativo","Indicative","Pretérito anterior","Preterite (Archaic)","I had traveled","hube viajado","hubiste viajado","hubo viajado","hubimos viajado","hubisteis viajado","hubieron viajado","viajando","traveling","viajado","traveled"]
["viajar","to travel, journey","Indicativo","Indicative","Condicional perfecto","Conditional Perfect","I would have traveled","habría viajado","habrías viajado","habría viajado","habríamos viajado","habríais viajado","habrían viajado","viajando","traveling","viajado","traveled"]
["viajar","to travel, journey","Subjuntivo","Subjunctive","Presente","Present","I travel, am traveling","viaje","viajes","viaje","viajemos","viajéis","viajen","viajando","traveling","viajado","traveled"]
["viajar","to travel, journey","Subjuntivo","Subjunctive","Imperfecto","Imperfect","I traveled, was traveling","viajara","viajaras","viajara","viajáramos","viajarais","viajaran","viajando","traveling","viajado","traveled"]
["viajar","to travel, journey","Subjuntivo","Subjunctive","Futuro","Future","I will travel","viajare","viajares","viajare","viajáremos","viajareis","viajaren","viajando","traveling","viajado","traveled"]
["viajar","to travel, journey","Subjuntivo","Subjunctive","Presente perfecto","Present Perfect","I have traveled, traveled","haya viajado","hayas viajado","haya viajado","hayamos viajado","hayáis viajado","hayan viajado","viajando","traveling","viajado","traveled"]
["viajar","to travel, journey","Subjuntivo","Subjunctive","Futuro perfecto","Future Perfect","I will have traveled","hubiere viajado","hubieres viajado","hubiere viajado","hubiéremos viajado","hubiereis viajado","hubieren viajado","viajando","traveling","viajado","traveled"]
["viajar","to travel, journey","Subjuntivo","Subjunctive","Pluscuamperfecto","Past Perfect","I had traveled","hubiera viajado","hubieras viajado","hubiera viajado","hubiéramos viajado","hubierais viajado","hubieran viajado","viajando","traveling","viajado","traveled"]
["visitar","to visit","Imperativo Afirmativo","Imperative Affirmative","Presente","Present","Visit! Don't visit!",null,"visita","visitad",null,"visite","visiten","visitando","visiting","visitado","visited"]
["visitar","to visit","Imperativo Negativo","Imperative Negative","Presente","Present","Visit! Don't visit!",null,"no visites","no visitéis",null,"no visite","no visiten","visitando","visiting","visitado","visited"]
["visitar","to visit","Indicativo","Indicative","Presente","Present","I visit, am visiting","visito","visitas","visita","visitamos","visitáis","visitan","visitando","visiting","visitado","visited"]
["visitar","to visit","Indicativo","Indicative","Futuro","Future","I will visit","visitaré","visitarás","visitará","visitaremos","visitaréis","visitarán","visitando","visiting","visitado","visited"]
["visitar","to visit","Indicativo","Indicative","Imperfecto","Imperfect","I was visiting, used to visit, visited","visitaba","visitabas","visitaba","visitábamos","visitabais","visitaban","visitando","visiting","visitado","visited"]
["visitar","to visit","Indicativo","Indicative","Pretérito","Preterite","I visited","visité","visitaste","visitó","visitamos","visitasteis","visitaron","visitando","visiting","visitado","visited"]
["visitar","to visit","Indicativo","Indicative","Condicional","Conditional","I would visit","visitaría","visitarías","visitaría","visitaríamos","visitaríais","visitarían","visitando","visiting","visitado","visited"]
["visitar","to visit","Indicativo","Indicative","Presente perfecto","Present Perfect","I have visited","he visitado","has visitado","ha visitado","hemos visitado","habéis visitado","han visitado","visitando","visiting","visitado","visited"]
["visitar","to visit","Indicativo","Indicative","Futuro perfecto","Future Perfect","I will have visited","habré visitado","habrás visitado","habrá visitado","habremos visitado","habréis visitado","habrán visitado","visitando","visiting","visitado","visited"]
["visitar","to visit","Indicativo","Indicative","Pluscuamperfecto","Past Perfect","I had visited","había visitado","habías visitado","había visitado","habíamos visitado","habíais visitado","habían visitado","visitando","visiting","visitado","visited"]
["visitar","to visit","Indicativo","Indicative","Pretérito anterior","Preterite (Archaic)","I had visited","hube visitado","hubiste visitado","hubo visitado","hubimos visitado","hubisteis visitado","hubieron visitado","visitando","visiting","visitado","visited"]
["visitar","to visit","Indicativo","Indicative","Condicional perfecto","Conditional Perfect","I would have visited","habría visitado","habrías visitado","habría visitado","habríamos visitado","habríais visitado","habrían visitado","visitando","visiting","visitado","visited"]
["visitar","to visit","Subjuntivo","Subjunctive","Presente","Present","I visit, am visiting","visite","visites","visite","visitemos","visitéis","visiten","visitando","visiting","visitado","visited"]
["visitar","to visit","Subjuntivo","Subjunctive","Imperfecto","Imperfect","I visited, was visiting","visitara","visitaras","visitara","visitáramos","visitarais","visitaran","visitando","visiting","visitado","visited"]
["visitar","to visit","Subjuntivo","Subjunctive","Futuro","Future","I will visit","visitare","visitares","visitare","visitáremos","visitareis","visitaren","visitando","visiting","visitado","visited"]
["visitar","to visit","Subjuntivo","Subjunctive","Presente perfecto","Present Perfect","I have visited, visited","haya visitado","hayas visitado","haya visitado","hayamos visitado","hayáis visitado","hayan visitado","visitando","visiting","visitado","visited"]
["visitar","to visit","Subjuntivo","Subjunctive","Futuro perfecto","Future Perfect","I will have visited","hubiere visitado","hubieres visitado","hubiere visitado","hubiéremos visitado","hubiereis visitado","hubieren visitado","visitando","visiting","visitado","visited"]
["visitar","to visit","Subjuntivo","Subjunctive","Pluscuamperfecto","Past Perfect","I had visited","hubiera visitado","hubieras visitado","hubiera visitado","hubiéramos visitado","hubierais visitado","hubieran visitado","visitando","visiting","visitado","visited"]
["vivir","to live","Imperativo Afirmativo","Imperative Affirmative","Presente","Present","Live! Don't live!",null,"vive","vivid",null,"viva","vivan","viviendo","living","vivido","lived"]
["vivir","to live","Imperativo Negativo","Imperative Negative","Presente","Present","Live! Don't live!",null,"no vivas","no viváis",null,"no viva","no vivan","viviendo","living","vivido","lived"]
["vivir","to live","Indicativo","Indicative","Presente","Present","I live, am living","vivo","vives","vive","vivimos","vivís","viven","viviendo","living","vivido","lived"]
["vivir","to live","Indicativo","Indicative","Futuro","Future","I will live","viviré","vivirás","vivirá","viviremos","viviréis","vivirán","viviendo","living","vivido","lived"]
["vivir","to live","Indicativo","Indicative","Imperfecto","Imperfect","I was living, used to live, lived","vivía","vivías","vivía","vivíamos","vivíais","vivían","viviendo","living","vivido","lived"]
["vivir","to live","Indicativo","Indicative","Pretérito","Preterite","I lived","viví","viviste","vivió","vivimos","vivisteis","vivieron","viviendo","living","vivido","lived"]
["vivir","to live","Indicativo","Indicative","Condicional","Conditional","I would live","viviría","vivirías","viviría","viviríamos","viviríais","vivirían","viviendo","living","vivido","lived"]
["vivir","to live","Indicativo","Indicative","Presente perfecto","Present Perfect","I have lived","he vivido","has vivido","ha vivido","hemos vivido","habéis vivido","han vivido","viviendo","living","vivido","lived"]
["vivir","to live","Indicativo","Indicative","Futuro perfecto","Future Perfect","I will have lived","habré vivido","habrás vivido","habrá vivido","habremos vivido","habréis vivido","habrán vivido","viviendo","living","vivido","lived"]
["vivir","to live","Indicativo","Indicative","Pluscuamperfecto","Past Perfect","I had lived","había vivido","habías vivido","había vivido","habíamos vivido","habíais vivido","habían vivido","viviendo","living","vivido","lived"]
["vivir","to live","Indicativo","Indicative","Pretérito anterior","Preterite (Archaic)","I had lived","hube vivido","hubiste vivido","hubo vivido","hubimos vivido","hubisteis vivido","hubieron vivido","viviendo","living","vivido","lived"]
["vivir","to live","Indicativo","Indicative","Condicional perfecto","Conditional Perfect","I would have lived","habría vivido","habrías vivido","habría vivido","habríamos vivido","habríais vivido","habrían vivido","viviendo","living","vivido","lived"]
["vivir","to live","Subjuntivo","Subjunctive","Presente","Present","I live, am living","viva","vivas","viva","vivamos","viváis","vivan","viviendo","living","vivido","lived"]
["vivir","to live","Subjuntivo","Subjunctive","Imperfecto","Imperfect","I lived, was living","viviera","vivieras","viviera","viviéramos","vivierais","vivieran","viviendo","living","vivido","lived"]
["vivir","to live","Subjuntivo","Subjunctive","Futuro","Future","I will live","viviere","vivieres","viviere","viviéremos","viviereis","vivieren","viviendo","living","vivido","lived"]
["vivir","to live","Subjuntivo","Subjunctive","Presente perfecto","Present Perfect","I have lived, lived","haya vivido","hayas vivido","haya vivido","hayamos vivido","hayáis vivido","hayan vivido","viviendo","living","vivido","lived"]
["vivir","to live","Subjuntivo","Subjunctive","Futuro perfecto","Future Perfect","I will have lived","hubiere vivido","hubieres vivido","hubiere vivido","hubiéremos vivido","hubiereis vivido","hubieren vivido","viviendo","living","vivido","lived"]
["vivir","to live","Subjuntivo","Subjunctive","Pluscuamperfecto","Past Perfect","I had lived","hubiera vivido","hubieras vivido","hubiera vivido","hubiéramos vivido","hubierais vivido","hubieran vivido","viviendo","living","vivido","lived"]
["volver","to return, go back","Imperativo Afirmativo","Imperative Affirmative","Presente","Present","Return! Don't return!",null,"vuelve","volved",null,"vuelva","vuelvan","volviendo","returning","vuelto","returned"]
["volver","to return, go back","Imperativo Negativo","Imperative Negative","Presente","Present","Return! Don't return!",null,"no vuelvas","no volváis",null,"no vuelva","no vuelvan","volviendo","returning","vuelto","returned"]
["volver","to return, go back","Indicativo","Indicative","Presente","Present","I return, am returning","vuelvo","vuelves","vuelve","volvemos","volvéis","vuelven","volviendo","returning","vuelto","returned"]
["volver","to return, go back","Indicativo","Indicative","Futuro","Future","I will return","volveré","volverás","volverá","volveremos","volveréis","volverán","volviendo","returning","vuelto","returned"]
["volver","to return, go back","Indicativo","Indicative","Imperfecto","Imperfect","I was returning, used to return, returned","volvía","volvías","volvía","volvíamos","volvíais","volvían","volviendo","returning","vuelto","returned"]
["volver","to return, go back","Indicativo","Indicative","Pretérito","Preterite","I returned","volví","volviste","volvió","volvimos","volvisteis","volvieron","volviendo","returning","vuelto","returned"]
["volver","to return, go back","Indicativo","Indicative","Condicional","Conditional","I would return","volvería","volverías","volvería","volveríamos","volveríais","volverían","volviendo","returning","vuelto","returned"]
["volver","to return, go back","Indicativo","Indicative","Presente perfecto","Present Perfect","I have returned","he vuelto","has vuelto","ha vuelto","hemos vuelto","habéis vuelto","han vuelto","volviendo","returning","vuelto","returned"]
["volver","to return, go back","Indicativo","Indicative","Futuro perfecto","Future Perfect","I will have returned","habré vuelto","habrás vuelto","habrá vuelto","habremos vuelto","habréis vuelto","habrán vuelto","volviendo","returning","vuelto","returned"]
["volver","to return, go back","Indicativo","Indicative","Pluscuamperfecto","Past Perfect","I had returned","había vuelto","habías vuelto","había vuelto","habíamos vuelto","habíais vuelto","habían vuelto","volviendo","returning","vuelto","returned"]
["volver","to return, go back","Indicativo","Indicative","Pretérito anterior","Preterite (Archaic)","I had returned","hube vuelto","hubiste vuelto","hubo vuelto","hubimos vuelto","hubisteis vuelto","hubieron vuelto","volviendo","returning","vuelto","returned"]
["volver","to return, go back","Indicativo","Indicative","Condicional perfecto","Conditional Perfect","I would have returned","habría vuelto","habrías vuelto","habría vuelto","habríamos vuelto","habríais vuelto","habrían vuelto","volviendo","returning","vuelto","returned"]
["volver","to return, go back","Subjuntivo","Subjunctive","Presente","Present","I return, am returning","vuelva","vuelvas","vuelva","volvamos","volváis","vuelvan","volviendo","returning","vuelto","returned"]
["volver","to return, go back","Subjuntivo","Subjunctive","Imperfecto","Imperfect","I returned, was returning","volviera","volvieras","volviera","volviéramos","volvierais","volvieran","volviendo","returning","vuelto","returned"]
["volver","to return, go back","Subjuntivo","Subjunctive","Futuro","Future","I will return","volviere","volvieres","volviere","volviéremos","volviereis","volvieren","volviendo","returning","vuelto","returned"]
["volver","to return, go back","Subjuntivo","Subjunctive","Presente perfecto","Present Perfect","I have returned, returned","haya vuelto","hayas vuelto","haya vuelto","hayamos vuelto","hayáis vuelto","hayan vuelto","volviendo","returning","vuelto","returned"]
["volver","to return, go back","Subjuntivo","Subjunctive","Futuro perfecto","Future Perfect","I will have returned","hubiere vuelto","hubieres vuelto","hubiere vuelto","hubiéremos vuelto","hubiereis vuelto","hubieren vuelto","volviendo","returning","vuelto","returned"]
["volver","to return, go back","Subjuntivo","Subjunctive","Pluscuamperfecto","Past Perfect","I had returned","hubiera vuelto","hubieras vuelto","hubiera vuelto","hubiéramos vuelto","hubierais vuelto","hubieran vuelto","volviendo","returning","vuelto","returned"]

{"sheet":"Dropdowns","index":5,"n_rows":10,"n_cols":3,"rows_kept":10,"cut":false,"hidden":true,"merged":[]}
["Moods",null,"Tenses"]
["Indicative",null,"Present"]
["Subjunctive",null,"Preterite"]
["Imperative Affirmative",null,"Imperfect"]
["Imperative Negative",null,"Future"]
[null,null,"Conditional"]
[null,null,"Present Perfect"]
[null,null,"Future Perfect"]
[null,null,"Past Perfect"]
[null,null,"Conditional Perfect"]