{"text_format":"1","workbook":"xlsx","n_sheets":6,"sheets":["Lookup","Directions","Lists","working list","Database","Dropdowns"],"not_rendered":{"charts":0,"images":0,"macros":1,"external_links":0,"defined_names":0,"comments":0,"pivot_tables":0},"unopened":[],"bounds":{"document_bytes":16777216,"sheet_cells":100000,"rows_first":2000,"rows_last":500,"rows_between":2000,"halvings":0,"cell_chars":16384,"cell_head_chars":4096},"cells_cut":0,"cells_raw":0,"read":"whole","date_system":"1900"}

{"sheet":"Lookup","index":0,"n_rows":13,"n_cols":8,"rows_kept":13,"cut":false,"hidden":true,"merged":[[12,5,14,8],[1,6,1,7]]}
["Spanish Verb Conjugation Practice Tool"]
[null,"Infinitive","ser",null,null,"List to Use","Language Lords 50"]
[null,"Indicative","Present",null,null,"Use Top",200,"enter number between 1 and 200"]
[null,"Translation",null,null,null,{"$f":"IF(LEFT(G2,14)=\"Language Lords\",\"LL Descr:\",\"\")","v":"LL Descr:"},{"$f":"IF(LEFT(G2,14)=\"Language Lords\",VLOOKUP(C2,Lists!$F$3:$I$52,4,FALSE),\"\")","v":"Common Irregular"}]
[null,"Yo",null,null,null,"Verb No."]
[null,"Tú"]
[null,"Él/Ella/Usted"]
[null,"Nosotros"]
[null,"Ellos/Ustedes",null,null,null,"No. Correct:",0,"decir"]
[null,"Gerund",null,null,null,"No. Incorrect:",3]
[null,"Past Participle"]
[null,null,null,null,null,"References"]
[null,null,null,null,null,"https://www.ghidinelli.com/free-spanish-conjugated-verb-database\nLinguasorb top 250 verbs\nLanguage Lords YouTube video: https://www.youtube.com/watch?v=z8FACVD9vz4\n"]

{"sheet":"Directions","index":1,"n_rows":18,"n_cols":2,"rows_kept":18,"cut":false,"hidden":false,"merged":[[2,1,17,6]]}
[]
[null,"Directions"]
["•","The cells with borders are meant to be edited.\nSet your mood, tense, source list, and number of available verbs (if using Most Common Verbs list).\nNow push the \"Get Verb\" button to get a random verb to conjugate from your list.\nType your guesses/entries for the conjugations in the boxes. Accent marks will be ignored.\nFinally, click \"Check/Show Answers\" to see the answers and see how many you got right.\nIf you want to work through the list in order, type 1 into the Verb No. input, and then click \"Lookup From List\". After typing and checking the answers, use \"Get Next From List\".\nTip: to turn off autocomplete to make this sheet much nicer to use, click File, Excel Options, Advanced, and uncheck Enable Autocomplete for Cell Values.\nBonus: the macros are also mapped to shortcut keys. Ctrl+Shift+C will run \"Check/Show Answers.\" Ctrl+Shift+J will run \"Get Random Verb.\" Ctrl+Shift+N will run \"Get Next From List.\""]
["•"]
[]
["•"]
[]
["•"]
[]
["•"]
[]
["•"]
[]
[]
["•"]
[]
[]
["•"]

{"sheet":"Lists","index":2,"n_rows":202,"n_cols":16,"rows_kept":202,"cut":false,"hidden":true,"merged":[]}
["Top 250 verbs - Linguasorb",null,null,null,"LAB 50 Inspired by LL 50",null,"https://www.youtube.com/watch?v=z8FACVD9vz4",null,null,null,"LAB additions"]
["Number","Infinitive","Translation",null,"Number","Infinitive","Rank","Translation","Description",null,"Number","Infinitive","Rank","Translation"]
[1,"ser","to be (essential/permanent quality)",null,1,"pasar",{"$f":"INDEX($A$3:$A$202,MATCH(F3,$B$3:$B$202,0))","v":14},{"$f":"INDEX($C$3:$C$202,MATCH(F3,$B$3:$B$202,0))","v":"to pass, to spend (time), to happen"},"Regular-AR",null,1,"grabar",{"$f":"INDEX($A$3:$A$202,MATCH(L3,$B$3:$B$202,0))","v":{"$error":"#N/A"}},"to record"]
[2,"haber","to have (to do something, auxiliary verb)",null,2,"hablar",20,"to speak","Regular-AR",null,2,"llorar",{"$error":"#N/A"},"to cry/mourn"]
[3,"estar","to be (health, location, state)",null,3,"llevar",21,"to carry, bring","Regular-AR",null,3,"mandar",139,{"$f":"INDEX($C$3:$C$202,MATCH(L5,$B$3:$B$202,0))","v":"to order (give an order), to send"}]
[4,"tener","to have",null,4,"dejar",22,"to leave, abandon, to let, allow","Regular-AR",null,4,"acabar",67,{"$f":"INDEX($C$3:$C$202,MATCH(L6,$B$3:$B$202,0))","v":"to finish, end"}]
[5,"hacer","to do, make",null,5,"deber",15,"to owe, must, should, ought to","Regular-ER",null,5,"apagar",{"$error":"#N/A"},"to turn off"]
[6,"poder","to be able, can",null,6,"leer",60,"to read","Regular-ER",null,6,"poner",16,{"$f":"INDEX($C$3:$C$202,MATCH(L8,$B$3:$B$202,0))","v":"to put, place, set"}]
[7,"decir","to say, tell",null,7,"comer",103,"to eat","Regular-ER"]
[8,"ir","to go",null,8,"aprender",111,"to learn","Regular-ER"]
[9,"ver","to see",null,9,"vivir",32,"to live","Regular-IR",null,"Added to database",null,null,"Removed from top 250 since not in database"]
[10,"dar","to give",null,10,"escribir",42,"to write","Regular-IR",null,"haber",null,null,"existir",null,"removed to make even 200"]
[11,"saber","to know (information)",null,11,"permitir",51,"to permit, allow","Regular-IR",null,"cambiar",null,null,"considerar",null,"exponer"]
[12,"querer","to want, love",null,12,"abrir",65,"to open","Regular-IR",null,"pretender",null,null,"partir",null,"durar"]
[13,"llegar","to arrive, come, reach",null,13,"buscar",39,"to search for, look for","Irregular-AR",null,null,null,null,"referir",null,"permanecer"]
[14,"pasar","to pass, to spend (time), to happen",null,14,"llegar",13,"to arrive, come, reach","Irregular-AR",null,null,null,null,"imaginar",null,"asistir"]
[15,"deber","to owe, must, should, ought to",null,15,"alcanzar",83,"to reach, catch up","Irregular-AR",null,"removed verbs from database",null,null,"reunir",null,"organizar"]
[16,"poner","to put, place, set",null,16,"parecer",17,"to seem, appear","Irregular-ER",null,"   that werent on either list",null,null,"representar",null,"contener"]
[17,"parecer","to seem, appear",null,17,"conocer",31,"to know (people, places)","Irregular-ER",null,null,null,null,"asegurar",null,"informar"]
[18,"quedar","to stay, remain",null,18,"creer",19,"to believe","Irregular-ER",null,null,null,null,"corresponder",null,"enviar"]
[19,"creer","to believe",null,19,"producir",44,"to produce","Irregular-IR",null,null,null,null,"adquirir",null,"extender"]
[20,"hablar","to speak",null,20,"dirigir",85,"to direct","Irregular-IR",null,null,null,null,"aprovechar",null,"conducir"]
[21,"llevar","to carry, bring",null,21,"exigir",164,"to demand, require","Irregular-IR",null,null,null,null,"imponer",null,"firmar"]
[22,"dejar","to leave, abandon, to let, allow",null,22,"pensar",27,"to think","Stem Change-AR",null,null,null,null,"disponer",null,"respetar"]
[23,"seguir","to follow, continue",null,23,"empezar",37,"to begin, start","Stem Change-AR",null,null,null,null,"quitar",null,"advertir"]
[24,"encontrar","to find, encounter",null,24,"encontrar",24,"to find, encounter","Stem Change-AR",null,null,null,null,"tender",null,"cruzar"]
[25,"llamar","to call, to name",null,25,"recordar",49,"to remember, remind","Stem Change-AR",null,null,null,null,"comentar",null,"anunciar"]
[26,"venir","to come",null,26,"jugar",91,"to play (a game or sport)","Stem Change-AR",null,null,null,null,"impedir"]
[27,"pensar","to think",null,27,"querer",12,"to want, love","Stem Change-ER",null,null,null,null,"escapar"]
[28,"salir","to leave, go out",null,28,"perder",43,"to lose","Stem Change-ER",null,null,null,null,"preocupar"]
{"$rows_left_out":173}
{"sheet":"working list","index":3,"n_rows":202,"n_cols":20,"rows_kept":202,"cut":false,"hidden":true,"merged":[]}
["Top 250 verbs - Linguasorb",null,null,null,"Language Lords 50 and I added top 50 to list that werent in it",null,null,null,null,null,null,null,null,null,"Resulting List of 50"]
["Number","Infinitive","Translation",null,"Number","Infinitive","Rank","Translation","Description","Descr2","e to ie",null,null,null,"Number","Infinitive","Rank","Translation","Description","Descr2"]
[1,"ser","to be (essential/permanent quality)",{"$f":"IF(RIGHT(B3,2)=\"ir\",\"Y\",\"\")","v":""},1,"ser",{"$f":"INDEX($A$3:$A$202,MATCH(F3,$B$3:$B$202,0))","v":1},{"$f":"INDEX($C$3:$C$202,MATCH(F3,$B$3:$B$202,0))","v":"to be (essential/permanent quality)"},"Common Irregular",null,"o to ue",null,null,null,1,"pasar",{"$f":"INDEX($A$3:$A$202,MATCH(P3,$B$3:$B$202,0))","v":14},{"$f":"INDEX($C$3:$C$202,MATCH(P3,$B$3:$B$202,0))","v":"to pass, to spend (time), to happen"},"Regular-AR"]
[2,"haber","to have (to do something, auxiliary verb)",{"$f":"IF(RIGHT(B4,2)=\"ir\",\"Y\",\"\")","v":""},19,"haber",2,"to have (to do something, auxiliary verb)","Common Irregular",null,"e to i",null,null,null,2,"hablar",20,"to speak","Regular-AR"]
[3,"estar","to be (health, location, state)","",2,"estar",3,"to be (health, location, state)","Common Irregular",null,"u to ue",null,null,null,3,"llevar",21,"to carry, bring","Regular-AR"]
[4,"tener","to have","",3,"tener",4,"to have","Common Irregular",null,"I to ie",null,null,null,4,"dejar",22,"to leave, abandon, to let, allow","Regular-AR"]
[5,"hacer","to do, make","",4,"hacer",5,"to do, make","Common Irregular",null,null,null,null,null,5,"deber",15,"to owe, must, should, ought to","Regular-ER"]
[6,"poder","to be able, can","",51,"decir",7,"to say, tell","Common Irregular",null,null,null,null,null,6,"leer",60,"to read","Regular-ER"]
[7,"decir","to say, tell","Y",5,"ir",8,"to go","Common Irregular",null,null,null,null,null,7,"comer",103,"to eat","Regular-ER"]
[8,"ir","to go","Y",6,"ver",9,"to see","Common Irregular",null,null,null,null,null,8,"aprender",111,"to learn","Regular-ER"]
[9,"ver","to see","",8,"dar",10,"to give","Common Irregular",null,null,null,null,null,9,"vivir",32,"to live","Regular-IR"]
[10,"dar","to give","",9,"saber",11,"to know (information)","Common Irregular",null,null,null,null,null,10,"escribir",42,"to write","Regular-IR"]
[11,"saber","to know (information)","",10,"poner",16,"to put, place, set","Common Irregular",null,null,null,null,null,11,"permitir",51,"to permit, allow","Regular-IR"]
[12,"querer","to want, love","",17,"venir",26,"to come","Common Irregular",null,null,null,null,null,12,"abrir",65,"to open","Regular-IR"]
[13,"llegar","to arrive, come, reach","",20,"salir",28,"to leave, go out","Common Irregular",null,null,null,null,null,13,"buscar",39,"to search for, look for","Irregular-AR","c to que"]
[14,"pasar","to pass, to spend (time), to happen","",15,"caer",61,"to fall","Common Irregular",null,null,null,null,null,14,"llegar",13,"to arrive, come, reach","Irregular-AR","g to gu"]
[15,"deber","to owe, must, should, ought to","",16,"oír",66,"to hear","Common Irregular",null,"common irregular",14,"13-16",null,15,"alcanzar",83,"to reach, catch up","Irregular-AR","z to c"]
[16,"poner","to put, place, set","",18,"traer",71,"to bring, to get, fetch, to carry","Common Irregular",null,"regulars",12,null,null,16,"parecer",17,"to seem, appear","Irregular-ER","c to zc"]
[17,"parecer","to seem, appear","",68,"ocurrir",45,"to occur, happen","defective",null,"irregulars",9,null,null,17,"conocer",31,"to know (people, places)","Irregular-ER","c to zc"]
[18,"quedar","to stay, remain","",47,"doler",{"$error":"#N/A"},{"$error":"#N/A"},"defective",null,"stem changes",15,null,null,18,"creer",19,"to believe","Irregular-ER","y add"]
[19,"creer","to believe","",35,"buscar",39,"to search for, look for","Irregular-AR","c to que","total",{"$f":"SUM(L17:L20)","v":50},null,null,19,"producir",44,"to produce","Irregular-IR","c to j"]
[20,"hablar","to speak","",34,"llegar",13,"to arrive, come, reach","Irregular-AR","g to gu",null,null,null,null,20,"dirigir",85,"to direct","Irregular-IR","g to j"]
[21,"llevar","to carry, bring","",33,"alcanzar",83,"to reach, catch up","Irregular-AR","z to c",null,null,null,null,21,"exigir",164,"to demand, require","Irregular-IR","g to j"]
[22,"dejar","to leave, abandon, to let, allow","",36,"parecer",17,"to seem, appear","Irregular-ER","c to zc",null,null,null,null,22,"pensar",27,"to think","Stem Change-AR","e to ie"]
[23,"seguir","to follow, continue","Y",37,"conocer",31,"to know (people, places)","Irregular-ER","c to zc",null,null,null,null,23,"empezar",37,"to begin, start","Stem Change-AR","e to ie"]
[24,"encontrar","to find, encounter","",54,"creer",19,"to believe","Irregular-ER","y add",null,null,null,null,24,"encontrar",24,"to find, encounter","Stem Change-AR","o to ue"]
[25,"llamar","to call, to name","",67,"producir",44,"to produce","Irregular-IR","c to j",null,null,null,null,25,"recordar",49,"to remember, remind","Stem Change-AR","o to ue"]
[26,"venir","to come","Y",39,"dirigir",85,"to direct","Irregular-IR","g to j",null,null,null,null,26,"jugar",91,"to play (a game or sport)","Stem Change-AR","u to ue"]
[27,"pensar","to think","",40,"construir",136,"to build, construct","Irregular-IR",null,null,null,null,null,27,"querer",12,"to want, love","Stem Change-ER","e to ie"]
[28,"salir","to leave, go out","Y",41,"exigir",164,"to demand, require","Irregular-IR",null,null,null,null,null,28,"perder",43,"to lose","Stem Change-ER","e to ie"]
{"$rows_left_out":173}
{"sheet":"Database","index":4,"n_rows":3575,"n_cols":17,"rows_kept":3575,"cut":false,"hidden":true,"merged":[]}
["infinitive","infinitive_english","mood","mood_english","tense","tense_english","verb_english","form_1s","form_2s","form_3s","form_1p","form_2p","form_3p","gerund","gerund_english","pastparticiple","pastparticiple_english"]
["abandonar","to abandon, leave behind, desert; to quit, give up","Imperativo Afirmativo","Imperative Affirmative","Presente","Present","Abandon! Don't abandon!",null,"abandona","abandonad",null,"abandone","abandonen","abandonando","abandoning","abandonado","abandoned"]
["abandonar","to abandon, leave behind, desert; to quit, give up","Imperativo Negativo","Imperative Negative","Presente","Present","Abandon! Don't abandon!",null,"no abandones","no abandonéis",null,"no abandone","no abandonen","abandonando","abandoning","abandonado","abandoned"]
["abandonar","to abandon, leave behind, desert; to quit, give up","Indicativo","Indicative","Presente","Present","I abandon, am abandoning","abandono","abandonas","abandona","abandonamos","abandonáis","abandonan","abandonando","abandoning","abandonado","abandoned"]
["abandonar","to abandon, leave behind, desert; to quit, give up","Indicativo","Indicative","Futuro","Future","I will abandon","abandonaré","abandonarás","abandonará","abandonaremos","abandonaréis","abandonarán","abandonando","abandoning","abandonado","abandoned"]
["abandonar","to abandon, leave behind, desert; to quit, give up","Indicativo","Indicative","Imperfecto","Imperfect","I was abandoning, used to abandon, abandoned","abandonaba","abandonabas","abandonaba","abandonábamos","abandonabais","abandonaban","abandonando","abandoning","abandonado","abandoned"]
["abandonar","to abandon, leave behind, desert; to quit, give up","Indicativo","Indicative","Pretérito","Preterite","I abandoned","abandoné","abandonaste","abandonó","abandonamos","abandonasteis","abandonaron","abandonando","abandoning","abandonado","abandoned"]
["abandonar","to abandon, leave behind, desert; to quit, give up","Indicativo","Indicative","Condicional","Conditional","I would abandon","abandonaría","abandonarías","abandonaría","abandonaríamos","abandonaríais","abandonarían","abandonando","abandoning","abandonado","abandoned"]
["abandonar","to abandon, leave behind, desert; to quit, give up","Indicativo","Indicative","Presente perfecto","Present Perfect","I have abandoned","he abandonado","has abandonado","ha abandonado","hemos abandonado","habéis abandonado","han abandonado","abandonando","abandoning","abandonado","abandoned"]
["abandonar","to abandon, leave behind, desert; to quit, give up","Indicativo","Indicative","Futuro perfecto","Future Perfect","I will have abandoned","habré abandonado","habrás abandonado","habrá abandonado","habremos abandonado","habréis abandonado","habrán abandonado","abandonando","abandoning","abandonado","abandoned"]
["abandonar","to abandon, leave behind, desert; to quit, give up","Indicativo","Indicative","Pluscuamperfecto","Past Perfect","I had abandoned","había abandonado","habías abandonado","había abandonado","habíamos abandonado","habíais abandonado","habían abandonado","abandonando","abandoning","abandonado","abandoned"]
["abandonar","to abandon, leave behind, desert; to quit, give up","Indicativo","Indicative","Pretérito anterior","Preterite (Archaic)","I had abandoned","hube abandonado","hubiste abandonado","hubo abandonado","hubimos abandonado","hubisteis abandonado","hubieron abandonado","abandonando","abandoning","abandonado","abandoned"]
["abandonar","to abandon, leave behind, desert; to quit, give up","Indicativo","Indicative","Condicional perfecto","Conditional Perfect","I would have abandoned","habría abandonado","habrías abandonado","habría abandonado","habríamos abandonado","habríais abandonado","habrían abandonado","abandonando","abandoning","abandonado","abandoned"]
["abandonar","to abandon, leave behind, desert; to quit, give up","Subjuntivo","Subjunctive","Presente","Present","I abandon, am abandoning","abandone","abandones","abandone","abandonemos","abandonéis","abandonen","abandonando","abandoning","abandonado","abandoned"]
["abandonar","to abandon, leave behind, desert; to quit, give up","Subjuntivo","Subjunctive","Imperfecto","Imperfect","I abandoned, was abandoning","abandonara","abandonaras","abandonara","abandonáramos","abandonarais","abandonaran","abandonando","abandoning","abandonado","abandoned"]
["abandonar","to abandon, leave behind, desert; to quit, give up","Subjuntivo","Subjunctive","Futuro","Future","I will abandon","abandonare","abandonares","abandonare","abandonáremos","abandonareis","abandonaren","abandonando","abandoning","abandonado","abandoned"]
["abandonar","to abandon, leave behind, desert; to quit, give up","Subjuntivo","Subjunctive","Presente perfecto","Present Perfect","I have abandoned, abandoned","haya abandonado","hayas abandonado","haya abandonado","hayamos abandonado","hayáis abandonado","hayan abandonado","abandonando","abandoning","abandonado","abandoned"]
["abandonar","to abandon, leave behind, desert; to quit, give up","Subjuntivo","Subjunctive","Futuro perfecto","Future Perfect","I will have abandoned","hubiere abandonado","hubieres abandonado","hubiere abandonado","hubiéremos abandonado","hubiereis abandonado","hubieren abandonado","abandonando","abandoning","abandonado","abandoned"]
["abandonar","to abandon, leave behind, desert; to quit, give up","Subjuntivo","Subjunctive","Pluscuamperfecto","Past Perfect","I had abandoned","hubiera abandonado","hubieras abandonado","hubiera abandonado","hubiéramos abandonado","hubierais abandonado","hubieran abandonado","abandonando","abandoning","abandonado","abandoned"]
["abrir","to open","Imperativo Afirmativo","Imperative Affirmative","Presente","Present","Open! Don't open!",null,"abre","abrid",null,"abra","abran","abriendo","opening","abierto","opened"]
["abrir","to open","Imperativo Negativo","Imperative Negative","Presente","Present","Open! Don't open!",null,"no abras","no abráis",null,"no abra","no abran","abriendo","opening","abierto","opened"]
["abrir","to open","Indicativo","Indicative","Presente","Present","I open, am opening","abro","abres","abre","abrimos","abrís","abren","abriendo","opening","abierto","opened"]
["abrir","to open","Indicativo","Indicative","Futuro","Future","I will open","abriré","abrirás","abrirá","abriremos","abriréis","abrirán","abriendo","opening","abierto","opened"]
["abrir","to open","Indicativo","Indicative","Imperfecto","Imperfect","I was opening, used to open, opened","abría","abrías","abría","abríamos","abríais","abrían","abriendo","opening","abierto","opened"]
["abrir","to open","Indicativo","Indicative","Pretérito","Preterite","I opened","abrí","abriste","abrió","abrimos","abristeis","abrieron","abriendo","opening","abierto","opened"]
["abrir","to open","Indicativo","Indicative","Condicional","Conditional","I would open","abriría","abrirías","abriría","abriríamos","abriríais","abrirían","abriendo","opening","abierto","opened"]
["abrir","to open","Indicativo","Indicative","Presente perfecto","Present Perfect","I have opened","he abierto","has abierto","ha abierto","hemos abierto","habéis abierto","han abierto","abriendo","opening","abierto","opened"]
["abrir","to open","Indicativo","Indicative","Futuro perfecto","Future Perfect","I will have opened","habré abierto","habrás abierto","habrá abierto","habremos abierto","habréis abierto","habrán abierto","abriendo","opening","abierto","opened"]
["abrir","to open","Indicativo","Indicative","Pluscuamperfecto","Past Perfect","I had opened","había abierto","habías abierto","había abierto","habíamos abierto","habíais abierto","habían abierto","abriendo","opening","abierto","opened"]
["abrir","to open","Indicativo","Indicative","Pretérito anterior","Preterite (Archaic)","I had opened","hube abierto","hubiste abierto","hubo abierto","hubimos abierto","hubisteis abierto","hubieron abierto","abriendo","opening","abierto","opened"]
{"$rows_left_out":3546}
{"sheet":"Dropdowns","index":5,"n_rows":10,"n_cols":3,"rows_kept":10,"cut":false,"hidden":true,"merged":[]}
["Moods",null,"Tenses"]
["Indicative",null,"Present"]
["Subjunctive",null,"Preterite"]
["Imperative Affirmative",null,"Imperfect"]
["Imperative Negative",null,"Future"]
[null,null,"Conditional"]
[null,null,"Present Perfect"]
[null,null,"Future Perfect"]
[null,null,"Past Perfect"]
[null,null,"Conditional Perfect"]